[Neo-report] NEO tests [master:3236-ge76af29:py2.7:MySQL]: 464 Tests, 1 Failed

neo-report at nexedi.com neo-report at nexedi.com
Fri Jun 20 04:15:29 CEST 2014


Title                     : NEO tests [master:3236-ge76af29:py2.7:MySQL]
Date                      : 2014-06-20
Node                      : blade1
Machine                   : x86_64
System                    : Linux
Python                    : 2.7.2+

Directory                 : /tmp/neo_tests/1403230194.348037
Status                    : 98.707%
NEO_TESTS_ADAPTER         : MySQL
NEO_TEST_ZODB_FUNCTIONAL  : 1

                               NEO TESTS REPORT

              Test Module |  run  | unexpected | expected | skipped |  time    
--------------------------+-------+------------+----------+---------+----------
                ClientApp |   24  |       .    |      .   |     .   |   1.19s   
           ConnectionPool |    5  |       .    |      .   |     .   |   1.04s   
            MasterHandler |   12  |       .    |      .   |     .   |   0.10s   
           StorageHandler |   11  |       .    |      .   |     .   |   0.08s   
--------------------------+-------+------------+----------+---------+----------
         neo.tests.client |       |            |          |         |          
--------------------------+-------+------------+----------+---------+----------
                   Client |    9  |       .    |      .   |     .   |  18.36s   
                  Cluster |    7  |       .    |      .   |     .   |  20.56s   
                   Master |    4  |       .    |      .   |     .   |   8.09s   
                  Storage |   12  |       1    |      .   |     .   |  77.77s   
--------------------------+-------+------------+----------+---------+----------
     neo.tests.functional |       |            |          |         |          
--------------------------+-------+------------+----------+---------+----------
            ClientHandler |    6  |       .    |      .   |     .   |   0.06s   
          ElectionHandler |   16  |       .    |      .   |     .   |   0.13s   
                MasterApp |    2  |       .    |      .   |     .   |   0.02s   
                 MasterPT |    5  |       .    |      .   |     .   |   0.06s   
                 Recovery |    3  |       .    |      .   |     .   |   0.03s   
           StorageHandler |    8  |       .    |      .   |     .   |   0.13s   
             Transactions |    9  |       .    |      .   |     .   |   0.07s   
             Verification |    6  |       .    |      .   |     .   |   0.05s   
--------------------------+-------+------------+----------+---------+----------
         neo.tests.master |       |            |          |         |          
--------------------------+-------+------------+----------+---------+----------
            ClientHandler |   18  |       .    |      .   |     .   |   0.26s   
    IdentificationHandler |    3  |       .    |      .   |     .   |   0.04s   
    InitializationHandler |    2  |       .    |      .   |     .   |   0.03s   
            MasterHandler |    9  |       .    |      .   |     .   |   0.13s   
               StorageApp |    3  |       .    |      .   |     .   |   0.06s   
             StorageMySQL |   27  |       .    |      .   |     .   |   0.43s   
             Transactions |   18  |       .    |      .   |     .   |   0.14s   
      VerificationHandler |    8  |       .    |      .   |     .   |   0.13s   
--------------------------+-------+------------+----------+---------+----------
        neo.tests.storage |       |            |          |         |          
--------------------------+-------+------------+----------+---------+----------
                Bootstrap |    2  |       .    |      .   |     .   |   0.04s   
               Connection |   75  |       .    |      .   |     .   |   0.59s   
               Dispatcher |    5  |       .    |      .   |     .   |   0.04s   
                    Event |    1  |       .    |      .   |     .   |   0.01s   
                  Handler |    1  |       .    |      .   |     .   |   0.01s   
                    Nodes |   17  |       .    |      .   |     .   |   0.12s   
                       PT |   10  |       .    |      .   |     .   |   0.07s   
                     Util |    4  |       .    |      .   |     .   |   0.03s   
--------------------------+-------+------------+----------+---------+----------
                neo.tests |       |            |          |         |          
--------------------------+-------+------------+----------+---------+----------
                          |   22  |       .    |      2   |     .   |   7.19s   
              Replication |    6  |       .    |      .   |     .   |  14.62s   
--------------------------+-------+------------+----------+---------+----------
       neo.tests.threaded |       |            |          |         |          
--------------------------+-------+------------+----------+---------+----------
                    Basic |   16  |       .    |      .   |     .   |  29.46s   
                 Conflict |    5  |       .    |      .   |     .   |   9.13s   
                  History |    1  |       .    |      .   |     .   |   1.84s   
                 Iterator |    9  |       .    |      .   |     .   |  16.49s   
                       MT |    5  |       .    |      .   |     .   |  11.75s   
                     Pack |   14  |       .    |      2   |     .   |  29.15s   
               Persistent |    1  |       .    |      .   |     .   |   1.85s   
                 ReadOnly |    2  |       .    |      .   |     .   |   3.70s   
                 Revision |    7  |       .    |      .   |     .   |  14.64s   
          Synchronization |    7  |       .    |      .   |     .   |  12.67s   
                     Undo |   17  |       .    |      1   |     .   |  33.12s   
                     ZODB |   10  |       .    |      .   |     .   |  18.92s   
--------------------------+-------+------------+----------+---------+----------
           neo.tests.zodb |       |            |          |         |          
--------------------------+-------+------------+----------+---------+----------
                  Summary |  464  |       1    |      5   |     .   | 334.43s   
--------------------------+-------+------------+----------+---------+----------


======================================================================
ERROR: testReplicationWithNewStorage (neo.tests.functional.testStorage.StorageTests)
----------------------------------------------------------------------
Traceback (most recent call last):
  File "/home/neo/master/neoppod/neo/tests/functional/testStorage.py", line 138, in testReplicationWithNewStorage
    partitions=10)
  File "/home/neo/master/neoppod/neo/tests/functional/testStorage.py", line 61, in __setup
    self.neo.start(except_storages=stopped_processes)
  File "/home/neo/master/neoppod/neo/tests/functional/__init__.py", line 361, in start
    raise AssertionError('Timeout when starting cluster')
AssertionError: Timeout when starting cluster



More information about the Neo-report mailing list