[Erp5-report] ERP5 r33429: 3307 Tests, 82 Errors, 81 Failures, 20 Skips
nobody at svn.erp5.org
nobody at svn.erp5.org
Fri Mar 5 13:22:51 CET 2010
Test Suite: ERP5
Revision: 33429
Result: FAIL
All tests: 3307
Failures: 81
Errors: 82
Skips: 20
The following tests failed:
testApparelTransformation (1 errors)
test_01_getAggregatedAmountList (testApparelTransformation.TestApparelTransformation)
testBPMEvaluation (40 failures)
test_confirming (testBPMEvaluation.TestOrderDefaultProcess)
test_transition (testBPMEvaluation.TestOrderDefaultProcess)
test_transition_line_edit (testBPMEvaluation.TestOrderDefaultProcess)
test_transition_line_edit_add (testBPMEvaluation.TestOrderDefaultProcess)
test_transition_line_edit_add_many_transactions (testBPMEvaluation.TestOrderDefaultProcess)
test_transition_line_edit_add_same_resource (testBPMEvaluation.TestOrderDefaultProcess)
test_transition_line_edit_add_same_resource_edit_again (testBPMEvaluation.TestOrderDefaultProcess)
test_transition_split (testBPMEvaluation.TestOrderDefaultProcess)
test_transition_split_line_add (testBPMEvaluation.TestOrderDefaultProcess)
test_transition_split_line_add_split (testBPMEvaluation.TestOrderDefaultProcess)
test_starting (testBPMEvaluation.TestPackingListDefaultProcess)
test_transition (testBPMEvaluation.TestPackingListDefaultProcess)
test_transition_line_edit (testBPMEvaluation.TestPackingListDefaultProcess)
test_transition_line_edit_add (testBPMEvaluation.TestPackingListDefaultProcess)
test_transition_line_edit_add_many_transactions (testBPMEvaluation.TestPackingListDefaultProcess)
test_transition_line_edit_add_same_resource (testBPMEvaluation.TestPackingListDefaultProcess)
test_transition_line_edit_add_same_resource_edit_again (testBPMEvaluation.TestPackingListDefaultProcess)
test_transition_split (testBPMEvaluation.TestPackingListDefaultProcess)
test_transition_split_line_add (testBPMEvaluation.TestPackingListDefaultProcess)
test_transition_split_line_add_split (testBPMEvaluation.TestPackingListDefaultProcess)
test_confirming (testBPMEvaluation.TestOrderDifferentProcess)
test_transition (testBPMEvaluation.TestOrderDifferentProcess)
test_transition_line_edit (testBPMEvaluation.TestOrderDifferentProcess)
test_transition_line_edit_add (testBPMEvaluation.TestOrderDifferentProcess)
test_transition_line_edit_add_many_transactions (testBPMEvaluation.TestOrderDifferentProcess)
test_transition_line_edit_add_same_resource (testBPMEvaluation.TestOrderDifferentProcess)
test_transition_line_edit_add_same_resource_edit_again (testBPMEvaluation.TestOrderDifferentProcess)
test_transition_split (testBPMEvaluation.TestOrderDifferentProcess)
test_transition_split_line_add (testBPMEvaluation.TestOrderDifferentProcess)
test_transition_split_line_add_split (testBPMEvaluation.TestOrderDifferentProcess)
test_starting (testBPMEvaluation.TestPackingListDifferentProcess)
test_transition (testBPMEvaluation.TestPackingListDifferentProcess)
test_transition_line_edit (testBPMEvaluation.TestPackingListDifferentProcess)
test_transition_line_edit_add (testBPMEvaluation.TestPackingListDifferentProcess)
test_transition_line_edit_add_many_transactions (testBPMEvaluation.TestPackingListDifferentProcess)
test_transition_line_edit_add_same_resource (testBPMEvaluation.TestPackingListDifferentProcess)
test_transition_line_edit_add_same_resource_edit_again (testBPMEvaluation.TestPackingListDifferentProcess)
test_transition_split (testBPMEvaluation.TestPackingListDifferentProcess)
test_transition_split_line_add (testBPMEvaluation.TestPackingListDifferentProcess)
test_transition_split_line_add_split (testBPMEvaluation.TestPackingListDifferentProcess)
testBusinessTemplate (2 failures, 1 errors)
test_165_checkCopyBuildInstall (testBusinessTemplate.TestBusinessTemplate)
test_164_checkCopyBuild (testBusinessTemplate.TestBusinessTemplate)
test_167_InstanceAndRelatedClassDefinedInSameBT (testBusinessTemplate.TestBusinessTemplate)
testCRM (1 failures)
test_Base_getEntityListFromFromHeader (testCRM.TestCRMMailIngestion)
testConversionInSimulation (1 failures)
test_01_delivery_mode_on_sale_packing_list_and_invoice (testConversionInSimulation.TestConversionInSimulation)
testDms (1 errors)
test_addContributorToDocument (testDms.TestDocument)
testDmsWithFlare (1 errors)
test_addContributorToDocument (testDmsWithFlare.TestDocumentWithFlare)
testERP5Interfaces (20 errors)
test_Products.ERP5.AggregatedAmountList_AggregatedAmountList_implements_IAmountList (testERP5Interfaces.TestERP5Interfaces)
test_Products.ERP5Type.Document.BusinessPath_BusinessPath_implements_IBusinessPath (testERP5Interfaces.TestERP5Interfaces)
test_Products.ERP5Type.Document.BusinessPath_BusinessPath_implements_ICategoryAccessProvider (testERP5Interfaces.TestERP5Interfaces)
test_Products.ERP5Type.Document.Document_Document_implements_IDocument (testERP5Interfaces.TestERP5Interfaces)
test_Products.ERP5Type.Document.EmailDocument_EmailDocument_implements_IDocument (testERP5Interfaces.TestERP5Interfaces)
test_Products.ERP5Type.Document.Event_Event_implements_IDocument (testERP5Interfaces.TestERP5Interfaces)
test_Products.ERP5Type.Document.File_File_implements_IDocument (testERP5Interfaces.TestERP5Interfaces)
test_Products.ERP5Type.Document.Image_Image_implements_IDocument (testERP5Interfaces.TestERP5Interfaces)
test_Products.ERP5Type.Document.OOoDocument_OOoDocument_implements_IDocument (testERP5Interfaces.TestERP5Interfaces)
test_Products.ERP5Type.Document.TextDocument_TextDocument_implements_IDocument (testERP5Interfaces.TestERP5Interfaces)
test_Products.ERP5Type.Document.TradeCondition_TradeCondition_implements_IAmountGenerator (testERP5Interfaces.TestERP5Interfaces)
test_Products.ERP5Type.Document.TradeModelCell_TradeModelCell_implements_IAmountGenerator (testERP5Interfaces.TestERP5Interfaces)
test_Products.ERP5Type.Document.TradeModelCell_TradeModelCell_implements_IVariated (testERP5Interfaces.TestERP5Interfaces)
test_Products.ERP5Type.Document.TradeModelLine_TradeModelLine_implements_IAmountGenerator (testERP5Interfaces.TestERP5Interfaces)
test_Products.ERP5Type.Document.TradeModelLine_TradeModelLine_implements_IVariated (testERP5Interfaces.TestERP5Interfaces)
test_Products.ERP5Type.Document.TradeModelRule_TradeModelRule_implements_IRule (testERP5Interfaces.TestERP5Interfaces)
test_Products.ERP5Type.Document.TransformationRule_TransformationRule_implements_IRule (testERP5Interfaces.TestERP5Interfaces)
test_Products.ERP5Type.Document.Transformation_Transformation_implements_IAmountGenerator (testERP5Interfaces.TestERP5Interfaces)
test_Products.ERP5Type.Document.Transformation_Transformation_implements_IVariated (testERP5Interfaces.TestERP5Interfaces)
test_Products.ERP5Type.Document.TransformedResource_TransformedResource_implements_IVariated (testERP5Interfaces.TestERP5Interfaces)
testERP5Simulation (6 failures, 4 errors)
test_10_AcceptDecisionOnPackingList (testERP5Simulation.TestERP5SimulationInvoice)
test_11_AcceptDecisionOnPackingListAndInvoice (testERP5Simulation.TestERP5SimulationInvoice)
test_12_SplitPackingListAndAcceptInvoice (testERP5Simulation.TestERP5SimulationInvoice)
test_14_AcceptDecisionOnInvoice (testERP5Simulation.TestERP5SimulationInvoice)
test_05b_SimulationChangeQuantityForMergedLine (testERP5Simulation.TestERP5SimulationPackingList)
test_05c_SimulationChangeQuantityAndAcceptDecisionForMergedLine (testERP5Simulation.TestERP5SimulationPackingList)
test_05d_SimulationChangeResourceOnOneSimulationMovementForMergedLine (testERP5Simulation.TestERP5SimulationPackingList)
test_05f_SimulationChangeAndPartialAcceptDecision (testERP5Simulation.TestERP5SimulationPackingList)
test_delivery_mode_and_incoterm_on_invoice (testERP5Simulation.TestERP5SimulationInvoice)
test_modify_planned_order_invoicing_rule (testERP5Simulation.TestERP5SimulationInvoice)
testERP5SimulationBPMCore (15 errors)
testBPMCopyAndPaste (Products.ERP5.tests.testBPMCore.TestBPMImplementation)
test_BuinessPathDynamicCategoryAccessProvider (Products.ERP5.tests.testBPMCore.TestBPMImplementation)
test_BuinessPathDynamicCategoryAccessProviderBusinessPathPrecedence (Products.ERP5.tests.testBPMCore.TestBPMImplementation)
test_BuinessPathDynamicCategoryAccessProviderEmptyMovement (Products.ERP5.tests.testBPMCore.TestBPMImplementation)
test_BusinessPathStandardCategoryAccessProvider (Products.ERP5.tests.testBPMCore.TestBPMImplementation)
test_BusinessPath_calculateExpectedDate (Products.ERP5.tests.testBPMCore.TestBPMImplementation)
test_BusinessProcess_getPathValueList (Products.ERP5.tests.testBPMCore.TestBPMImplementation)
test_BusinessState_getRemainingTradePhaseList (Products.ERP5.tests.testBPMCore.TestBPMImplementation)
test_EmptyBusinessPathStandardCategoryAccessProvider (Products.ERP5.tests.testBPMCore.TestBPMImplementation)
test_isBuildable_OrderedDeliveredInvoiced (Products.ERP5.tests.testBPMCore.TestBPMisBuildableImplementation), Test isBuildable for ordered, delivered and invoiced sequence
test_isBuildable_OrderedInvoicedDelivered (Products.ERP5.tests.testBPMCore.TestBPMisBuildableImplementation), Test isBuildable for ordered, invoiced and delivered sequence
test_isCompleted_OrderedDeliveredInvoiced (Products.ERP5.tests.testBPMCore.TestBPMisCompletedImplementation), Test isCompleted for ordered, delivered and invoiced sequence
test_isCompleted_OrderedInvoicedDelivered (Products.ERP5.tests.testBPMCore.TestBPMisCompletedImplementation), Test isCompleted for ordered, invoiced and invoiced sequence
test_isFrozen_OrderedDeliveredInvoiced (Products.ERP5.tests.testBPMCore.TestBPMisFrozenImplementation), Test isFrozen for ordered, delivered and invoiced sequence
test_isFrozen_OrderedInvoicedDelivered (Products.ERP5.tests.testBPMCore.TestBPMisFrozenImplementation), Test isFrozen for ordered, invoiced and invoiced sequence
testERP5TypeInterfaces (1 errors)
test_Products.ERP5Type.ConsistencyMessage_ConsistencyMessage_implements_IConsistencyMessage (testERP5TypeInterfaces.TestERP5TypeInterfaces)
testFormPrintoutAsODT (1 failures, 1 skips)
test_02_Table_07_CellFormat (testFormPrintoutAsODT.TestFormPrintoutAsODT), 7. Normal case: make sure that it is enable to use ODF cell format setting in FormPrintout
testICal (1 failures)
test_01_renderEvent (testICal.TestICal)
testInvoice (2 failures, 1 errors)
test_10_AcceptDecisionOnPackingList (testInvoice.TestSaleInvoice)
test_delivery_mode_and_incoterm_on_invoice (testInvoice.TestSaleInvoice)
test_delivery_mode_and_incoterm_on_invoice (testInvoice.TestPurchaseInvoice)
testItem (2 errors)
test_01_ItemSimpleTest (testItem.TestItem)
test_02_ItemWithInvoice (testItem.TestItem)
testLegacyProductionOrder (11 errors)
test_01_testProductionSimulationExpand (testLegacyProductionOrder.TestProductionOrder)
test_02_testSourcingSimulationExpand (testLegacyProductionOrder.TestProductionOrder)
test_03_testIndustrialPhase (testLegacyProductionOrder.TestProductionOrder)
test_04_testProductionSimulationBuild (testLegacyProductionOrder.TestProductionOrder)
test_05_testSourcingSimulationBuild (testLegacyProductionOrder.TestProductionOrder)
test_06_testIndustrialPhase (testLegacyProductionOrder.TestProductionOrder)
test_07_testTransformationInteractionProductionOrderLine (testLegacyProductionOrder.TestProductionOrder)
test_08_testTransformationWithEfficiency (testLegacyProductionOrder.TestProductionOrder)
test_09_testTransformationWithVariation (testLegacyProductionOrder.TestProductionOrder)
test_50_testCopyPaste (testLegacyProductionOrder.TestProductionOrder)
test_51_testCutPasteInAnotherContainer (testLegacyProductionOrder.TestProductionOrder)
testLegacyProductionPackingList (1 errors)
test_01_sourcingDelivery (testLegacyProductionPackingList.TestProductionDelivery)
testMovementGroup (1 failures)
Make sure that _separate method works if argument is an empty list.
testNotificationMessageModule (4 failures)
test_safe_substitution_content (testNotificationMessageModule.TestNotificationMessageModule), Tests that 'safe' substitution is performed, unless safe_substitute is
test_substitution_content (testNotificationMessageModule.TestNotificationMessageModule), Tests that content and subject have string.Template based substitutions
test_substitution_content_and_convert (testNotificationMessageModule.TestNotificationMessageModule), Tests that substitution also works with different target format.
test_substitution_content_parameters (testNotificationMessageModule.TestNotificationMessageModule), Tests that we can pass parameters to convert to the substitution method,
testOpenOrder (2 failures)
testOpenOrderRule (testOpenOrder.TestOpenOrder)
testPeriodicityDateList (testOpenOrder.TestOpenOrder)
testPayroll (1 failures)
test_AccountingLineGeneration (testPayroll.TestPayroll)
testProductionOrder (11 errors)
test_01_testProductionSimulationExpand (testProductionOrder.TestProductionOrder)
test_02_testSourcingSimulationExpand (testProductionOrder.TestProductionOrder)
test_03_testIndustrialPhase (testProductionOrder.TestProductionOrder)
test_04_testProductionSimulationBuild (testProductionOrder.TestProductionOrder)
test_05_testSourcingSimulationBuild (testProductionOrder.TestProductionOrder)
test_06_testIndustrialPhase (testProductionOrder.TestProductionOrder)
test_07_testTransformationInteractionProductionOrderLine (testProductionOrder.TestProductionOrder)
test_08_testTransformationWithEfficiency (testProductionOrder.TestProductionOrder)
test_09_testTransformationWithVariation (testProductionOrder.TestProductionOrder)
test_50_testCopyPaste (testProductionOrder.TestProductionOrder)
test_51_testCutPasteInAnotherContainer (testProductionOrder.TestProductionOrder)
testProductionOrderApparel (9 errors)
test_01_testProductionSimulationExpand (testProductionOrderApparel.TestProductionOrderApparel)
test_02_testSourcingSimulationExpand (testProductionOrderApparel.TestProductionOrderApparel)
test_03_testIndustrialPhase (testProductionOrderApparel.TestProductionOrderApparel)
test_04_testProductionSimulationBuild (testProductionOrderApparel.TestProductionOrderApparel)
test_05_testSourcingSimulationBuild (testProductionOrderApparel.TestProductionOrderApparel)
test_06_testIndustrialPhase (testProductionOrderApparel.TestProductionOrderApparel)
test_07_testTransformationInteractionProductionOrderLine (testProductionOrderApparel.TestProductionOrderApparel)
test_50_testCopyPaste (testProductionOrderApparel.TestProductionOrderApparel)
test_51_testCutPasteInAnotherContainer (testProductionOrderApparel.TestProductionOrderApparel)
testProductionPackingList (1 errors)
test_01_sourcingDelivery (testProductionPackingList.TestProductionDelivery)
testProductionPackingListApparel (1 errors)
test_01_sourcingDelivery (testProductionPackingListApparel.TestProductionDeliveryApparel)
testProxyField (1 failures)
testSkinSelectionTemplateField (testProxyField.TestProxyField)
testResource (1 errors)
test_sourceDestinationReferenceOnSupplyLineOnDefaultSupplyLine (testResource.TestResource), Check that it's possible to set and get a source/destination_reference
testSerializeForm (1 failures)
test checking if the field values are of the proper type.
testTaxLineTradeCondition (6 failures)
test_tax_line_build_accounting (testTaxLineTradeCondition.TestTaxLineOrderSimulationSaleOrder)
test_tax_line_simulation (testTaxLineTradeCondition.TestTaxLineOrderSimulationSaleOrder)
test_tax_line_build_accounting (testTaxLineTradeCondition.TestTaxLineOrderSimulationPurchaseOrder)
test_tax_line_simulation (testTaxLineTradeCondition.TestTaxLineOrderSimulationPurchaseOrder)
test_tax_line_simulation (testTaxLineTradeCondition.TestTaxLineInvoiceSimulationPurchaseInvoice)
test_tax_line_simulation (testTaxLineTradeCondition.TestTaxLineInvoiceSimulationSaleInvoice)
testTemplate (2 failures)
test_NonDeliveryTemplateNotIndexable (testTemplate.TestTemplate)
test_manyTemplatesWithoutReindexation (testTemplate.TestTemplate), Check what happen when templates are created one by one without reindexation
testTradeModelLine (2 failures)
test_TradeModelRuleSimulationBuildInvoiceInvoiceLineModifyDivergencyAndSolving (testTradeModelLine.TestTradeModelLineSale), Check that after changing invoice line invoice is properly diverged and it is possible to solve
test_TradeModelRuleSimulationPackingListSplitBuildInvoiceBuildDifferentRatio (testTradeModelLine.TestTradeModelLineSale), Check building invoice after splitting packing list using different ratio
testTradeModelLinePurchase (2 failures)
test_TradeModelRuleSimulationBuildInvoiceInvoiceLineModifyDivergencyAndSolving (testTradeModelLinePurchase.TestTradeModelLinePurchase), Check that after changing invoice line invoice is properly diverged and it is possible to solve
test_TradeModelRuleSimulationPackingListSplitBuildInvoiceBuildDifferentRatio (testTradeModelLinePurchase.TestTradeModelLinePurchase), Check building invoice after splitting packing list using different ratio
testXHTML (5 failures)
test_configurationOfFieldLibrary (testXHTML.TestXHTML)
test_deadProxyFields (testXHTML.TestXHTML)
test_erp5_dms_Drawing_OOoDocument_viewAsWeb (testXHTML.TestXHTML)
test_erp5_dms_Presentation_OOoDocument_viewAsWeb (testXHTML.TestXHTML)
test_listActionInListbox (testXHTML.TestXHTML)
The following tests were at least partly skipped:
testBase (3 skips)
testERP5Catalog (4 skips)
testMRP (4 skips)
testSQLCachedWorklist (1 skips)
testSelectionTool (7 skips)
-------------- next part --------------
ERROR: test_01_getAggregatedAmountList (testApparelTransformation.TestApparelTransformation)
----------------------------------------------------------------------
Traceback (most recent call last):
File "/home/buildbot/slave/full.ERP5.blade-nxd1-10.6/build/products/ERP5Type/tests/backportUnittest.py", line 145, in run
testMethod()
File "/home/buildbot/slave/full.ERP5.blade-nxd1-10.6/build/unit_test/Products/ERP5/tests/testApparelTransformation.py", line 716, in test_01_getAggregatedAmountList
sequence_list.play(self)
File "/home/buildbot/slave/full.ERP5.blade-nxd1-10.6/build/unit_test/Products/ERP5Type/tests/Sequence.py", line 192, in play
sequence.play(context, sequence_number=i, quiet=quiet)
File "/home/buildbot/slave/full.ERP5.blade-nxd1-10.6/build/unit_test/Products/ERP5Type/tests/Sequence.py", line 113, in play
self._step_list[self._played_index] \
Current Sequence:
CreateComponentDict
CreateOperationDict
Tic
CreateVariatedResource
Tic
CreateTransformation
Tic
> CreateTransformationLine
Tic
CreateIncludedTransformation
Tic
CreateIncludedTransformationLine
Tic
VerifyTransformationAggregatedAmountList
VerifyIncludedTransformationAggregatedAmountList
IncludeTransformation
Tic
VerifySpecialisedTransformationAggregatedAmountList
File "/home/buildbot/slave/full.ERP5.blade-nxd1-10.6/build/unit_test/Products/ERP5Type/tests/Sequence.py", line 96, in play
method(sequence=sequence)
File "/home/buildbot/slave/full.ERP5.blade-nxd1-10.6/build/unit_test/Products/ERP5/tests/testApparelTransformation.py", line 229, in stepCreateTransformationLine
self.stepTic()
File "/home/buildbot/slave/full.ERP5.blade-nxd1-10.6/build/unit_test/Products/ERP5Type/tests/ERP5TypeTestCase.py", line 1071, in stepTic
self.tic()
File "/home/buildbot/slave/full.ERP5.blade-nxd1-10.6/build/unit_test/Products/ERP5Type/tests/ERP5TypeTestCase.py", line 719, in tic
raise RuntimeError,\
RuntimeError: tic is looping forever. These messages are pending: [('/erp5_portal_bb5bd3f365c93c368a8333de2bebc403/apparel_model_module/1', 'immediateReindexObject', -1, 0)]
FAIL: test_confirming (testBPMEvaluation.TestOrderDefaultProcess)
----------------------------------------------------------------------
Traceback (most recent call last):
File "/home/buildbot/slave/full.ERP5.blade-nxd1-10.4/build/products/ERP5Type/tests/backportUnittest.py", line 145, in run
testMethod()
File "/home/buildbot/slave/full.ERP5.blade-nxd1-10.4/build/unit_test/Products/ERP5/tests/testBPMEvaluation.py", line 654, in test_confirming
self._checkBPMSimulation()
File "/home/buildbot/slave/full.ERP5.blade-nxd1-10.4/build/unit_test/Products/ERP5/tests/testBPMEvaluation.py", line 390, in _checkBPMSimulation
self.assertEquals(len(root_simulation_movement.contentValues()), 1)
AssertionError: 0 != 1
FAIL: test_transition (testBPMEvaluation.TestOrderDefaultProcess)
----------------------------------------------------------------------
Traceback (most recent call last):
File "/home/buildbot/slave/full.ERP5.blade-nxd1-10.4/build/products/ERP5Type/tests/backportUnittest.py", line 145, in run
testMethod()
File "/home/buildbot/slave/full.ERP5.blade-nxd1-10.4/build/unit_test/Products/ERP5/tests/testBPMEvaluation.py", line 516, in test_transition
self._checkBPMSimulation()
File "/home/buildbot/slave/full.ERP5.blade-nxd1-10.4/build/unit_test/Products/ERP5/tests/testBPMEvaluation.py", line 390, in _checkBPMSimulation
self.assertEquals(len(root_simulation_movement.contentValues()), 1)
AssertionError: 0 != 1
FAIL: test_transition_line_edit (testBPMEvaluation.TestOrderDefaultProcess)
----------------------------------------------------------------------
Traceback (most recent call last):
File "/home/buildbot/slave/full.ERP5.blade-nxd1-10.4/build/products/ERP5Type/tests/backportUnittest.py", line 145, in run
testMethod()
File "/home/buildbot/slave/full.ERP5.blade-nxd1-10.4/build/unit_test/Products/ERP5/tests/testBPMEvaluation.py", line 589, in test_transition_line_edit
self.test_transition()
File "/home/buildbot/slave/full.ERP5.blade-nxd1-10.4/build/unit_test/Products/ERP5/tests/testBPMEvaluation.py", line 516, in test_transition
self._checkBPMSimulation()
File "/home/buildbot/slave/full.ERP5.blade-nxd1-10.4/build/unit_test/Products/ERP5/tests/testBPMEvaluation.py", line 390, in _checkBPMSimulation
self.assertEquals(len(root_simulation_movement.contentValues()), 1)
AssertionError: 0 != 1
FAIL: test_transition_line_edit_add (testBPMEvaluation.TestOrderDefaultProcess)
----------------------------------------------------------------------
Traceback (most recent call last):
File "/home/buildbot/slave/full.ERP5.blade-nxd1-10.4/build/products/ERP5Type/tests/backportUnittest.py", line 145, in run
testMethod()
File "/home/buildbot/slave/full.ERP5.blade-nxd1-10.4/build/unit_test/Products/ERP5/tests/testBPMEvaluation.py", line 595, in test_transition_line_edit_add
self.test_transition_line_edit()
File "/home/buildbot/slave/full.ERP5.blade-nxd1-10.4/build/unit_test/Products/ERP5/tests/testBPMEvaluation.py", line 589, in test_transition_line_edit
self.test_transition()
File "/home/buildbot/slave/full.ERP5.blade-nxd1-10.4/build/unit_test/Products/ERP5/tests/testBPMEvaluation.py", line 516, in test_transition
self._checkBPMSimulation()
File "/home/buildbot/slave/full.ERP5.blade-nxd1-10.4/build/unit_test/Products/ERP5/tests/testBPMEvaluation.py", line 390, in _checkBPMSimulation
self.assertEquals(len(root_simulation_movement.contentValues()), 1)
AssertionError: 0 != 1
FAIL: test_transition_line_edit_add_many_transactions (testBPMEvaluation.TestOrderDefaultProcess)
----------------------------------------------------------------------
Traceback (most recent call last):
File "/home/buildbot/slave/full.ERP5.blade-nxd1-10.4/build/products/ERP5Type/tests/backportUnittest.py", line 145, in run
testMethod()
File "/home/buildbot/slave/full.ERP5.blade-nxd1-10.4/build/unit_test/Products/ERP5/tests/testBPMEvaluation.py", line 602, in test_transition_line_edit_add_many_transactions
self.test_transition_line_edit()
File "/home/buildbot/slave/full.ERP5.blade-nxd1-10.4/build/unit_test/Products/ERP5/tests/testBPMEvaluation.py", line 589, in test_transition_line_edit
self.test_transition()
File "/home/buildbot/slave/full.ERP5.blade-nxd1-10.4/build/unit_test/Products/ERP5/tests/testBPMEvaluation.py", line 516, in test_transition
self._checkBPMSimulation()
File "/home/buildbot/slave/full.ERP5.blade-nxd1-10.4/build/unit_test/Products/ERP5/tests/testBPMEvaluation.py", line 390, in _checkBPMSimulation
self.assertEquals(len(root_simulation_movement.contentValues()), 1)
AssertionError: 0 != 1
FAIL: test_transition_line_edit_add_same_resource (testBPMEvaluation.TestOrderDefaultProcess)
----------------------------------------------------------------------
Traceback (most recent call last):
File "/home/buildbot/slave/full.ERP5.blade-nxd1-10.4/build/products/ERP5Type/tests/backportUnittest.py", line 145, in run
testMethod()
File "/home/buildbot/slave/full.ERP5.blade-nxd1-10.4/build/unit_test/Products/ERP5/tests/testBPMEvaluation.py", line 624, in test_transition_line_edit_add_same_resource
self.test_transition_line_edit()
File "/home/buildbot/slave/full.ERP5.blade-nxd1-10.4/build/unit_test/Products/ERP5/tests/testBPMEvaluation.py", line 589, in test_transition_line_edit
self.test_transition()
File "/home/buildbot/slave/full.ERP5.blade-nxd1-10.4/build/unit_test/Products/ERP5/tests/testBPMEvaluation.py", line 516, in test_transition
self._checkBPMSimulation()
File "/home/buildbot/slave/full.ERP5.blade-nxd1-10.4/build/unit_test/Products/ERP5/tests/testBPMEvaluation.py", line 390, in _checkBPMSimulation
self.assertEquals(len(root_simulation_movement.contentValues()), 1)
AssertionError: 0 != 1
FAIL: test_transition_line_edit_add_same_resource_edit_again (testBPMEvaluation.TestOrderDefaultProcess)
----------------------------------------------------------------------
Traceback (most recent call last):
File "/home/buildbot/slave/full.ERP5.blade-nxd1-10.4/build/products/ERP5Type/tests/backportUnittest.py", line 145, in run
testMethod()
File "/home/buildbot/slave/full.ERP5.blade-nxd1-10.4/build/unit_test/Products/ERP5/tests/testBPMEvaluation.py", line 632, in test_transition_line_edit_add_same_resource_edit_again
self.test_transition_line_edit_add_same_resource()
File "/home/buildbot/slave/full.ERP5.blade-nxd1-10.4/build/unit_test/Products/ERP5/tests/testBPMEvaluation.py", line 624, in test_transition_line_edit_add_same_resource
self.test_transition_line_edit()
File "/home/buildbot/slave/full.ERP5.blade-nxd1-10.4/build/unit_test/Products/ERP5/tests/testBPMEvaluation.py", line 589, in test_transition_line_edit
self.test_transition()
File "/home/buildbot/slave/full.ERP5.blade-nxd1-10.4/build/unit_test/Products/ERP5/tests/testBPMEvaluation.py", line 516, in test_transition
self._checkBPMSimulation()
File "/home/buildbot/slave/full.ERP5.blade-nxd1-10.4/build/unit_test/Products/ERP5/tests/testBPMEvaluation.py", line 390, in _checkBPMSimulation
self.assertEquals(len(root_simulation_movement.contentValues()), 1)
AssertionError: 0 != 1
FAIL: test_transition_split (testBPMEvaluation.TestOrderDefaultProcess)
----------------------------------------------------------------------
Traceback (most recent call last):
File "/home/buildbot/slave/full.ERP5.blade-nxd1-10.4/build/products/ERP5Type/tests/backportUnittest.py", line 145, in run
testMethod()
File "/home/buildbot/slave/full.ERP5.blade-nxd1-10.4/build/unit_test/Products/ERP5/tests/testBPMEvaluation.py", line 559, in test_transition_split
self._checkBPMSimulation()
File "/home/buildbot/slave/full.ERP5.blade-nxd1-10.4/build/unit_test/Products/ERP5/tests/testBPMEvaluation.py", line 390, in _checkBPMSimulation
self.assertEquals(len(root_simulation_movement.contentValues()), 1)
AssertionError: 0 != 1
FAIL: test_transition_split_line_add (testBPMEvaluation.TestOrderDefaultProcess)
----------------------------------------------------------------------
Traceback (most recent call last):
File "/home/buildbot/slave/full.ERP5.blade-nxd1-10.4/build/products/ERP5Type/tests/backportUnittest.py", line 145, in run
testMethod()
File "/home/buildbot/slave/full.ERP5.blade-nxd1-10.4/build/unit_test/Products/ERP5/tests/testBPMEvaluation.py", line 570, in test_transition_split_line_add
self.test_transition_split()
File "/home/buildbot/slave/full.ERP5.blade-nxd1-10.4/build/unit_test/Products/ERP5/tests/testBPMEvaluation.py", line 559, in test_transition_split
self._checkBPMSimulation()
File "/home/buildbot/slave/full.ERP5.blade-nxd1-10.4/build/unit_test/Products/ERP5/tests/testBPMEvaluation.py", line 390, in _checkBPMSimulation
self.assertEquals(len(root_simulation_movement.contentValues()), 1)
AssertionError: 0 != 1
FAIL: test_transition_split_line_add_split (testBPMEvaluation.TestOrderDefaultProcess)
----------------------------------------------------------------------
Traceback (most recent call last):
File "/home/buildbot/slave/full.ERP5.blade-nxd1-10.4/build/products/ERP5Type/tests/backportUnittest.py", line 145, in run
testMethod()
File "/home/buildbot/slave/full.ERP5.blade-nxd1-10.4/build/unit_test/Products/ERP5/tests/testBPMEvaluation.py", line 577, in test_transition_split_line_add_split
self.test_transition_split_line_add()
File "/home/buildbot/slave/full.ERP5.blade-nxd1-10.4/build/unit_test/Products/ERP5/tests/testBPMEvaluation.py", line 570, in test_transition_split_line_add
self.test_transition_split()
File "/home/buildbot/slave/full.ERP5.blade-nxd1-10.4/build/unit_test/Products/ERP5/tests/testBPMEvaluation.py", line 559, in test_transition_split
self._checkBPMSimulation()
File "/home/buildbot/slave/full.ERP5.blade-nxd1-10.4/build/unit_test/Products/ERP5/tests/testBPMEvaluation.py", line 390, in _checkBPMSimulation
self.assertEquals(len(root_simulation_movement.contentValues()), 1)
AssertionError: 0 != 1
FAIL: test_starting (testBPMEvaluation.TestPackingListDefaultProcess)
----------------------------------------------------------------------
Traceback (most recent call last):
File "/home/buildbot/slave/full.ERP5.blade-nxd1-10.4/build/products/ERP5Type/tests/backportUnittest.py", line 145, in run
testMethod()
File "/home/buildbot/slave/full.ERP5.blade-nxd1-10.4/build/unit_test/Products/ERP5/tests/testBPMEvaluation.py", line 698, in test_starting
self._checkBPMSimulation()
File "/home/buildbot/slave/full.ERP5.blade-nxd1-10.4/build/unit_test/Products/ERP5/tests/testBPMEvaluation.py", line 420, in _checkBPMSimulation
self.assertEquals(
AssertionError: 0 != 1
FAIL: test_transition (testBPMEvaluation.TestPackingListDefaultProcess)
----------------------------------------------------------------------
Traceback (most recent call last):
File "/home/buildbot/slave/full.ERP5.blade-nxd1-10.4/build/products/ERP5Type/tests/backportUnittest.py", line 145, in run
testMethod()
File "/home/buildbot/slave/full.ERP5.blade-nxd1-10.4/build/unit_test/Products/ERP5/tests/testBPMEvaluation.py", line 516, in test_transition
self._checkBPMSimulation()
File "/home/buildbot/slave/full.ERP5.blade-nxd1-10.4/build/unit_test/Products/ERP5/tests/testBPMEvaluation.py", line 420, in _checkBPMSimulation
self.assertEquals(
AssertionError: 0 != 1
FAIL: test_transition_line_edit (testBPMEvaluation.TestPackingListDefaultProcess)
----------------------------------------------------------------------
Traceback (most recent call last):
File "/home/buildbot/slave/full.ERP5.blade-nxd1-10.4/build/products/ERP5Type/tests/backportUnittest.py", line 145, in run
testMethod()
File "/home/buildbot/slave/full.ERP5.blade-nxd1-10.4/build/unit_test/Products/ERP5/tests/testBPMEvaluation.py", line 589, in test_transition_line_edit
self.test_transition()
File "/home/buildbot/slave/full.ERP5.blade-nxd1-10.4/build/unit_test/Products/ERP5/tests/testBPMEvaluation.py", line 516, in test_transition
self._checkBPMSimulation()
File "/home/buildbot/slave/full.ERP5.blade-nxd1-10.4/build/unit_test/Products/ERP5/tests/testBPMEvaluation.py", line 420, in _checkBPMSimulation
self.assertEquals(
AssertionError: 0 != 1
FAIL: test_transition_line_edit_add (testBPMEvaluation.TestPackingListDefaultProcess)
----------------------------------------------------------------------
Traceback (most recent call last):
File "/home/buildbot/slave/full.ERP5.blade-nxd1-10.4/build/products/ERP5Type/tests/backportUnittest.py", line 145, in run
testMethod()
File "/home/buildbot/slave/full.ERP5.blade-nxd1-10.4/build/unit_test/Products/ERP5/tests/testBPMEvaluation.py", line 595, in test_transition_line_edit_add
self.test_transition_line_edit()
File "/home/buildbot/slave/full.ERP5.blade-nxd1-10.4/build/unit_test/Products/ERP5/tests/testBPMEvaluation.py", line 589, in test_transition_line_edit
self.test_transition()
File "/home/buildbot/slave/full.ERP5.blade-nxd1-10.4/build/unit_test/Products/ERP5/tests/testBPMEvaluation.py", line 516, in test_transition
self._checkBPMSimulation()
File "/home/buildbot/slave/full.ERP5.blade-nxd1-10.4/build/unit_test/Products/ERP5/tests/testBPMEvaluation.py", line 420, in _checkBPMSimulation
self.assertEquals(
AssertionError: 0 != 1
FAIL: test_transition_line_edit_add_many_transactions (testBPMEvaluation.TestPackingListDefaultProcess)
----------------------------------------------------------------------
Traceback (most recent call last):
File "/home/buildbot/slave/full.ERP5.blade-nxd1-10.4/build/products/ERP5Type/tests/backportUnittest.py", line 145, in run
testMethod()
File "/home/buildbot/slave/full.ERP5.blade-nxd1-10.4/build/unit_test/Products/ERP5/tests/testBPMEvaluation.py", line 602, in test_transition_line_edit_add_many_transactions
self.test_transition_line_edit()
File "/home/buildbot/slave/full.ERP5.blade-nxd1-10.4/build/unit_test/Products/ERP5/tests/testBPMEvaluation.py", line 589, in test_transition_line_edit
self.test_transition()
File "/home/buildbot/slave/full.ERP5.blade-nxd1-10.4/build/unit_test/Products/ERP5/tests/testBPMEvaluation.py", line 516, in test_transition
self._checkBPMSimulation()
File "/home/buildbot/slave/full.ERP5.blade-nxd1-10.4/build/unit_test/Products/ERP5/tests/testBPMEvaluation.py", line 420, in _checkBPMSimulation
self.assertEquals(
AssertionError: 0 != 1
FAIL: test_transition_line_edit_add_same_resource (testBPMEvaluation.TestPackingListDefaultProcess)
----------------------------------------------------------------------
Traceback (most recent call last):
File "/home/buildbot/slave/full.ERP5.blade-nxd1-10.4/build/products/ERP5Type/tests/backportUnittest.py", line 145, in run
testMethod()
File "/home/buildbot/slave/full.ERP5.blade-nxd1-10.4/build/unit_test/Products/ERP5/tests/testBPMEvaluation.py", line 624, in test_transition_line_edit_add_same_resource
self.test_transition_line_edit()
File "/home/buildbot/slave/full.ERP5.blade-nxd1-10.4/build/unit_test/Products/ERP5/tests/testBPMEvaluation.py", line 589, in test_transition_line_edit
self.test_transition()
File "/home/buildbot/slave/full.ERP5.blade-nxd1-10.4/build/unit_test/Products/ERP5/tests/testBPMEvaluation.py", line 516, in test_transition
self._checkBPMSimulation()
File "/home/buildbot/slave/full.ERP5.blade-nxd1-10.4/build/unit_test/Products/ERP5/tests/testBPMEvaluation.py", line 420, in _checkBPMSimulation
self.assertEquals(
AssertionError: 0 != 1
FAIL: test_transition_line_edit_add_same_resource_edit_again (testBPMEvaluation.TestPackingListDefaultProcess)
----------------------------------------------------------------------
Traceback (most recent call last):
File "/home/buildbot/slave/full.ERP5.blade-nxd1-10.4/build/products/ERP5Type/tests/backportUnittest.py", line 145, in run
testMethod()
File "/home/buildbot/slave/full.ERP5.blade-nxd1-10.4/build/unit_test/Products/ERP5/tests/testBPMEvaluation.py", line 632, in test_transition_line_edit_add_same_resource_edit_again
self.test_transition_line_edit_add_same_resource()
File "/home/buildbot/slave/full.ERP5.blade-nxd1-10.4/build/unit_test/Products/ERP5/tests/testBPMEvaluation.py", line 624, in test_transition_line_edit_add_same_resource
self.test_transition_line_edit()
File "/home/buildbot/slave/full.ERP5.blade-nxd1-10.4/build/unit_test/Products/ERP5/tests/testBPMEvaluation.py", line 589, in test_transition_line_edit
self.test_transition()
File "/home/buildbot/slave/full.ERP5.blade-nxd1-10.4/build/unit_test/Products/ERP5/tests/testBPMEvaluation.py", line 516, in test_transition
self._checkBPMSimulation()
File "/home/buildbot/slave/full.ERP5.blade-nxd1-10.4/build/unit_test/Products/ERP5/tests/testBPMEvaluation.py", line 420, in _checkBPMSimulation
self.assertEquals(
AssertionError: 0 != 1
FAIL: test_transition_split (testBPMEvaluation.TestPackingListDefaultProcess)
----------------------------------------------------------------------
Traceback (most recent call last):
File "/home/buildbot/slave/full.ERP5.blade-nxd1-10.4/build/products/ERP5Type/tests/backportUnittest.py", line 145, in run
testMethod()
File "/home/buildbot/slave/full.ERP5.blade-nxd1-10.4/build/unit_test/Products/ERP5/tests/testBPMEvaluation.py", line 559, in test_transition_split
self._checkBPMSimulation()
File "/home/buildbot/slave/full.ERP5.blade-nxd1-10.4/build/unit_test/Products/ERP5/tests/testBPMEvaluation.py", line 420, in _checkBPMSimulation
self.assertEquals(
AssertionError: 0 != 1
FAIL: test_transition_split_line_add (testBPMEvaluation.TestPackingListDefaultProcess)
----------------------------------------------------------------------
Traceback (most recent call last):
File "/home/buildbot/slave/full.ERP5.blade-nxd1-10.4/build/products/ERP5Type/tests/backportUnittest.py", line 145, in run
testMethod()
File "/home/buildbot/slave/full.ERP5.blade-nxd1-10.4/build/unit_test/Products/ERP5/tests/testBPMEvaluation.py", line 570, in test_transition_split_line_add
self.test_transition_split()
File "/home/buildbot/slave/full.ERP5.blade-nxd1-10.4/build/unit_test/Products/ERP5/tests/testBPMEvaluation.py", line 559, in test_transition_split
self._checkBPMSimulation()
File "/home/buildbot/slave/full.ERP5.blade-nxd1-10.4/build/unit_test/Products/ERP5/tests/testBPMEvaluation.py", line 420, in _checkBPMSimulation
self.assertEquals(
AssertionError: 0 != 1
FAIL: test_transition_split_line_add_split (testBPMEvaluation.TestPackingListDefaultProcess)
----------------------------------------------------------------------
Traceback (most recent call last):
File "/home/buildbot/slave/full.ERP5.blade-nxd1-10.4/build/products/ERP5Type/tests/backportUnittest.py", line 145, in run
testMethod()
File "/home/buildbot/slave/full.ERP5.blade-nxd1-10.4/build/unit_test/Products/ERP5/tests/testBPMEvaluation.py", line 577, in test_transition_split_line_add_split
self.test_transition_split_line_add()
File "/home/buildbot/slave/full.ERP5.blade-nxd1-10.4/build/unit_test/Products/ERP5/tests/testBPMEvaluation.py", line 570, in test_transition_split_line_add
self.test_transition_split()
File "/home/buildbot/slave/full.ERP5.blade-nxd1-10.4/build/unit_test/Products/ERP5/tests/testBPMEvaluation.py", line 559, in test_transition_split
self._checkBPMSimulation()
File "/home/buildbot/slave/full.ERP5.blade-nxd1-10.4/build/unit_test/Products/ERP5/tests/testBPMEvaluation.py", line 420, in _checkBPMSimulation
self.assertEquals(
AssertionError: 0 != 1
FAIL: test_confirming (testBPMEvaluation.TestOrderDifferentProcess)
----------------------------------------------------------------------
Traceback (most recent call last):
File "/home/buildbot/slave/full.ERP5.blade-nxd1-10.4/build/products/ERP5Type/tests/backportUnittest.py", line 145, in run
testMethod()
File "/home/buildbot/slave/full.ERP5.blade-nxd1-10.4/build/unit_test/Products/ERP5/tests/testBPMEvaluation.py", line 751, in test_confirming
self._checkBPMSimulation()
File "/home/buildbot/slave/full.ERP5.blade-nxd1-10.4/build/unit_test/Products/ERP5/tests/testBPMEvaluation.py", line 390, in _checkBPMSimulation
self.assertEquals(len(root_simulation_movement.contentValues()), 1)
AssertionError: 0 != 1
FAIL: test_transition (testBPMEvaluation.TestOrderDifferentProcess)
----------------------------------------------------------------------
Traceback (most recent call last):
File "/home/buildbot/slave/full.ERP5.blade-nxd1-10.4/build/products/ERP5Type/tests/backportUnittest.py", line 145, in run
testMethod()
File "/home/buildbot/slave/full.ERP5.blade-nxd1-10.4/build/unit_test/Products/ERP5/tests/testBPMEvaluation.py", line 516, in test_transition
self._checkBPMSimulation()
File "/home/buildbot/slave/full.ERP5.blade-nxd1-10.4/build/unit_test/Products/ERP5/tests/testBPMEvaluation.py", line 390, in _checkBPMSimulation
self.assertEquals(len(root_simulation_movement.contentValues()), 1)
AssertionError: 0 != 1
FAIL: test_transition_line_edit (testBPMEvaluation.TestOrderDifferentProcess)
----------------------------------------------------------------------
Traceback (most recent call last):
File "/home/buildbot/slave/full.ERP5.blade-nxd1-10.4/build/products/ERP5Type/tests/backportUnittest.py", line 145, in run
testMethod()
File "/home/buildbot/slave/full.ERP5.blade-nxd1-10.4/build/unit_test/Products/ERP5/tests/testBPMEvaluation.py", line 589, in test_transition_line_edit
self.test_transition()
File "/home/buildbot/slave/full.ERP5.blade-nxd1-10.4/build/unit_test/Products/ERP5/tests/testBPMEvaluation.py", line 516, in test_transition
self._checkBPMSimulation()
File "/home/buildbot/slave/full.ERP5.blade-nxd1-10.4/build/unit_test/Products/ERP5/tests/testBPMEvaluation.py", line 390, in _checkBPMSimulation
self.assertEquals(len(root_simulation_movement.contentValues()), 1)
AssertionError: 0 != 1
FAIL: test_transition_line_edit_add (testBPMEvaluation.TestOrderDifferentProcess)
----------------------------------------------------------------------
Traceback (most recent call last):
File "/home/buildbot/slave/full.ERP5.blade-nxd1-10.4/build/products/ERP5Type/tests/backportUnittest.py", line 145, in run
testMethod()
File "/home/buildbot/slave/full.ERP5.blade-nxd1-10.4/build/unit_test/Products/ERP5/tests/testBPMEvaluation.py", line 595, in test_transition_line_edit_add
self.test_transition_line_edit()
File "/home/buildbot/slave/full.ERP5.blade-nxd1-10.4/build/unit_test/Products/ERP5/tests/testBPMEvaluation.py", line 589, in test_transition_line_edit
self.test_transition()
File "/home/buildbot/slave/full.ERP5.blade-nxd1-10.4/build/unit_test/Products/ERP5/tests/testBPMEvaluation.py", line 516, in test_transition
self._checkBPMSimulation()
File "/home/buildbot/slave/full.ERP5.blade-nxd1-10.4/build/unit_test/Products/ERP5/tests/testBPMEvaluation.py", line 390, in _checkBPMSimulation
self.assertEquals(len(root_simulation_movement.contentValues()), 1)
AssertionError: 0 != 1
FAIL: test_transition_line_edit_add_many_transactions (testBPMEvaluation.TestOrderDifferentProcess)
----------------------------------------------------------------------
Traceback (most recent call last):
File "/home/buildbot/slave/full.ERP5.blade-nxd1-10.4/build/products/ERP5Type/tests/backportUnittest.py", line 145, in run
testMethod()
File "/home/buildbot/slave/full.ERP5.blade-nxd1-10.4/build/unit_test/Products/ERP5/tests/testBPMEvaluation.py", line 602, in test_transition_line_edit_add_many_transactions
self.test_transition_line_edit()
File "/home/buildbot/slave/full.ERP5.blade-nxd1-10.4/build/unit_test/Products/ERP5/tests/testBPMEvaluation.py", line 589, in test_transition_line_edit
self.test_transition()
File "/home/buildbot/slave/full.ERP5.blade-nxd1-10.4/build/unit_test/Products/ERP5/tests/testBPMEvaluation.py", line 516, in test_transition
self._checkBPMSimulation()
File "/home/buildbot/slave/full.ERP5.blade-nxd1-10.4/build/unit_test/Products/ERP5/tests/testBPMEvaluation.py", line 390, in _checkBPMSimulation
self.assertEquals(len(root_simulation_movement.contentValues()), 1)
AssertionError: 0 != 1
FAIL: test_transition_line_edit_add_same_resource (testBPMEvaluation.TestOrderDifferentProcess)
----------------------------------------------------------------------
Traceback (most recent call last):
File "/home/buildbot/slave/full.ERP5.blade-nxd1-10.4/build/products/ERP5Type/tests/backportUnittest.py", line 145, in run
testMethod()
File "/home/buildbot/slave/full.ERP5.blade-nxd1-10.4/build/unit_test/Products/ERP5/tests/testBPMEvaluation.py", line 624, in test_transition_line_edit_add_same_resource
self.test_transition_line_edit()
File "/home/buildbot/slave/full.ERP5.blade-nxd1-10.4/build/unit_test/Products/ERP5/tests/testBPMEvaluation.py", line 589, in test_transition_line_edit
self.test_transition()
File "/home/buildbot/slave/full.ERP5.blade-nxd1-10.4/build/unit_test/Products/ERP5/tests/testBPMEvaluation.py", line 516, in test_transition
self._checkBPMSimulation()
File "/home/buildbot/slave/full.ERP5.blade-nxd1-10.4/build/unit_test/Products/ERP5/tests/testBPMEvaluation.py", line 390, in _checkBPMSimulation
self.assertEquals(len(root_simulation_movement.contentValues()), 1)
AssertionError: 0 != 1
FAIL: test_transition_line_edit_add_same_resource_edit_again (testBPMEvaluation.TestOrderDifferentProcess)
----------------------------------------------------------------------
Traceback (most recent call last):
File "/home/buildbot/slave/full.ERP5.blade-nxd1-10.4/build/products/ERP5Type/tests/backportUnittest.py", line 145, in run
testMethod()
File "/home/buildbot/slave/full.ERP5.blade-nxd1-10.4/build/unit_test/Products/ERP5/tests/testBPMEvaluation.py", line 632, in test_transition_line_edit_add_same_resource_edit_again
self.test_transition_line_edit_add_same_resource()
File "/home/buildbot/slave/full.ERP5.blade-nxd1-10.4/build/unit_test/Products/ERP5/tests/testBPMEvaluation.py", line 624, in test_transition_line_edit_add_same_resource
self.test_transition_line_edit()
File "/home/buildbot/slave/full.ERP5.blade-nxd1-10.4/build/unit_test/Products/ERP5/tests/testBPMEvaluation.py", line 589, in test_transition_line_edit
self.test_transition()
File "/home/buildbot/slave/full.ERP5.blade-nxd1-10.4/build/unit_test/Products/ERP5/tests/testBPMEvaluation.py", line 516, in test_transition
self._checkBPMSimulation()
File "/home/buildbot/slave/full.ERP5.blade-nxd1-10.4/build/unit_test/Products/ERP5/tests/testBPMEvaluation.py", line 390, in _checkBPMSimulation
self.assertEquals(len(root_simulation_movement.contentValues()), 1)
AssertionError: 0 != 1
FAIL: test_transition_split (testBPMEvaluation.TestOrderDifferentProcess)
----------------------------------------------------------------------
Traceback (most recent call last):
File "/home/buildbot/slave/full.ERP5.blade-nxd1-10.4/build/products/ERP5Type/tests/backportUnittest.py", line 145, in run
testMethod()
File "/home/buildbot/slave/full.ERP5.blade-nxd1-10.4/build/unit_test/Products/ERP5/tests/testBPMEvaluation.py", line 559, in test_transition_split
self._checkBPMSimulation()
File "/home/buildbot/slave/full.ERP5.blade-nxd1-10.4/build/unit_test/Products/ERP5/tests/testBPMEvaluation.py", line 390, in _checkBPMSimulation
self.assertEquals(len(root_simulation_movement.contentValues()), 1)
AssertionError: 0 != 1
FAIL: test_transition_split_line_add (testBPMEvaluation.TestOrderDifferentProcess)
----------------------------------------------------------------------
Traceback (most recent call last):
File "/home/buildbot/slave/full.ERP5.blade-nxd1-10.4/build/products/ERP5Type/tests/backportUnittest.py", line 145, in run
testMethod()
File "/home/buildbot/slave/full.ERP5.blade-nxd1-10.4/build/unit_test/Products/ERP5/tests/testBPMEvaluation.py", line 570, in test_transition_split_line_add
self.test_transition_split()
File "/home/buildbot/slave/full.ERP5.blade-nxd1-10.4/build/unit_test/Products/ERP5/tests/testBPMEvaluation.py", line 559, in test_transition_split
self._checkBPMSimulation()
File "/home/buildbot/slave/full.ERP5.blade-nxd1-10.4/build/unit_test/Products/ERP5/tests/testBPMEvaluation.py", line 390, in _checkBPMSimulation
self.assertEquals(len(root_simulation_movement.contentValues()), 1)
AssertionError: 0 != 1
FAIL: test_transition_split_line_add_split (testBPMEvaluation.TestOrderDifferentProcess)
----------------------------------------------------------------------
Traceback (most recent call last):
File "/home/buildbot/slave/full.ERP5.blade-nxd1-10.4/build/products/ERP5Type/tests/backportUnittest.py", line 145, in run
testMethod()
File "/home/buildbot/slave/full.ERP5.blade-nxd1-10.4/build/unit_test/Products/ERP5/tests/testBPMEvaluation.py", line 577, in test_transition_split_line_add_split
self.test_transition_split_line_add()
File "/home/buildbot/slave/full.ERP5.blade-nxd1-10.4/build/unit_test/Products/ERP5/tests/testBPMEvaluation.py", line 570, in test_transition_split_line_add
self.test_transition_split()
File "/home/buildbot/slave/full.ERP5.blade-nxd1-10.4/build/unit_test/Products/ERP5/tests/testBPMEvaluation.py", line 559, in test_transition_split
self._checkBPMSimulation()
File "/home/buildbot/slave/full.ERP5.blade-nxd1-10.4/build/unit_test/Products/ERP5/tests/testBPMEvaluation.py", line 390, in _checkBPMSimulation
self.assertEquals(len(root_simulation_movement.contentValues()), 1)
AssertionError: 0 != 1
FAIL: test_starting (testBPMEvaluation.TestPackingListDifferentProcess)
----------------------------------------------------------------------
Traceback (most recent call last):
File "/home/buildbot/slave/full.ERP5.blade-nxd1-10.4/build/products/ERP5Type/tests/backportUnittest.py", line 145, in run
testMethod()
File "/home/buildbot/slave/full.ERP5.blade-nxd1-10.4/build/unit_test/Products/ERP5/tests/testBPMEvaluation.py", line 770, in test_starting
self._checkBPMSimulation()
File "/home/buildbot/slave/full.ERP5.blade-nxd1-10.4/build/unit_test/Products/ERP5/tests/testBPMEvaluation.py", line 420, in _checkBPMSimulation
self.assertEquals(
AssertionError: 0 != 1
FAIL: test_transition (testBPMEvaluation.TestPackingListDifferentProcess)
----------------------------------------------------------------------
Traceback (most recent call last):
File "/home/buildbot/slave/full.ERP5.blade-nxd1-10.4/build/products/ERP5Type/tests/backportUnittest.py", line 145, in run
testMethod()
File "/home/buildbot/slave/full.ERP5.blade-nxd1-10.4/build/unit_test/Products/ERP5/tests/testBPMEvaluation.py", line 516, in test_transition
self._checkBPMSimulation()
File "/home/buildbot/slave/full.ERP5.blade-nxd1-10.4/build/unit_test/Products/ERP5/tests/testBPMEvaluation.py", line 420, in _checkBPMSimulation
self.assertEquals(
AssertionError: 0 != 1
FAIL: test_transition_line_edit (testBPMEvaluation.TestPackingListDifferentProcess)
----------------------------------------------------------------------
Traceback (most recent call last):
File "/home/buildbot/slave/full.ERP5.blade-nxd1-10.4/build/products/ERP5Type/tests/backportUnittest.py", line 145, in run
testMethod()
File "/home/buildbot/slave/full.ERP5.blade-nxd1-10.4/build/unit_test/Products/ERP5/tests/testBPMEvaluation.py", line 589, in test_transition_line_edit
self.test_transition()
File "/home/buildbot/slave/full.ERP5.blade-nxd1-10.4/build/unit_test/Products/ERP5/tests/testBPMEvaluation.py", line 516, in test_transition
self._checkBPMSimulation()
File "/home/buildbot/slave/full.ERP5.blade-nxd1-10.4/build/unit_test/Products/ERP5/tests/testBPMEvaluation.py", line 420, in _checkBPMSimulation
self.assertEquals(
AssertionError: 0 != 1
FAIL: test_transition_line_edit_add (testBPMEvaluation.TestPackingListDifferentProcess)
----------------------------------------------------------------------
Traceback (most recent call last):
File "/home/buildbot/slave/full.ERP5.blade-nxd1-10.4/build/products/ERP5Type/tests/backportUnittest.py", line 145, in run
testMethod()
File "/home/buildbot/slave/full.ERP5.blade-nxd1-10.4/build/unit_test/Products/ERP5/tests/testBPMEvaluation.py", line 595, in test_transition_line_edit_add
self.test_transition_line_edit()
File "/home/buildbot/slave/full.ERP5.blade-nxd1-10.4/build/unit_test/Products/ERP5/tests/testBPMEvaluation.py", line 589, in test_transition_line_edit
self.test_transition()
File "/home/buildbot/slave/full.ERP5.blade-nxd1-10.4/build/unit_test/Products/ERP5/tests/testBPMEvaluation.py", line 516, in test_transition
self._checkBPMSimulation()
File "/home/buildbot/slave/full.ERP5.blade-nxd1-10.4/build/unit_test/Products/ERP5/tests/testBPMEvaluation.py", line 420, in _checkBPMSimulation
self.assertEquals(
AssertionError: 0 != 1
FAIL: test_transition_line_edit_add_many_transactions (testBPMEvaluation.TestPackingListDifferentProcess)
----------------------------------------------------------------------
Traceback (most recent call last):
File "/home/buildbot/slave/full.ERP5.blade-nxd1-10.4/build/products/ERP5Type/tests/backportUnittest.py", line 145, in run
testMethod()
File "/home/buildbot/slave/full.ERP5.blade-nxd1-10.4/build/unit_test/Products/ERP5/tests/testBPMEvaluation.py", line 602, in test_transition_line_edit_add_many_transactions
self.test_transition_line_edit()
File "/home/buildbot/slave/full.ERP5.blade-nxd1-10.4/build/unit_test/Products/ERP5/tests/testBPMEvaluation.py", line 589, in test_transition_line_edit
self.test_transition()
File "/home/buildbot/slave/full.ERP5.blade-nxd1-10.4/build/unit_test/Products/ERP5/tests/testBPMEvaluation.py", line 516, in test_transition
self._checkBPMSimulation()
File "/home/buildbot/slave/full.ERP5.blade-nxd1-10.4/build/unit_test/Products/ERP5/tests/testBPMEvaluation.py", line 420, in _checkBPMSimulation
self.assertEquals(
AssertionError: 0 != 1
FAIL: test_transition_line_edit_add_same_resource (testBPMEvaluation.TestPackingListDifferentProcess)
----------------------------------------------------------------------
Traceback (most recent call last):
File "/home/buildbot/slave/full.ERP5.blade-nxd1-10.4/build/products/ERP5Type/tests/backportUnittest.py", line 145, in run
testMethod()
File "/home/buildbot/slave/full.ERP5.blade-nxd1-10.4/build/unit_test/Products/ERP5/tests/testBPMEvaluation.py", line 624, in test_transition_line_edit_add_same_resource
self.test_transition_line_edit()
File "/home/buildbot/slave/full.ERP5.blade-nxd1-10.4/build/unit_test/Products/ERP5/tests/testBPMEvaluation.py", line 589, in test_transition_line_edit
self.test_transition()
File "/home/buildbot/slave/full.ERP5.blade-nxd1-10.4/build/unit_test/Products/ERP5/tests/testBPMEvaluation.py", line 516, in test_transition
self._checkBPMSimulation()
File "/home/buildbot/slave/full.ERP5.blade-nxd1-10.4/build/unit_test/Products/ERP5/tests/testBPMEvaluation.py", line 420, in _checkBPMSimulation
self.assertEquals(
AssertionError: 0 != 1
FAIL: test_transition_line_edit_add_same_resource_edit_again (testBPMEvaluation.TestPackingListDifferentProcess)
----------------------------------------------------------------------
Traceback (most recent call last):
File "/home/buildbot/slave/full.ERP5.blade-nxd1-10.4/build/products/ERP5Type/tests/backportUnittest.py", line 145, in run
testMethod()
File "/home/buildbot/slave/full.ERP5.blade-nxd1-10.4/build/unit_test/Products/ERP5/tests/testBPMEvaluation.py", line 632, in test_transition_line_edit_add_same_resource_edit_again
self.test_transition_line_edit_add_same_resource()
File "/home/buildbot/slave/full.ERP5.blade-nxd1-10.4/build/unit_test/Products/ERP5/tests/testBPMEvaluation.py", line 624, in test_transition_line_edit_add_same_resource
self.test_transition_line_edit()
File "/home/buildbot/slave/full.ERP5.blade-nxd1-10.4/build/unit_test/Products/ERP5/tests/testBPMEvaluation.py", line 589, in test_transition_line_edit
self.test_transition()
File "/home/buildbot/slave/full.ERP5.blade-nxd1-10.4/build/unit_test/Products/ERP5/tests/testBPMEvaluation.py", line 516, in test_transition
self._checkBPMSimulation()
File "/home/buildbot/slave/full.ERP5.blade-nxd1-10.4/build/unit_test/Products/ERP5/tests/testBPMEvaluation.py", line 420, in _checkBPMSimulation
self.assertEquals(
AssertionError: 0 != 1
FAIL: test_transition_split (testBPMEvaluation.TestPackingListDifferentProcess)
----------------------------------------------------------------------
Traceback (most recent call last):
File "/home/buildbot/slave/full.ERP5.blade-nxd1-10.4/build/products/ERP5Type/tests/backportUnittest.py", line 145, in run
testMethod()
File "/home/buildbot/slave/full.ERP5.blade-nxd1-10.4/build/unit_test/Products/ERP5/tests/testBPMEvaluation.py", line 559, in test_transition_split
self._checkBPMSimulation()
File "/home/buildbot/slave/full.ERP5.blade-nxd1-10.4/build/unit_test/Products/ERP5/tests/testBPMEvaluation.py", line 420, in _checkBPMSimulation
self.assertEquals(
AssertionError: 0 != 1
FAIL: test_transition_split_line_add (testBPMEvaluation.TestPackingListDifferentProcess)
----------------------------------------------------------------------
Traceback (most recent call last):
File "/home/buildbot/slave/full.ERP5.blade-nxd1-10.4/build/products/ERP5Type/tests/backportUnittest.py", line 145, in run
testMethod()
File "/home/buildbot/slave/full.ERP5.blade-nxd1-10.4/build/unit_test/Products/ERP5/tests/testBPMEvaluation.py", line 570, in test_transition_split_line_add
self.test_transition_split()
File "/home/buildbot/slave/full.ERP5.blade-nxd1-10.4/build/unit_test/Products/ERP5/tests/testBPMEvaluation.py", line 559, in test_transition_split
self._checkBPMSimulation()
File "/home/buildbot/slave/full.ERP5.blade-nxd1-10.4/build/unit_test/Products/ERP5/tests/testBPMEvaluation.py", line 420, in _checkBPMSimulation
self.assertEquals(
AssertionError: 0 != 1
FAIL: test_transition_split_line_add_split (testBPMEvaluation.TestPackingListDifferentProcess)
----------------------------------------------------------------------
Traceback (most recent call last):
File "/home/buildbot/slave/full.ERP5.blade-nxd1-10.4/build/products/ERP5Type/tests/backportUnittest.py", line 145, in run
testMethod()
File "/home/buildbot/slave/full.ERP5.blade-nxd1-10.4/build/unit_test/Products/ERP5/tests/testBPMEvaluation.py", line 577, in test_transition_split_line_add_split
self.test_transition_split_line_add()
File "/home/buildbot/slave/full.ERP5.blade-nxd1-10.4/build/unit_test/Products/ERP5/tests/testBPMEvaluation.py", line 570, in test_transition_split_line_add
self.test_transition_split()
File "/home/buildbot/slave/full.ERP5.blade-nxd1-10.4/build/unit_test/Products/ERP5/tests/testBPMEvaluation.py", line 559, in test_transition_split
self._checkBPMSimulation()
File "/home/buildbot/slave/full.ERP5.blade-nxd1-10.4/build/unit_test/Products/ERP5/tests/testBPMEvaluation.py", line 420, in _checkBPMSimulation
self.assertEquals(
AssertionError: 0 != 1
ERROR: test_165_checkCopyBuildInstall (testBusinessTemplate.TestBusinessTemplate)
----------------------------------------------------------------------
Traceback (most recent call last):
File "/home/buildbot/slave/full.ERP5.blade-nxd1-10.2/build/products/ERP5Type/tests/backportUnittest.py", line 145, in run
testMethod()
File "/home/buildbot/slave/full.ERP5.blade-nxd1-10.2/build/unit_test/Products/ERP5/tests/testBusinessTemplate.py", line 5974, in test_165_checkCopyBuildInstall
sequence_list.play(self, quiet=quiet)
File "/home/buildbot/slave/full.ERP5.blade-nxd1-10.2/build/unit_test/Products/ERP5Type/tests/Sequence.py", line 192, in play
sequence.play(context, sequence_number=i, quiet=quiet)
File "/home/buildbot/slave/full.ERP5.blade-nxd1-10.2/build/unit_test/Products/ERP5Type/tests/Sequence.py", line 113, in play
self._step_list[self._played_index] \
Current Sequence:
UseCoreBusinessTemplate
CopyCoreBusinessTemplate
BuildCopyCoreBusinessTemplate
> InstallCopyCoreBusinessTemplate
File "/home/buildbot/slave/full.ERP5.blade-nxd1-10.2/build/unit_test/Products/ERP5Type/tests/Sequence.py", line 96, in play
method(sequence=sequence)
File "/home/buildbot/slave/full.ERP5.blade-nxd1-10.2/build/unit_test/Products/ERP5/tests/testBusinessTemplate.py", line 219, in stepInstallCopyCoreBusinessTemplate
bt.install()
File "/home/buildbot/slave/full.ERP5.blade-nxd1-10.2/build/unit_test/Products/ERP5Type/Base.py", line 237, in __call__
result = apply(self.__dict__['_m'], (instance,) + args, kw)
File "/home/buildbot/slave/full.ERP5.blade-nxd1-10.2/build/unit_test/Products/ERP5/Document/BusinessTemplate.py", line 5216, in install
return self._install(**kw)
File "/home/buildbot/slave/full.ERP5.blade-nxd1-10.2/build/unit_test/Products/ERP5/Document/BusinessTemplate.py", line 5152, in _install
trashbin=trashbin, installed_bt=installed_bt)
File "/home/buildbot/slave/full.ERP5.blade-nxd1-10.2/build/unit_test/Products/ERP5/Document/BusinessTemplate.py", line 1831, in install
for wf_id in self._objects[path].split(', '):
AttributeError: 'list' object has no attribute 'split'
FAIL: test_164_checkCopyBuild (testBusinessTemplate.TestBusinessTemplate)
----------------------------------------------------------------------
Traceback (most recent call last):
File "/home/buildbot/slave/full.ERP5.blade-nxd1-10.2/build/products/ERP5Type/tests/backportUnittest.py", line 145, in run
testMethod()
File "/home/buildbot/slave/full.ERP5.blade-nxd1-10.2/build/unit_test/Products/ERP5/tests/testBusinessTemplate.py", line 5958, in test_164_checkCopyBuild
sequence_list.play(self, quiet=quiet)
File "/home/buildbot/slave/full.ERP5.blade-nxd1-10.2/build/unit_test/Products/ERP5Type/tests/Sequence.py", line 192, in play
sequence.play(context, sequence_number=i, quiet=quiet)
File "/home/buildbot/slave/full.ERP5.blade-nxd1-10.2/build/unit_test/Products/ERP5Type/tests/Sequence.py", line 113, in play
self._step_list[self._played_index] \
Current Sequence:
UseCoreBusinessTemplate
CopyCoreBusinessTemplate
BuildCopyCoreBusinessTemplate
> CheckOriginalAndCopyBusinessTemplate
File "/home/buildbot/slave/full.ERP5.blade-nxd1-10.2/build/unit_test/Products/ERP5Type/tests/Sequence.py", line 96, in play
method(sequence=sequence)
File "/home/buildbot/slave/full.ERP5.blade-nxd1-10.2/build/unit_test/Products/ERP5/tests/testBusinessTemplate.py", line 233, in stepCheckOriginalAndCopyBusinessTemplate
self.assertEquals(original_obj.getKeys(), copy_obj.getKeys())
AssertionError: ['StandardSecurity', 'DocumentExtraction'] != ['ExtensionTemplateItem/StandardSecurity', 'ExtensionTemplateItem/DocumentExtraction']
FAIL: test_167_InstanceAndRelatedClassDefinedInSameBT (testBusinessTemplate.TestBusinessTemplate)
----------------------------------------------------------------------
Traceback (most recent call last):
File "/home/buildbot/slave/full.ERP5.blade-nxd1-10.2/build/products/ERP5Type/tests/backportUnittest.py", line 145, in run
testMethod()
File "/home/buildbot/slave/full.ERP5.blade-nxd1-10.2/build/unit_test/Products/ERP5/tests/testBusinessTemplate.py", line 6021, in test_167_InstanceAndRelatedClassDefinedInSameBT
self.assertFalse(getattr(portal.some_file, 'isClassOverriden', False))
AssertionError
FAIL: test_Base_getEntityListFromFromHeader (testCRM.TestCRMMailIngestion)
----------------------------------------------------------------------
Traceback (most recent call last):
File "/home/buildbot/slave/full.ERP5.blade-nxd1-10.6/build/products/ERP5Type/tests/backportUnittest.py", line 145, in run
testMethod()
File "/home/buildbot/slave/full.ERP5.blade-nxd1-10.6/build/unit_test/Products/ERP5/tests/testCRM.py", line 452, in test_Base_getEntityListFromFromHeader
'%r should return %r, but returned %r' %
AssertionError: '"me at erp5.org,sender at customer.com," <he at erp5.org>' should return ['person_module/he'], but returned ['person_module/sender', 'person_module/he']
FAIL: test_01_delivery_mode_on_sale_packing_list_and_invoice (testConversionInSimulation.TestConversionInSimulation)
----------------------------------------------------------------------
Traceback (most recent call last):
File "/home/buildbot/slave/full.ERP5.blade-nxd1-10.5/build/products/ERP5Type/tests/backportUnittest.py", line 145, in run
testMethod()
File "/home/buildbot/slave/full.ERP5.blade-nxd1-10.5/build/unit_test/Products/ERP5/tests/testConversionInSimulation.py", line 775, in test_01_delivery_mode_on_sale_packing_list_and_invoice
order.getDeliveryMode())
AssertionError: None != 'by_mail'
ERROR: test_addContributorToDocument (testDms.TestDocument)
----------------------------------------------------------------------
Traceback (most recent call last):
File "/home/buildbot/slave/full.ERP5.blade-nxd1-10.4/build/products/ERP5Type/tests/backportUnittest.py", line 145, in run
testMethod()
File "/home/buildbot/slave/full.ERP5.blade-nxd1-10.4/build/unit_test/Products/ERP5OOo/tests/testDms.py", line 1378, in test_addContributorToDocument
person1 = self.createUser(reference='user1')
File "/home/buildbot/slave/full.ERP5.blade-nxd1-10.4/build/unit_test/Products/ERP5Type/tests/ERP5TypeTestCase.py", line 754, in createUser
password=password,
File "/home/buildbot/slave/full.ERP5.blade-nxd1-10.4/build/unit_test/Products/ERP5Type/Core/Folder.py", line 455, in newContent
return FolderMixIn.newContent(self, *args, **kw)
File "/home/buildbot/slave/full.ERP5.blade-nxd1-10.4/build/unit_test/Products/ERP5Type/Core/Folder.py", line 169, in newContent
if kw != {} : new_instance._edit(force_update=1, **kw)
File "/home/buildbot/slave/full.ERP5.blade-nxd1-10.4/build/unit_test/Products/ERP5Type/Base.py", line 1702, in _edit
unmodified_key_list = setChangedPropertyList(unordered_key_list)
File "/home/buildbot/slave/full.ERP5.blade-nxd1-10.4/build/unit_test/Products/ERP5Type/Base.py", line 1686, in setChangedPropertyList
modified_object_list = self._setProperty(key, kw[key])
File "/home/buildbot/slave/full.ERP5.blade-nxd1-10.4/build/unit_test/Products/ERP5Type/Base.py", line 205, in __call__
return apply(self.__dict__['_m'], (instance,) + args, kw)
File "/home/buildbot/slave/full.ERP5.blade-nxd1-10.4/build/unit_test/Products/ERP5Type/Base.py", line 1467, in _setProperty
return method(value, **kw)
File "/home/buildbot/slave/full.ERP5.blade-nxd1-10.4/build/unit_test/Products/ERP5/Document/Person.py", line 193, in setReference
raise RuntimeError, 'user id %s already exist' % (value,)
RuntimeError: user id user1 already exist
ERROR: test_addContributorToDocument (testDmsWithFlare.TestDocumentWithFlare)
----------------------------------------------------------------------
Traceback (most recent call last):
File "/home/buildbot/slave/full.ERP5.blade-nxd1-10.5/build/products/ERP5Type/tests/backportUnittest.py", line 145, in run
testMethod()
File "/home/buildbot/slave/full.ERP5.blade-nxd1-10.5/build/unit_test/Products/ERP5OOo/tests/testDms.py", line 1378, in test_addContributorToDocument
person1 = self.createUser(reference='user1')
File "/home/buildbot/slave/full.ERP5.blade-nxd1-10.5/build/unit_test/Products/ERP5Type/tests/ERP5TypeTestCase.py", line 754, in createUser
password=password,
File "/home/buildbot/slave/full.ERP5.blade-nxd1-10.5/build/unit_test/Products/ERP5Type/Core/Folder.py", line 455, in newContent
return FolderMixIn.newContent(self, *args, **kw)
File "/home/buildbot/slave/full.ERP5.blade-nxd1-10.5/build/unit_test/Products/ERP5Type/Core/Folder.py", line 169, in newContent
if kw != {} : new_instance._edit(force_update=1, **kw)
File "/home/buildbot/slave/full.ERP5.blade-nxd1-10.5/build/unit_test/Products/ERP5Type/Base.py", line 1702, in _edit
unmodified_key_list = setChangedPropertyList(unordered_key_list)
File "/home/buildbot/slave/full.ERP5.blade-nxd1-10.5/build/unit_test/Products/ERP5Type/Base.py", line 1686, in setChangedPropertyList
modified_object_list = self._setProperty(key, kw[key])
File "/home/buildbot/slave/full.ERP5.blade-nxd1-10.5/build/unit_test/Products/ERP5Type/Base.py", line 205, in __call__
return apply(self.__dict__['_m'], (instance,) + args, kw)
File "/home/buildbot/slave/full.ERP5.blade-nxd1-10.5/build/unit_test/Products/ERP5Type/Base.py", line 1467, in _setProperty
return method(value, **kw)
File "/home/buildbot/slave/full.ERP5.blade-nxd1-10.5/build/unit_test/Products/ERP5/Document/Person.py", line 193, in setReference
raise RuntimeError, 'user id %s already exist' % (value,)
RuntimeError: user id user1 already exist
ERROR: test_Products.ERP5.AggregatedAmountList_AggregatedAmountList_implements_IAmountList (testERP5Interfaces.TestERP5Interfaces)
----------------------------------------------------------------------
Traceback (most recent call last):
File "/home/buildbot/slave/full.ERP5.blade-nxd1-10.1/build/products/ERP5Type/tests/backportUnittest.py", line 145, in run
testMethod()
File "/home/buildbot/slave/full.ERP5.blade-nxd1-10.1/build/unit_test/Products/ERP5Type/tests/testERP5TypeInterfaces.py", line 66, in testMethod
verifyClass(Interface, Klass)
File "/usr/lib/erp5/lib/python/zope/interface/verify.py", line 90, in verifyClass
return _verify(iface, candidate, tentative, vtype='c')
File "/usr/lib/erp5/lib/python/zope/interface/verify.py", line 51, in _verify
raise DoesNotImplement(iface)
DoesNotImplement: An object does not implement interface <InterfaceClass IAmountList.IAmountList>
ERROR: test_Products.ERP5Type.Document.BusinessPath_BusinessPath_implements_IBusinessPath (testERP5Interfaces.TestERP5Interfaces)
----------------------------------------------------------------------
Traceback (most recent call last):
File "/home/buildbot/slave/full.ERP5.blade-nxd1-10.1/build/products/ERP5Type/tests/backportUnittest.py", line 145, in run
testMethod()
File "/home/buildbot/slave/full.ERP5.blade-nxd1-10.1/build/unit_test/Products/ERP5Type/tests/testERP5TypeInterfaces.py", line 66, in testMethod
verifyClass(Interface, Klass)
File "/usr/lib/erp5/lib/python/zope/interface/verify.py", line 90, in verifyClass
return _verify(iface, candidate, tentative, vtype='c')
File "/usr/lib/erp5/lib/python/zope/interface/verify.py", line 60, in _verify
raise BrokenImplementation(iface, n)
BrokenImplementation: An object has failed to implement interface <InterfaceClass IBusinessPath.IBusinessPath>
The getExpectedCompletionDuration attribute was not provided.
ERROR: test_Products.ERP5Type.Document.BusinessPath_BusinessPath_implements_ICategoryAccessProvider (testERP5Interfaces.TestERP5Interfaces)
----------------------------------------------------------------------
Traceback (most recent call last):
File "/home/buildbot/slave/full.ERP5.blade-nxd1-10.1/build/products/ERP5Type/tests/backportUnittest.py", line 145, in run
testMethod()
File "/home/buildbot/slave/full.ERP5.blade-nxd1-10.1/build/unit_test/Products/ERP5Type/tests/testERP5TypeInterfaces.py", line 66, in testMethod
verifyClass(Interface, Klass)
File "/usr/lib/erp5/lib/python/zope/interface/verify.py", line 90, in verifyClass
return _verify(iface, candidate, tentative, vtype='c')
File "/usr/lib/erp5/lib/python/zope/interface/verify.py", line 85, in _verify
raise BrokenMethodImplementation(n, mess)
BrokenMethodImplementation: The implementation of _getAcquiredCategoryMembershipList violates its contract
because implementation doesn't allow enough arguments.
ERROR: test_Products.ERP5Type.Document.Document_Document_implements_IDocument (testERP5Interfaces.TestERP5Interfaces)
----------------------------------------------------------------------
Traceback (most recent call last):
File "/home/buildbot/slave/full.ERP5.blade-nxd1-10.1/build/products/ERP5Type/tests/backportUnittest.py", line 145, in run
testMethod()
File "/home/buildbot/slave/full.ERP5.blade-nxd1-10.1/build/unit_test/Products/ERP5Type/tests/testERP5TypeInterfaces.py", line 66, in testMethod
verifyClass(Interface, Klass)
File "/usr/lib/erp5/lib/python/zope/interface/verify.py", line 90, in verifyClass
return _verify(iface, candidate, tentative, vtype='c')
File "/usr/lib/erp5/lib/python/zope/interface/verify.py", line 51, in _verify
raise DoesNotImplement(iface)
DoesNotImplement: An object does not implement interface <InterfaceClass IDocument.IDocument>
ERROR: test_Products.ERP5Type.Document.EmailDocument_EmailDocument_implements_IDocument (testERP5Interfaces.TestERP5Interfaces)
----------------------------------------------------------------------
Traceback (most recent call last):
File "/home/buildbot/slave/full.ERP5.blade-nxd1-10.1/build/products/ERP5Type/tests/backportUnittest.py", line 145, in run
testMethod()
File "/home/buildbot/slave/full.ERP5.blade-nxd1-10.1/build/unit_test/Products/ERP5Type/tests/testERP5TypeInterfaces.py", line 66, in testMethod
verifyClass(Interface, Klass)
File "/usr/lib/erp5/lib/python/zope/interface/verify.py", line 90, in verifyClass
return _verify(iface, candidate, tentative, vtype='c')
File "/usr/lib/erp5/lib/python/zope/interface/verify.py", line 51, in _verify
raise DoesNotImplement(iface)
DoesNotImplement: An object does not implement interface <InterfaceClass IDocument.IDocument>
ERROR: test_Products.ERP5Type.Document.Event_Event_implements_IDocument (testERP5Interfaces.TestERP5Interfaces)
----------------------------------------------------------------------
Traceback (most recent call last):
File "/home/buildbot/slave/full.ERP5.blade-nxd1-10.1/build/products/ERP5Type/tests/backportUnittest.py", line 145, in run
testMethod()
File "/home/buildbot/slave/full.ERP5.blade-nxd1-10.1/build/unit_test/Products/ERP5Type/tests/testERP5TypeInterfaces.py", line 66, in testMethod
verifyClass(Interface, Klass)
File "/usr/lib/erp5/lib/python/zope/interface/verify.py", line 90, in verifyClass
return _verify(iface, candidate, tentative, vtype='c')
File "/usr/lib/erp5/lib/python/zope/interface/verify.py", line 51, in _verify
raise DoesNotImplement(iface)
DoesNotImplement: An object does not implement interface <InterfaceClass IDocument.IDocument>
ERROR: test_Products.ERP5Type.Document.File_File_implements_IDocument (testERP5Interfaces.TestERP5Interfaces)
----------------------------------------------------------------------
Traceback (most recent call last):
File "/home/buildbot/slave/full.ERP5.blade-nxd1-10.1/build/products/ERP5Type/tests/backportUnittest.py", line 145, in run
testMethod()
File "/home/buildbot/slave/full.ERP5.blade-nxd1-10.1/build/unit_test/Products/ERP5Type/tests/testERP5TypeInterfaces.py", line 66, in testMethod
verifyClass(Interface, Klass)
File "/usr/lib/erp5/lib/python/zope/interface/verify.py", line 90, in verifyClass
return _verify(iface, candidate, tentative, vtype='c')
File "/usr/lib/erp5/lib/python/zope/interface/verify.py", line 51, in _verify
raise DoesNotImplement(iface)
DoesNotImplement: An object does not implement interface <InterfaceClass IDocument.IDocument>
ERROR: test_Products.ERP5Type.Document.Image_Image_implements_IDocument (testERP5Interfaces.TestERP5Interfaces)
----------------------------------------------------------------------
Traceback (most recent call last):
File "/home/buildbot/slave/full.ERP5.blade-nxd1-10.1/build/products/ERP5Type/tests/backportUnittest.py", line 145, in run
testMethod()
File "/home/buildbot/slave/full.ERP5.blade-nxd1-10.1/build/unit_test/Products/ERP5Type/tests/testERP5TypeInterfaces.py", line 66, in testMethod
verifyClass(Interface, Klass)
File "/usr/lib/erp5/lib/python/zope/interface/verify.py", line 90, in verifyClass
return _verify(iface, candidate, tentative, vtype='c')
File "/usr/lib/erp5/lib/python/zope/interface/verify.py", line 51, in _verify
raise DoesNotImplement(iface)
DoesNotImplement: An object does not implement interface <InterfaceClass IDocument.IDocument>
ERROR: test_Products.ERP5Type.Document.OOoDocument_OOoDocument_implements_IDocument (testERP5Interfaces.TestERP5Interfaces)
----------------------------------------------------------------------
Traceback (most recent call last):
File "/home/buildbot/slave/full.ERP5.blade-nxd1-10.1/build/products/ERP5Type/tests/backportUnittest.py", line 145, in run
testMethod()
File "/home/buildbot/slave/full.ERP5.blade-nxd1-10.1/build/unit_test/Products/ERP5Type/tests/testERP5TypeInterfaces.py", line 66, in testMethod
verifyClass(Interface, Klass)
File "/usr/lib/erp5/lib/python/zope/interface/verify.py", line 90, in verifyClass
return _verify(iface, candidate, tentative, vtype='c')
File "/usr/lib/erp5/lib/python/zope/interface/verify.py", line 51, in _verify
raise DoesNotImplement(iface)
DoesNotImplement: An object does not implement interface <InterfaceClass IDocument.IDocument>
ERROR: test_Products.ERP5Type.Document.TextDocument_TextDocument_implements_IDocument (testERP5Interfaces.TestERP5Interfaces)
----------------------------------------------------------------------
Traceback (most recent call last):
File "/home/buildbot/slave/full.ERP5.blade-nxd1-10.1/build/products/ERP5Type/tests/backportUnittest.py", line 145, in run
testMethod()
File "/home/buildbot/slave/full.ERP5.blade-nxd1-10.1/build/unit_test/Products/ERP5Type/tests/testERP5TypeInterfaces.py", line 66, in testMethod
verifyClass(Interface, Klass)
File "/usr/lib/erp5/lib/python/zope/interface/verify.py", line 90, in verifyClass
return _verify(iface, candidate, tentative, vtype='c')
File "/usr/lib/erp5/lib/python/zope/interface/verify.py", line 51, in _verify
raise DoesNotImplement(iface)
DoesNotImplement: An object does not implement interface <InterfaceClass IDocument.IDocument>
ERROR: test_Products.ERP5Type.Document.TradeCondition_TradeCondition_implements_IAmountGenerator (testERP5Interfaces.TestERP5Interfaces)
----------------------------------------------------------------------
Traceback (most recent call last):
File "/home/buildbot/slave/full.ERP5.blade-nxd1-10.1/build/products/ERP5Type/tests/backportUnittest.py", line 145, in run
testMethod()
File "/home/buildbot/slave/full.ERP5.blade-nxd1-10.1/build/unit_test/Products/ERP5Type/tests/testERP5TypeInterfaces.py", line 66, in testMethod
verifyClass(Interface, Klass)
File "/usr/lib/erp5/lib/python/zope/interface/verify.py", line 90, in verifyClass
return _verify(iface, candidate, tentative, vtype='c')
File "/usr/lib/erp5/lib/python/zope/interface/verify.py", line 60, in _verify
raise BrokenImplementation(iface, n)
BrokenImplementation: An object has failed to implement interface <InterfaceClass IAmountGenerator.IAmountGenerator>
The getGeneratedAmountList attribute was not provided.
ERROR: test_Products.ERP5Type.Document.TradeModelCell_TradeModelCell_implements_IAmountGenerator (testERP5Interfaces.TestERP5Interfaces)
----------------------------------------------------------------------
Traceback (most recent call last):
File "/home/buildbot/slave/full.ERP5.blade-nxd1-10.1/build/products/ERP5Type/tests/backportUnittest.py", line 145, in run
testMethod()
File "/home/buildbot/slave/full.ERP5.blade-nxd1-10.1/build/unit_test/Products/ERP5Type/tests/testERP5TypeInterfaces.py", line 66, in testMethod
verifyClass(Interface, Klass)
File "/usr/lib/erp5/lib/python/zope/interface/verify.py", line 90, in verifyClass
return _verify(iface, candidate, tentative, vtype='c')
File "/usr/lib/erp5/lib/python/zope/interface/verify.py", line 60, in _verify
raise BrokenImplementation(iface, n)
BrokenImplementation: An object has failed to implement interface <InterfaceClass IAmountGenerator.IAmountGenerator>
The getGeneratedAmountList attribute was not provided.
ERROR: test_Products.ERP5Type.Document.TradeModelCell_TradeModelCell_implements_IVariated (testERP5Interfaces.TestERP5Interfaces)
----------------------------------------------------------------------
Traceback (most recent call last):
File "/home/buildbot/slave/full.ERP5.blade-nxd1-10.1/build/products/ERP5Type/tests/backportUnittest.py", line 145, in run
testMethod()
File "/home/buildbot/slave/full.ERP5.blade-nxd1-10.1/build/unit_test/Products/ERP5Type/tests/testERP5TypeInterfaces.py", line 66, in testMethod
verifyClass(Interface, Klass)
File "/usr/lib/erp5/lib/python/zope/interface/verify.py", line 90, in verifyClass
return _verify(iface, candidate, tentative, vtype='c')
File "/usr/lib/erp5/lib/python/zope/interface/verify.py", line 85, in _verify
raise BrokenMethodImplementation(n, mess)
BrokenMethodImplementation: The implementation of setVariationCategoryList violates its contract
because implementation doesn't allow enough arguments.
ERROR: test_Products.ERP5Type.Document.TradeModelLine_TradeModelLine_implements_IAmountGenerator (testERP5Interfaces.TestERP5Interfaces)
----------------------------------------------------------------------
Traceback (most recent call last):
File "/home/buildbot/slave/full.ERP5.blade-nxd1-10.1/build/products/ERP5Type/tests/backportUnittest.py", line 145, in run
testMethod()
File "/home/buildbot/slave/full.ERP5.blade-nxd1-10.1/build/unit_test/Products/ERP5Type/tests/testERP5TypeInterfaces.py", line 66, in testMethod
verifyClass(Interface, Klass)
File "/usr/lib/erp5/lib/python/zope/interface/verify.py", line 90, in verifyClass
return _verify(iface, candidate, tentative, vtype='c')
File "/usr/lib/erp5/lib/python/zope/interface/verify.py", line 60, in _verify
raise BrokenImplementation(iface, n)
BrokenImplementation: An object has failed to implement interface <InterfaceClass IAmountGenerator.IAmountGenerator>
The getGeneratedAmountList attribute was not provided.
ERROR: test_Products.ERP5Type.Document.TradeModelLine_TradeModelLine_implements_IVariated (testERP5Interfaces.TestERP5Interfaces)
----------------------------------------------------------------------
Traceback (most recent call last):
File "/home/buildbot/slave/full.ERP5.blade-nxd1-10.1/build/products/ERP5Type/tests/backportUnittest.py", line 145, in run
testMethod()
File "/home/buildbot/slave/full.ERP5.blade-nxd1-10.1/build/unit_test/Products/ERP5Type/tests/testERP5TypeInterfaces.py", line 66, in testMethod
verifyClass(Interface, Klass)
File "/usr/lib/erp5/lib/python/zope/interface/verify.py", line 90, in verifyClass
return _verify(iface, candidate, tentative, vtype='c')
File "/usr/lib/erp5/lib/python/zope/interface/verify.py", line 85, in _verify
raise BrokenMethodImplementation(n, mess)
BrokenMethodImplementation: The implementation of setVariationCategoryList violates its contract
because implementation doesn't allow enough arguments.
ERROR: test_Products.ERP5Type.Document.TradeModelRule_TradeModelRule_implements_IRule (testERP5Interfaces.TestERP5Interfaces)
----------------------------------------------------------------------
Traceback (most recent call last):
File "/home/buildbot/slave/full.ERP5.blade-nxd1-10.1/build/products/ERP5Type/tests/backportUnittest.py", line 145, in run
testMethod()
File "/home/buildbot/slave/full.ERP5.blade-nxd1-10.1/build/unit_test/Products/ERP5Type/tests/testERP5TypeInterfaces.py", line 66, in testMethod
verifyClass(Interface, Klass)
File "/usr/lib/erp5/lib/python/zope/interface/verify.py", line 90, in verifyClass
return _verify(iface, candidate, tentative, vtype='c')
File "/usr/lib/erp5/lib/python/zope/interface/verify.py", line 60, in _verify
raise BrokenImplementation(iface, n)
BrokenImplementation: An object has failed to implement interface <InterfaceClass IRule.IRule>
The updateMovementCollection attribute was not provided.
ERROR: test_Products.ERP5Type.Document.TransformationRule_TransformationRule_implements_IRule (testERP5Interfaces.TestERP5Interfaces)
----------------------------------------------------------------------
Traceback (most recent call last):
File "/home/buildbot/slave/full.ERP5.blade-nxd1-10.1/build/products/ERP5Type/tests/backportUnittest.py", line 145, in run
testMethod()
File "/home/buildbot/slave/full.ERP5.blade-nxd1-10.1/build/unit_test/Products/ERP5Type/tests/testERP5TypeInterfaces.py", line 66, in testMethod
verifyClass(Interface, Klass)
File "/usr/lib/erp5/lib/python/zope/interface/verify.py", line 90, in verifyClass
return _verify(iface, candidate, tentative, vtype='c')
File "/usr/lib/erp5/lib/python/zope/interface/verify.py", line 60, in _verify
raise BrokenImplementation(iface, n)
BrokenImplementation: An object has failed to implement interface <InterfaceClass IRule.IRule>
The updateMovementCollection attribute was not provided.
ERROR: test_Products.ERP5Type.Document.Transformation_Transformation_implements_IAmountGenerator (testERP5Interfaces.TestERP5Interfaces)
----------------------------------------------------------------------
Traceback (most recent call last):
File "/home/buildbot/slave/full.ERP5.blade-nxd1-10.1/build/products/ERP5Type/tests/backportUnittest.py", line 145, in run
testMethod()
File "/home/buildbot/slave/full.ERP5.blade-nxd1-10.1/build/unit_test/Products/ERP5Type/tests/testERP5TypeInterfaces.py", line 66, in testMethod
verifyClass(Interface, Klass)
File "/usr/lib/erp5/lib/python/zope/interface/verify.py", line 90, in verifyClass
return _verify(iface, candidate, tentative, vtype='c')
File "/usr/lib/erp5/lib/python/zope/interface/verify.py", line 60, in _verify
raise BrokenImplementation(iface, n)
BrokenImplementation: An object has failed to implement interface <InterfaceClass IAmountGenerator.IAmountGenerator>
The getGeneratedAmountList attribute was not provided.
ERROR: test_Products.ERP5Type.Document.Transformation_Transformation_implements_IVariated (testERP5Interfaces.TestERP5Interfaces)
----------------------------------------------------------------------
Traceback (most recent call last):
File "/home/buildbot/slave/full.ERP5.blade-nxd1-10.1/build/products/ERP5Type/tests/backportUnittest.py", line 145, in run
testMethod()
File "/home/buildbot/slave/full.ERP5.blade-nxd1-10.1/build/unit_test/Products/ERP5Type/tests/testERP5TypeInterfaces.py", line 66, in testMethod
verifyClass(Interface, Klass)
File "/usr/lib/erp5/lib/python/zope/interface/verify.py", line 90, in verifyClass
return _verify(iface, candidate, tentative, vtype='c')
File "/usr/lib/erp5/lib/python/zope/interface/verify.py", line 85, in _verify
raise BrokenMethodImplementation(n, mess)
BrokenMethodImplementation: The implementation of getVariationRangeCategoryItemList violates its contract
because implementation doesn't allow enough arguments.
ERROR: test_Products.ERP5Type.Document.TransformedResource_TransformedResource_implements_IVariated (testERP5Interfaces.TestERP5Interfaces)
----------------------------------------------------------------------
Traceback (most recent call last):
File "/home/buildbot/slave/full.ERP5.blade-nxd1-10.1/build/products/ERP5Type/tests/backportUnittest.py", line 145, in run
testMethod()
File "/home/buildbot/slave/full.ERP5.blade-nxd1-10.1/build/unit_test/Products/ERP5Type/tests/testERP5TypeInterfaces.py", line 66, in testMethod
verifyClass(Interface, Klass)
File "/usr/lib/erp5/lib/python/zope/interface/verify.py", line 90, in verifyClass
return _verify(iface, candidate, tentative, vtype='c')
File "/usr/lib/erp5/lib/python/zope/interface/verify.py", line 85, in _verify
raise BrokenMethodImplementation(n, mess)
BrokenMethodImplementation: The implementation of setVariationCategoryList violates its contract
because implementation doesn't allow enough arguments.
ERROR: test_10_AcceptDecisionOnPackingList (testERP5Simulation.TestERP5SimulationInvoice)
----------------------------------------------------------------------
Traceback (most recent call last):
File "/home/buildbot/slave/full.ERP5.blade-nxd1-10.6/build/products/ERP5Type/tests/backportUnittest.py", line 145, in run
testMethod()
File "/home/buildbot/slave/full.ERP5.blade-nxd1-10.6/build/unit_test/Products/ERP5/tests/testInvoice.py", line 2936, in test_10_AcceptDecisionOnPackingList
sequence_list.play(self, quiet=quiet)
File "/home/buildbot/slave/full.ERP5.blade-nxd1-10.6/build/unit_test/Products/ERP5Type/tests/Sequence.py", line 192, in play
sequence.play(context, sequence_number=i, quiet=quiet)
File "/home/buildbot/slave/full.ERP5.blade-nxd1-10.6/build/unit_test/Products/ERP5Type/tests/Sequence.py", line 113, in play
self._step_list[self._played_index] \
Current Sequence:
CreateEntities
CreateCurrency
CreateSaleInvoiceTransactionRule
CreateOrder
SetOrderProfile
SetOrderPriceCurrency
CreateNotVariatedResource
Tic
CreateOrderLine
SetOrderLineResource
SetOrderLineDefaultValues
OrderOrder
Tic
CheckDeliveryBuilding
ConfirmOrder
Tic
CheckOrderRule
CheckOrderSimulation
CheckDeliveryBuilding
AddPackingListContainer
AddPackingListContainerLine
SetContainerLineFullQuantity
Tic
CheckPackingListIsPacked
CheckInvoicingRule
DecreasePackingListLineQuantity
SetContainerFullQuantity
CheckPackingListIsCalculating
Tic
CheckPackingListIsDiverged
AcceptDecisionQuantity
Tic
CheckPackingListIsSolved
CheckPackingListNotSplitted
SetReadyPackingList
Tic
StartPackingList
CheckInvoicingRule
CheckInvoiceTransactionRule
Tic
CheckInvoiceBuilding
StopPackingList
Tic
DeliverPackingList
Tic
CheckPackingListIsNotDivergent
CheckPackingListIsSolved
CheckInvoiceTransactionRule
StartInvoice
Tic
StopInvoice
Tic
DeliverInvoice
Tic
CheckInvoiceNotSplitted
CheckInvoiceIsNotDivergent
CheckInvoiceIsSolved
RebuildAndCheckNothingIsCreated
CheckInvoicesConsistency
> Pdb
File "/home/buildbot/slave/full.ERP5.blade-nxd1-10.6/build/unit_test/Products/ERP5Type/tests/Sequence.py", line 96, in play
method(sequence=sequence)
File "/home/buildbot/slave/full.ERP5.blade-nxd1-10.6/build/unit_test/Products/ERP5Type/tests/ERP5TypeTestCase.py", line 1060, in stepPdb
tracer()
File "/usr/lib64/python2.4/bdb.py", line 52, in trace_dispatch
return self.dispatch_return(frame, arg)
File "/usr/lib64/python2.4/bdb.py", line 86, in dispatch_return
if self.quitting: raise BdbQuit
BdbQuit
ERROR: test_11_AcceptDecisionOnPackingListAndInvoice (testERP5Simulation.TestERP5SimulationInvoice)
----------------------------------------------------------------------
Traceback (most recent call last):
File "/home/buildbot/slave/full.ERP5.blade-nxd1-10.6/build/products/ERP5Type/tests/backportUnittest.py", line 145, in run
testMethod()
File "/home/buildbot/slave/full.ERP5.blade-nxd1-10.6/build/unit_test/Products/ERP5/tests/testInvoice.py", line 3053, in test_11_AcceptDecisionOnPackingListAndInvoice
sequence_list.play(self, quiet=quiet)
File "/home/buildbot/slave/full.ERP5.blade-nxd1-10.6/build/unit_test/Products/ERP5Type/tests/Sequence.py", line 192, in play
sequence.play(context, sequence_number=i, quiet=quiet)
File "/home/buildbot/slave/full.ERP5.blade-nxd1-10.6/build/unit_test/Products/ERP5Type/tests/Sequence.py", line 113, in play
self._step_list[self._played_index] \
Current Sequence:
CreateEntities
CreateCurrency
CreateSaleInvoiceTransactionRule
CreateOrder
SetOrderProfile
SetOrderPriceCurrency
CreateNotVariatedResource
Tic
CreateOrderLine
SetOrderLineResource
SetOrderLineDefaultValues
OrderOrder
Tic
CheckDeliveryBuilding
ConfirmOrder
Tic
CheckOrderRule
CheckOrderSimulation
CheckDeliveryBuilding
AddPackingListContainer
AddPackingListContainerLine
SetContainerLineFullQuantity
Tic
CheckPackingListIsPacked
CheckInvoicingRule
DecreasePackingListLineQuantity
SetContainerFullQuantity
CheckPackingListIsCalculating
Tic
CheckPackingListIsDiverged
AcceptDecisionQuantity
Tic
CheckPackingListIsSolved
CheckPackingListNotSplitted
SetReadyPackingList
Tic
StartPackingList
CheckInvoicingRule
CheckInvoiceTransactionRule
Tic
CheckInvoiceBuilding
StopPackingList
Tic
DeliverPackingList
Tic
CheckPackingListIsNotDivergent
CheckPackingListIsSolved
CheckInvoiceTransactionRule
IncreaseInvoiceLineQuantity
Tic
CheckInvoiceIsDiverged
AcceptDecisionQuantityInvoice
Tic
CheckInvoiceIsNotDivergent
CheckInvoiceIsSolved
StartInvoice
Tic
> StopInvoice
Tic
DeliverInvoice
Tic
CheckPackingListIsNotDivergent
CheckPackingListIsSolved
CheckInvoiceTransactionRule
CheckInvoiceNotSplitted
CheckInvoiceIsNotDivergent
CheckInvoiceIsSolved
RebuildAndCheckNothingIsCreated
CheckInvoicesConsistency
File "/home/buildbot/slave/full.ERP5.blade-nxd1-10.6/build/unit_test/Products/ERP5Type/tests/Sequence.py", line 96, in play
method(sequence=sequence)
File "/home/buildbot/slave/full.ERP5.blade-nxd1-10.6/build/unit_test/Products/ERP5/tests/testInvoice.py", line 394, in stepStopInvoice
self.modifyInvoiceState('stop_action', sequence=sequence)
File "/home/buildbot/slave/full.ERP5.blade-nxd1-10.6/build/unit_test/Products/ERP5/tests/testInvoice.py", line 380, in modifyInvoiceState
invoice.portal_workflow.doActionFor(invoice, transition_name)
File "/usr/lib/erp5/lib/python/Products/CMFCore/WorkflowTool.py", line 294, in doActionFor
raise WorkflowException(
WorkflowException: No workflow provides the "stop_action" action.
ERROR: test_12_SplitPackingListAndAcceptInvoice (testERP5Simulation.TestERP5SimulationInvoice)
----------------------------------------------------------------------
Traceback (most recent call last):
File "/home/buildbot/slave/full.ERP5.blade-nxd1-10.6/build/products/ERP5Type/tests/backportUnittest.py", line 145, in run
testMethod()
File "/home/buildbot/slave/full.ERP5.blade-nxd1-10.6/build/unit_test/Products/ERP5/tests/testInvoice.py", line 3165, in test_12_SplitPackingListAndAcceptInvoice
self.playSequence(sequence, quiet=quiet)
File "/home/buildbot/slave/full.ERP5.blade-nxd1-10.6/build/unit_test/Products/ERP5/tests/testAccountingRules.py", line 116, in playSequence
sequence_list.play(self, quiet=quiet)
File "/home/buildbot/slave/full.ERP5.blade-nxd1-10.6/build/unit_test/Products/ERP5Type/tests/Sequence.py", line 192, in play
sequence.play(context, sequence_number=i, quiet=quiet)
File "/home/buildbot/slave/full.ERP5.blade-nxd1-10.6/build/unit_test/Products/ERP5Type/tests/Sequence.py", line 113, in play
self._step_list[self._played_index] \
Current Sequence:
CreateEntities
CreateCurrency
CreateSaleInvoiceTransactionRule
CreateOrder
SetOrderProfile
SetOrderPriceCurrency
CreateNotVariatedResource
Tic
CreateOrderLine
SetOrderLineResource
SetOrderLineDefaultValues
OrderOrder
Tic
CheckDeliveryBuilding
ConfirmOrder
Tic
CheckOrderRule
CheckOrderSimulation
CheckDeliveryBuilding
AddPackingListContainer
AddPackingListContainerLine
SetContainerLineFullQuantity
Tic
CheckPackingListIsPacked
CheckInvoicingRule
DecreasePackingListLineQuantity
SetContainerFullQuantity
CheckPackingListIsCalculating
Tic
CheckPackingListIsDiverged
SplitAndDeferPackingList
Tic
CheckPackingListIsSolved
CheckPackingListSplitted
SetReadyPackingList
Tic
StartPackingList
CheckInvoicingRule
CheckInvoiceTransactionRule
Tic
CheckInvoiceBuilding
StopPackingList
Tic
DeliverPackingList
Tic
CheckPackingListIsSolved
CheckPackingListSplitted
IncreaseInvoiceLineQuantity
CheckInvoiceIsCalculating
Tic
CheckInvoiceIsDiverged
AcceptDecisionQuantityInvoice
Tic
StartInvoice
Tic
> StopInvoice
Tic
DeliverInvoice
Tic
CheckInvoiceIsSolved
CheckInvoiceNotSplitted
CheckPackingListIsNotDivergent
CheckPackingListIsSolved
CheckInvoiceTransactionRule
RebuildAndCheckNothingIsCreated
CheckInvoicesConsistency
SwitchPackingLists
AddPackingListContainer
SetContainerFullQuantity
Tic
CheckPackingListIsSolved
SetReadyPackingList
Tic
StartPackingList
CheckInvoicingRule
CheckInvoiceTransactionRule
Tic
CheckInvoiceBuilding
StopPackingList
Tic
DeliverPackingList
Tic
CheckPackingListIsSolved
SetInvoiceLineQuantityToZero
CheckInvoiceIsCalculating
Tic
CheckInvoiceIsDiverged
AcceptDecisionQuantityInvoice
Tic
StartInvoice
Tic
StopInvoice
Tic
DeliverInvoice
Tic
CheckInvoiceIsSolved
CheckInvoiceNotSplitted
CheckPackingListIsNotDivergent
CheckPackingListIsSolved
CheckInvoiceTransactionRule
RebuildAndCheckNothingIsCreated
CheckInvoicesConsistency
File "/home/buildbot/slave/full.ERP5.blade-nxd1-10.6/build/unit_test/Products/ERP5Type/tests/Sequence.py", line 96, in play
method(sequence=sequence)
File "/home/buildbot/slave/full.ERP5.blade-nxd1-10.6/build/unit_test/Products/ERP5/tests/testInvoice.py", line 394, in stepStopInvoice
self.modifyInvoiceState('stop_action', sequence=sequence)
File "/home/buildbot/slave/full.ERP5.blade-nxd1-10.6/build/unit_test/Products/ERP5/tests/testInvoice.py", line 380, in modifyInvoiceState
invoice.portal_workflow.doActionFor(invoice, transition_name)
File "/usr/lib/erp5/lib/python/Products/CMFCore/WorkflowTool.py", line 294, in doActionFor
raise WorkflowException(
WorkflowException: No workflow provides the "stop_action" action.
ERROR: test_14_AcceptDecisionOnInvoice (testERP5Simulation.TestERP5SimulationInvoice)
----------------------------------------------------------------------
Traceback (most recent call last):
File "/home/buildbot/slave/full.ERP5.blade-nxd1-10.6/build/products/ERP5Type/tests/backportUnittest.py", line 145, in run
testMethod()
File "/home/buildbot/slave/full.ERP5.blade-nxd1-10.6/build/unit_test/Products/ERP5/tests/testInvoice.py", line 3301, in test_14_AcceptDecisionOnInvoice
sequence_list.play(self, quiet=quiet)
File "/home/buildbot/slave/full.ERP5.blade-nxd1-10.6/build/unit_test/Products/ERP5Type/tests/Sequence.py", line 192, in play
sequence.play(context, sequence_number=i, quiet=quiet)
File "/home/buildbot/slave/full.ERP5.blade-nxd1-10.6/build/unit_test/Products/ERP5Type/tests/Sequence.py", line 113, in play
self._step_list[self._played_index] \
Current Sequence:
CreateEntities
CreateCurrency
CreateSaleInvoiceTransactionRule
CreateOrder
SetOrderProfile
SetOrderPriceCurrency
CreateNotVariatedResource
Tic
CreateOrderLine
SetOrderLineResource
SetOrderLineDefaultValues
OrderOrder
Tic
CheckDeliveryBuilding
ConfirmOrder
Tic
CheckOrderRule
CheckOrderSimulation
CheckDeliveryBuilding
AddPackingListContainer
AddPackingListContainerLine
SetContainerLineFullQuantity
Tic
CheckPackingListIsPacked
SetReadyPackingList
Tic
StartPackingList
CheckInvoicingRule
CheckInvoiceTransactionRule
Tic
CheckInvoiceBuilding
StopPackingList
Tic
DeliverPackingList
Tic
CheckPackingListIsSolved
CheckPackingListNotSplitted
DecreaseInvoiceLineQuantity
CheckInvoiceIsDivergent
CheckInvoiceIsCalculating
Tic
CheckInvoiceIsDiverged
AcceptDecisionQuantityInvoice
Tic
StartInvoice
Tic
> StopInvoice
Tic
DeliverInvoice
Tic
CheckPackingListIsNotDivergent
CheckPackingListIsSolved
CheckInvoiceTransactionRule
CheckInvoiceNotSplitted
CheckInvoiceIsNotDivergent
CheckInvoiceIsSolved
RebuildAndCheckNothingIsCreated
CheckInvoicesConsistency
File "/home/buildbot/slave/full.ERP5.blade-nxd1-10.6/build/unit_test/Products/ERP5Type/tests/Sequence.py", line 96, in play
method(sequence=sequence)
File "/home/buildbot/slave/full.ERP5.blade-nxd1-10.6/build/unit_test/Products/ERP5/tests/testInvoice.py", line 394, in stepStopInvoice
self.modifyInvoiceState('stop_action', sequence=sequence)
File "/home/buildbot/slave/full.ERP5.blade-nxd1-10.6/build/unit_test/Products/ERP5/tests/testInvoice.py", line 380, in modifyInvoiceState
invoice.portal_workflow.doActionFor(invoice, transition_name)
File "/usr/lib/erp5/lib/python/Products/CMFCore/WorkflowTool.py", line 294, in doActionFor
raise WorkflowException(
WorkflowException: No workflow provides the "stop_action" action.
FAIL: test_05b_SimulationChangeQuantityForMergedLine (testERP5Simulation.TestERP5SimulationPackingList)
----------------------------------------------------------------------
Traceback (most recent call last):
File "/home/buildbot/slave/full.ERP5.blade-nxd1-10.6/build/products/ERP5Type/tests/backportUnittest.py", line 145, in run
testMethod()
File "/home/buildbot/slave/full.ERP5.blade-nxd1-10.6/build/unit_test/Products/ERP5/tests/testPackingList.py", line 1081, in test_05b_SimulationChangeQuantityForMergedLine
sequence_list.play(self, quiet=quiet)
File "/home/buildbot/slave/full.ERP5.blade-nxd1-10.6/build/unit_test/Products/ERP5Type/tests/Sequence.py", line 192, in play
sequence.play(context, sequence_number=i, quiet=quiet)
File "/home/buildbot/slave/full.ERP5.blade-nxd1-10.6/build/unit_test/Products/ERP5Type/tests/Sequence.py", line 113, in play
self._step_list[self._played_index] \
Current Sequence:
CreateOrganisation1
CreateOrganisation2
CreateOrganisation3
CreateProject1
CreateProject2
CreateOrder
CreateCurrency
SetOrderPriceCurrency
SetOrderProfile
CreateNotVariatedResource
Tic
CreateOrderLine
SetOrderLineResource
SetOrderLineDefaultValues
Tic
CreateOrderLine
SetOrderLineResource
SetOrderLineDefaultValues
OrderOrder
Tic
ConfirmOrder
Tic
> CheckOrderSimulation
CheckDeliveryBuilding
CheckPackingListIsNotDivergent
CheckOrderPackingList
ModifySimulationLineQuantityForMergedLine
Tic
CheckPackingListIsDiverged
AdoptPrevisionQuantity
Tic
CheckPackingListIsNotDivergent
CheckPackingListIsSolved
CheckPackingListLineWithNewQuantityPrevisionForMergedLine
File "/home/buildbot/slave/full.ERP5.blade-nxd1-10.6/build/unit_test/Products/ERP5Type/tests/Sequence.py", line 96, in play
method(sequence=sequence)
File "/home/buildbot/slave/full.ERP5.blade-nxd1-10.6/build/unit_test/Products/ERP5/tests/testOrder.py", line 769, in stepCheckOrderSimulation
sequence_list=sequence_list, **kw)
File "/home/buildbot/slave/full.ERP5.blade-nxd1-10.6/build/unit_test/Products/ERP5/tests/testERP5Simulation.py", line 376, in checkOrderRuleSimulation
self.failIfDifferentSet(movement_list, order_movement_list)
File "/home/buildbot/slave/full.ERP5.blade-nxd1-10.6/build/unit_test/Products/ERP5Type/tests/ERP5TypeTestCase.py", line 777, in failIfDifferentSet
self.failUnless(i in b, msg)
AssertionError: [<OrderLine at /erp5_portal_c57d7bf4eafcb9ad2fe2626414f201cd/sale_order_module/8/2>, <OrderLine at /erp5_portal_c57d7bf4eafcb9ad2fe2626414f201cd/sale_order_module/8/1>] != [<OrderLine at /erp5_portal_c57d7bf4eafcb9ad2fe2626414f201cd/sale_order_module/8/2>]
FAIL: test_05c_SimulationChangeQuantityAndAcceptDecisionForMergedLine (testERP5Simulation.TestERP5SimulationPackingList)
----------------------------------------------------------------------
Traceback (most recent call last):
File "/home/buildbot/slave/full.ERP5.blade-nxd1-10.6/build/products/ERP5Type/tests/backportUnittest.py", line 145, in run
testMethod()
File "/home/buildbot/slave/full.ERP5.blade-nxd1-10.6/build/unit_test/Products/ERP5/tests/testPackingList.py", line 1100, in test_05c_SimulationChangeQuantityAndAcceptDecisionForMergedLine
sequence_list.play(self, quiet=quiet)
File "/home/buildbot/slave/full.ERP5.blade-nxd1-10.6/build/unit_test/Products/ERP5Type/tests/Sequence.py", line 192, in play
sequence.play(context, sequence_number=i, quiet=quiet)
File "/home/buildbot/slave/full.ERP5.blade-nxd1-10.6/build/unit_test/Products/ERP5Type/tests/Sequence.py", line 113, in play
self._step_list[self._played_index] \
Current Sequence:
CreateOrganisation1
CreateOrganisation2
CreateOrganisation3
CreateProject1
CreateProject2
CreateOrder
CreateCurrency
SetOrderPriceCurrency
SetOrderProfile
CreateNotVariatedResource
Tic
CreateOrderLine
SetOrderLineResource
SetOrderLineDefaultValues
Tic
CreateOrderLine
SetOrderLineResource
SetOrderLineDefaultValues
OrderOrder
Tic
ConfirmOrder
Tic
> CheckOrderSimulation
CheckDeliveryBuilding
CheckPackingListIsNotDivergent
CheckOrderPackingList
ModifySimulationLineQuantityForMergedLine
Tic
CheckPackingListIsDiverged
AcceptDecisionQuantity
Tic
CheckPackingListIsNotDivergent
CheckPackingListIsSolved
CheckSimulationQuantityUpdatedForMergedLine
File "/home/buildbot/slave/full.ERP5.blade-nxd1-10.6/build/unit_test/Products/ERP5Type/tests/Sequence.py", line 96, in play
method(sequence=sequence)
File "/home/buildbot/slave/full.ERP5.blade-nxd1-10.6/build/unit_test/Products/ERP5/tests/testOrder.py", line 769, in stepCheckOrderSimulation
sequence_list=sequence_list, **kw)
File "/home/buildbot/slave/full.ERP5.blade-nxd1-10.6/build/unit_test/Products/ERP5/tests/testERP5Simulation.py", line 376, in checkOrderRuleSimulation
self.failIfDifferentSet(movement_list, order_movement_list)
File "/home/buildbot/slave/full.ERP5.blade-nxd1-10.6/build/unit_test/Products/ERP5Type/tests/ERP5TypeTestCase.py", line 777, in failIfDifferentSet
self.failUnless(i in b, msg)
AssertionError: [<OrderLine at /erp5_portal_c57d7bf4eafcb9ad2fe2626414f201cd/sale_order_module/9/2>, <OrderLine at /erp5_portal_c57d7bf4eafcb9ad2fe2626414f201cd/sale_order_module/9/1>] != [<OrderLine at /erp5_portal_c57d7bf4eafcb9ad2fe2626414f201cd/sale_order_module/9/2>]
FAIL: test_05d_SimulationChangeResourceOnOneSimulationMovementForMergedLine (testERP5Simulation.TestERP5SimulationPackingList)
----------------------------------------------------------------------
Traceback (most recent call last):
File "/home/buildbot/slave/full.ERP5.blade-nxd1-10.6/build/products/ERP5Type/tests/backportUnittest.py", line 145, in run
testMethod()
File "/home/buildbot/slave/full.ERP5.blade-nxd1-10.6/build/unit_test/Products/ERP5/tests/testPackingList.py", line 1120, in test_05d_SimulationChangeResourceOnOneSimulationMovementForMergedLine
sequence_list.play(self, quiet=quiet)
File "/home/buildbot/slave/full.ERP5.blade-nxd1-10.6/build/unit_test/Products/ERP5Type/tests/Sequence.py", line 192, in play
sequence.play(context, sequence_number=i, quiet=quiet)
File "/home/buildbot/slave/full.ERP5.blade-nxd1-10.6/build/unit_test/Products/ERP5Type/tests/Sequence.py", line 113, in play
self._step_list[self._played_index] \
Current Sequence:
CreateOrganisation1
CreateOrganisation2
CreateOrganisation3
CreateProject1
CreateProject2
CreateOrder
CreateCurrency
SetOrderPriceCurrency
SetOrderProfile
CreateNotVariatedResource
Tic
CreateOrderLine
SetOrderLineResource
SetOrderLineDefaultValues
Tic
CreateOrderLine
SetOrderLineResource
SetOrderLineDefaultValues
OrderOrder
Tic
ConfirmOrder
Tic
> CheckOrderSimulation
CheckDeliveryBuilding
CheckPackingListIsNotDivergent
CheckOrderPackingList
CreateNotVariatedResource
ModifyOneSimulationLineResource
Tic
CheckPackingListIsDiverged
AdoptPrevisionResource
Tic
CheckPackingListIsNotDivergent
CheckPackingListIsSolved
CheckPackingListLineWithDifferentResource
File "/home/buildbot/slave/full.ERP5.blade-nxd1-10.6/build/unit_test/Products/ERP5Type/tests/Sequence.py", line 96, in play
method(sequence=sequence)
File "/home/buildbot/slave/full.ERP5.blade-nxd1-10.6/build/unit_test/Products/ERP5/tests/testOrder.py", line 769, in stepCheckOrderSimulation
sequence_list=sequence_list, **kw)
File "/home/buildbot/slave/full.ERP5.blade-nxd1-10.6/build/unit_test/Products/ERP5/tests/testERP5Simulation.py", line 376, in checkOrderRuleSimulation
self.failIfDifferentSet(movement_list, order_movement_list)
File "/home/buildbot/slave/full.ERP5.blade-nxd1-10.6/build/unit_test/Products/ERP5Type/tests/ERP5TypeTestCase.py", line 777, in failIfDifferentSet
self.failUnless(i in b, msg)
AssertionError: [<OrderLine at /erp5_portal_c57d7bf4eafcb9ad2fe2626414f201cd/sale_order_module/10/2>, <OrderLine at /erp5_portal_c57d7bf4eafcb9ad2fe2626414f201cd/sale_order_module/10/1>] != [<OrderLine at /erp5_portal_c57d7bf4eafcb9ad2fe2626414f201cd/sale_order_module/10/2>]
FAIL: test_05f_SimulationChangeAndPartialAcceptDecision (testERP5Simulation.TestERP5SimulationPackingList)
----------------------------------------------------------------------
Traceback (most recent call last):
File "/home/buildbot/slave/full.ERP5.blade-nxd1-10.6/build/products/ERP5Type/tests/backportUnittest.py", line 145, in run
testMethod()
File "/home/buildbot/slave/full.ERP5.blade-nxd1-10.6/build/unit_test/Products/ERP5/tests/testPackingList.py", line 1167, in test_05f_SimulationChangeAndPartialAcceptDecision
sequence_list.play(self, quiet=quiet)
File "/home/buildbot/slave/full.ERP5.blade-nxd1-10.6/build/unit_test/Products/ERP5Type/tests/Sequence.py", line 192, in play
sequence.play(context, sequence_number=i, quiet=quiet)
File "/home/buildbot/slave/full.ERP5.blade-nxd1-10.6/build/unit_test/Products/ERP5Type/tests/Sequence.py", line 113, in play
self._step_list[self._played_index] \
Current Sequence:
CreateOrganisation1
CreateOrganisation2
CreateOrganisation3
CreateProject1
CreateProject2
CreateOrder
CreateCurrency
SetOrderPriceCurrency
SetOrderProfile
CreateNotVariatedResource
Tic
CreateOrderLine
SetOrderLineResource
SetOrderLineDefaultValues
Tic
CreateOrderLine
SetOrderLineResource
SetOrderLineDefaultValues
OrderOrder
Tic
ConfirmOrder
Tic
> CheckOrderSimulation
CheckDeliveryBuilding
CheckPackingListIsNotDivergent
CheckOrderPackingList
CreateNotVariatedResource
ModifySimulationLineQuantityForMergedLine
ModifyOneSimulationLineResource
ModifySimulationLineStartDate
Tic
CheckPackingListIsDiverged
AcceptDecisionQuantity
Tic
CheckPackingListIsDiverged
AcceptDecisionResource
Tic
CheckPackingListIsDiverged
UnifyStartDateWithDecision
Tic
CheckPackingListIsNotDivergent
CheckPackingListIsSolved
CheckSimulationQuantityUpdatedForMergedLine
File "/home/buildbot/slave/full.ERP5.blade-nxd1-10.6/build/unit_test/Products/ERP5Type/tests/Sequence.py", line 96, in play
method(sequence=sequence)
File "/home/buildbot/slave/full.ERP5.blade-nxd1-10.6/build/unit_test/Products/ERP5/tests/testOrder.py", line 769, in stepCheckOrderSimulation
sequence_list=sequence_list, **kw)
File "/home/buildbot/slave/full.ERP5.blade-nxd1-10.6/build/unit_test/Products/ERP5/tests/testERP5Simulation.py", line 376, in checkOrderRuleSimulation
self.failIfDifferentSet(movement_list, order_movement_list)
File "/home/buildbot/slave/full.ERP5.blade-nxd1-10.6/build/unit_test/Products/ERP5Type/tests/ERP5TypeTestCase.py", line 777, in failIfDifferentSet
self.failUnless(i in b, msg)
AssertionError: [<OrderLine at /erp5_portal_c57d7bf4eafcb9ad2fe2626414f201cd/sale_order_module/12/2>, <OrderLine at /erp5_portal_c57d7bf4eafcb9ad2fe2626414f201cd/sale_order_module/12/1>] != [<OrderLine at /erp5_portal_c57d7bf4eafcb9ad2fe2626414f201cd/sale_order_module/12/2>]
FAIL: test_delivery_mode_and_incoterm_on_invoice (testERP5Simulation.TestERP5SimulationInvoice)
----------------------------------------------------------------------
Traceback (most recent call last):
File "/home/buildbot/slave/full.ERP5.blade-nxd1-10.6/build/products/ERP5Type/tests/backportUnittest.py", line 145, in run
testMethod()
File "/home/buildbot/slave/full.ERP5.blade-nxd1-10.6/build/unit_test/Products/ERP5/tests/testInvoice.py", line 2208, in test_delivery_mode_and_incoterm_on_invoice
order.getDeliveryMode())
AssertionError: None != 'by_mail'
FAIL: test_modify_planned_order_invoicing_rule (testERP5Simulation.TestERP5SimulationInvoice)
----------------------------------------------------------------------
Traceback (most recent call last):
File "/home/buildbot/slave/full.ERP5.blade-nxd1-10.6/build/products/ERP5Type/tests/backportUnittest.py", line 145, in run
testMethod()
File "/home/buildbot/slave/full.ERP5.blade-nxd1-10.6/build/unit_test/Products/ERP5/tests/testInvoice.py", line 1429, in test_modify_planned_order_invoicing_rule
invoice_movement.getResourceValue())
AssertionError: <Resource at /erp5_portal_c57d7bf4eafcb9ad2fe2626414f201cd/product_module/4> != <ApparelModel at /erp5_portal_c57d7bf4eafcb9ad2fe2626414f201cd/apparel_model_module/65>
ERROR: testBPMCopyAndPaste (Products.ERP5.tests.testBPMCore.TestBPMImplementation)
----------------------------------------------------------------------
Traceback (most recent call last):
File "/home/buildbot/slave/full.ERP5.blade-nxd1-10.1/build/products/ERP5Type/tests/backportUnittest.py", line 136, in run
self.setUp()
File "/home/buildbot/slave/full.ERP5.blade-nxd1-10.1/build/unit_test/Products/ERP5Type/tests/ERP5TypeTestCase.py", line 517, in setUp
PortalTestCase.setUp(self)
File "/usr/lib/erp5/lib/python/Testing/ZopeTestCase/PortalTestCase.py", line 62, in setUp
self.afterSetUp()
File "/home/buildbot/slave/full.ERP5.blade-nxd1-10.1/build/unit_test/Products/ERP5/tests/testBPMCore.py", line 208, in afterSetUp
self.createInvoiceTransactionRule()
File "/home/buildbot/slave/full.ERP5.blade-nxd1-10.1/build/unit_test/Products/ERP5/tests/testERP5SimulationBPMCore.py", line 68, in createInvoiceTransactionRule
matching_provider=True)
File "/home/buildbot/slave/full.ERP5.blade-nxd1-10.1/build/unit_test/Products/ERP5Type/Core/Folder.py", line 455, in newContent
return FolderMixIn.newContent(self, *args, **kw)
File "/home/buildbot/slave/full.ERP5.blade-nxd1-10.1/build/unit_test/Products/ERP5Type/Core/Folder.py", line 150, in newContent
raise ValueError('Disallowed subobject type: %s' % portal_type)
ValueError: Disallowed subobject type: Category Membership Divergence Tester
ERROR: test_BuinessPathDynamicCategoryAccessProvider (Products.ERP5.tests.testBPMCore.TestBPMImplementation)
----------------------------------------------------------------------
Traceback (most recent call last):
File "/home/buildbot/slave/full.ERP5.blade-nxd1-10.1/build/products/ERP5Type/tests/backportUnittest.py", line 136, in run
self.setUp()
File "/home/buildbot/slave/full.ERP5.blade-nxd1-10.1/build/unit_test/Products/ERP5Type/tests/ERP5TypeTestCase.py", line 517, in setUp
PortalTestCase.setUp(self)
File "/usr/lib/erp5/lib/python/Testing/ZopeTestCase/PortalTestCase.py", line 62, in setUp
self.afterSetUp()
File "/home/buildbot/slave/full.ERP5.blade-nxd1-10.1/build/unit_test/Products/ERP5/tests/testBPMCore.py", line 208, in afterSetUp
self.createInvoiceTransactionRule()
File "/home/buildbot/slave/full.ERP5.blade-nxd1-10.1/build/unit_test/Products/ERP5/tests/testERP5SimulationBPMCore.py", line 68, in createInvoiceTransactionRule
matching_provider=True)
File "/home/buildbot/slave/full.ERP5.blade-nxd1-10.1/build/unit_test/Products/ERP5Type/Core/Folder.py", line 455, in newContent
return FolderMixIn.newContent(self, *args, **kw)
File "/home/buildbot/slave/full.ERP5.blade-nxd1-10.1/build/unit_test/Products/ERP5Type/Core/Folder.py", line 150, in newContent
raise ValueError('Disallowed subobject type: %s' % portal_type)
ValueError: Disallowed subobject type: Category Membership Divergence Tester
ERROR: test_BuinessPathDynamicCategoryAccessProviderBusinessPathPrecedence (Products.ERP5.tests.testBPMCore.TestBPMImplementation)
----------------------------------------------------------------------
Traceback (most recent call last):
File "/home/buildbot/slave/full.ERP5.blade-nxd1-10.1/build/products/ERP5Type/tests/backportUnittest.py", line 136, in run
self.setUp()
File "/home/buildbot/slave/full.ERP5.blade-nxd1-10.1/build/unit_test/Products/ERP5Type/tests/ERP5TypeTestCase.py", line 517, in setUp
PortalTestCase.setUp(self)
File "/usr/lib/erp5/lib/python/Testing/ZopeTestCase/PortalTestCase.py", line 62, in setUp
self.afterSetUp()
File "/home/buildbot/slave/full.ERP5.blade-nxd1-10.1/build/unit_test/Products/ERP5/tests/testBPMCore.py", line 208, in afterSetUp
self.createInvoiceTransactionRule()
File "/home/buildbot/slave/full.ERP5.blade-nxd1-10.1/build/unit_test/Products/ERP5/tests/testERP5SimulationBPMCore.py", line 68, in createInvoiceTransactionRule
matching_provider=True)
File "/home/buildbot/slave/full.ERP5.blade-nxd1-10.1/build/unit_test/Products/ERP5Type/Core/Folder.py", line 455, in newContent
return FolderMixIn.newContent(self, *args, **kw)
File "/home/buildbot/slave/full.ERP5.blade-nxd1-10.1/build/unit_test/Products/ERP5Type/Core/Folder.py", line 150, in newContent
raise ValueError('Disallowed subobject type: %s' % portal_type)
ValueError: Disallowed subobject type: Category Membership Divergence Tester
ERROR: test_BuinessPathDynamicCategoryAccessProviderEmptyMovement (Products.ERP5.tests.testBPMCore.TestBPMImplementation)
----------------------------------------------------------------------
Traceback (most recent call last):
File "/home/buildbot/slave/full.ERP5.blade-nxd1-10.1/build/products/ERP5Type/tests/backportUnittest.py", line 136, in run
self.setUp()
File "/home/buildbot/slave/full.ERP5.blade-nxd1-10.1/build/unit_test/Products/ERP5Type/tests/ERP5TypeTestCase.py", line 517, in setUp
PortalTestCase.setUp(self)
File "/usr/lib/erp5/lib/python/Testing/ZopeTestCase/PortalTestCase.py", line 62, in setUp
self.afterSetUp()
File "/home/buildbot/slave/full.ERP5.blade-nxd1-10.1/build/unit_test/Products/ERP5/tests/testBPMCore.py", line 208, in afterSetUp
self.createInvoiceTransactionRule()
File "/home/buildbot/slave/full.ERP5.blade-nxd1-10.1/build/unit_test/Products/ERP5/tests/testERP5SimulationBPMCore.py", line 68, in createInvoiceTransactionRule
matching_provider=True)
File "/home/buildbot/slave/full.ERP5.blade-nxd1-10.1/build/unit_test/Products/ERP5Type/Core/Folder.py", line 455, in newContent
return FolderMixIn.newContent(self, *args, **kw)
File "/home/buildbot/slave/full.ERP5.blade-nxd1-10.1/build/unit_test/Products/ERP5Type/Core/Folder.py", line 150, in newContent
raise ValueError('Disallowed subobject type: %s' % portal_type)
ValueError: Disallowed subobject type: Category Membership Divergence Tester
ERROR: test_BusinessPathStandardCategoryAccessProvider (Products.ERP5.tests.testBPMCore.TestBPMImplementation)
----------------------------------------------------------------------
Traceback (most recent call last):
File "/home/buildbot/slave/full.ERP5.blade-nxd1-10.1/build/products/ERP5Type/tests/backportUnittest.py", line 136, in run
self.setUp()
File "/home/buildbot/slave/full.ERP5.blade-nxd1-10.1/build/unit_test/Products/ERP5Type/tests/ERP5TypeTestCase.py", line 517, in setUp
PortalTestCase.setUp(self)
File "/usr/lib/erp5/lib/python/Testing/ZopeTestCase/PortalTestCase.py", line 62, in setUp
self.afterSetUp()
File "/home/buildbot/slave/full.ERP5.blade-nxd1-10.1/build/unit_test/Products/ERP5/tests/testBPMCore.py", line 208, in afterSetUp
self.createInvoiceTransactionRule()
File "/home/buildbot/slave/full.ERP5.blade-nxd1-10.1/build/unit_test/Products/ERP5/tests/testERP5SimulationBPMCore.py", line 68, in createInvoiceTransactionRule
matching_provider=True)
File "/home/buildbot/slave/full.ERP5.blade-nxd1-10.1/build/unit_test/Products/ERP5Type/Core/Folder.py", line 455, in newContent
return FolderMixIn.newContent(self, *args, **kw)
File "/home/buildbot/slave/full.ERP5.blade-nxd1-10.1/build/unit_test/Products/ERP5Type/Core/Folder.py", line 150, in newContent
raise ValueError('Disallowed subobject type: %s' % portal_type)
ValueError: Disallowed subobject type: Category Membership Divergence Tester
ERROR: test_BusinessPath_calculateExpectedDate (Products.ERP5.tests.testBPMCore.TestBPMImplementation)
----------------------------------------------------------------------
Traceback (most recent call last):
File "/home/buildbot/slave/full.ERP5.blade-nxd1-10.1/build/products/ERP5Type/tests/backportUnittest.py", line 136, in run
self.setUp()
File "/home/buildbot/slave/full.ERP5.blade-nxd1-10.1/build/unit_test/Products/ERP5Type/tests/ERP5TypeTestCase.py", line 517, in setUp
PortalTestCase.setUp(self)
File "/usr/lib/erp5/lib/python/Testing/ZopeTestCase/PortalTestCase.py", line 62, in setUp
self.afterSetUp()
File "/home/buildbot/slave/full.ERP5.blade-nxd1-10.1/build/unit_test/Products/ERP5/tests/testBPMCore.py", line 208, in afterSetUp
self.createInvoiceTransactionRule()
File "/home/buildbot/slave/full.ERP5.blade-nxd1-10.1/build/unit_test/Products/ERP5/tests/testERP5SimulationBPMCore.py", line 68, in createInvoiceTransactionRule
matching_provider=True)
File "/home/buildbot/slave/full.ERP5.blade-nxd1-10.1/build/unit_test/Products/ERP5Type/Core/Folder.py", line 455, in newContent
return FolderMixIn.newContent(self, *args, **kw)
File "/home/buildbot/slave/full.ERP5.blade-nxd1-10.1/build/unit_test/Products/ERP5Type/Core/Folder.py", line 150, in newContent
raise ValueError('Disallowed subobject type: %s' % portal_type)
ValueError: Disallowed subobject type: Category Membership Divergence Tester
ERROR: test_BusinessProcess_getPathValueList (Products.ERP5.tests.testBPMCore.TestBPMImplementation)
----------------------------------------------------------------------
Traceback (most recent call last):
File "/home/buildbot/slave/full.ERP5.blade-nxd1-10.1/build/products/ERP5Type/tests/backportUnittest.py", line 136, in run
self.setUp()
File "/home/buildbot/slave/full.ERP5.blade-nxd1-10.1/build/unit_test/Products/ERP5Type/tests/ERP5TypeTestCase.py", line 517, in setUp
PortalTestCase.setUp(self)
File "/usr/lib/erp5/lib/python/Testing/ZopeTestCase/PortalTestCase.py", line 62, in setUp
self.afterSetUp()
File "/home/buildbot/slave/full.ERP5.blade-nxd1-10.1/build/unit_test/Products/ERP5/tests/testBPMCore.py", line 208, in afterSetUp
self.createInvoiceTransactionRule()
File "/home/buildbot/slave/full.ERP5.blade-nxd1-10.1/build/unit_test/Products/ERP5/tests/testERP5SimulationBPMCore.py", line 68, in createInvoiceTransactionRule
matching_provider=True)
File "/home/buildbot/slave/full.ERP5.blade-nxd1-10.1/build/unit_test/Products/ERP5Type/Core/Folder.py", line 455, in newContent
return FolderMixIn.newContent(self, *args, **kw)
File "/home/buildbot/slave/full.ERP5.blade-nxd1-10.1/build/unit_test/Products/ERP5Type/Core/Folder.py", line 150, in newContent
raise ValueError('Disallowed subobject type: %s' % portal_type)
ValueError: Disallowed subobject type: Category Membership Divergence Tester
ERROR: test_BusinessState_getRemainingTradePhaseList (Products.ERP5.tests.testBPMCore.TestBPMImplementation)
----------------------------------------------------------------------
Traceback (most recent call last):
File "/home/buildbot/slave/full.ERP5.blade-nxd1-10.1/build/products/ERP5Type/tests/backportUnittest.py", line 136, in run
self.setUp()
File "/home/buildbot/slave/full.ERP5.blade-nxd1-10.1/build/unit_test/Products/ERP5Type/tests/ERP5TypeTestCase.py", line 517, in setUp
PortalTestCase.setUp(self)
File "/usr/lib/erp5/lib/python/Testing/ZopeTestCase/PortalTestCase.py", line 62, in setUp
self.afterSetUp()
File "/home/buildbot/slave/full.ERP5.blade-nxd1-10.1/build/unit_test/Products/ERP5/tests/testBPMCore.py", line 208, in afterSetUp
self.createInvoiceTransactionRule()
File "/home/buildbot/slave/full.ERP5.blade-nxd1-10.1/build/unit_test/Products/ERP5/tests/testERP5SimulationBPMCore.py", line 68, in createInvoiceTransactionRule
matching_provider=True)
File "/home/buildbot/slave/full.ERP5.blade-nxd1-10.1/build/unit_test/Products/ERP5Type/Core/Folder.py", line 455, in newContent
return FolderMixIn.newContent(self, *args, **kw)
File "/home/buildbot/slave/full.ERP5.blade-nxd1-10.1/build/unit_test/Products/ERP5Type/Core/Folder.py", line 150, in newContent
raise ValueError('Disallowed subobject type: %s' % portal_type)
ValueError: Disallowed subobject type: Category Membership Divergence Tester
ERROR: test_EmptyBusinessPathStandardCategoryAccessProvider (Products.ERP5.tests.testBPMCore.TestBPMImplementation)
----------------------------------------------------------------------
Traceback (most recent call last):
File "/home/buildbot/slave/full.ERP5.blade-nxd1-10.1/build/products/ERP5Type/tests/backportUnittest.py", line 136, in run
self.setUp()
File "/home/buildbot/slave/full.ERP5.blade-nxd1-10.1/build/unit_test/Products/ERP5Type/tests/ERP5TypeTestCase.py", line 517, in setUp
PortalTestCase.setUp(self)
File "/usr/lib/erp5/lib/python/Testing/ZopeTestCase/PortalTestCase.py", line 62, in setUp
self.afterSetUp()
File "/home/buildbot/slave/full.ERP5.blade-nxd1-10.1/build/unit_test/Products/ERP5/tests/testBPMCore.py", line 208, in afterSetUp
self.createInvoiceTransactionRule()
File "/home/buildbot/slave/full.ERP5.blade-nxd1-10.1/build/unit_test/Products/ERP5/tests/testERP5SimulationBPMCore.py", line 68, in createInvoiceTransactionRule
matching_provider=True)
File "/home/buildbot/slave/full.ERP5.blade-nxd1-10.1/build/unit_test/Products/ERP5Type/Core/Folder.py", line 455, in newContent
return FolderMixIn.newContent(self, *args, **kw)
File "/home/buildbot/slave/full.ERP5.blade-nxd1-10.1/build/unit_test/Products/ERP5Type/Core/Folder.py", line 150, in newContent
raise ValueError('Disallowed subobject type: %s' % portal_type)
ValueError: Disallowed subobject type: Category Membership Divergence Tester
ERROR: test_isBuildable_OrderedDeliveredInvoiced (Products.ERP5.tests.testBPMCore.TestBPMisBuildableImplementation), Test isBuildable for ordered, delivered and invoiced sequence
----------------------------------------------------------------------
Traceback (most recent call last):
File "/home/buildbot/slave/full.ERP5.blade-nxd1-10.1/build/products/ERP5Type/tests/backportUnittest.py", line 136, in run
self.setUp()
File "/home/buildbot/slave/full.ERP5.blade-nxd1-10.1/build/unit_test/Products/ERP5Type/tests/ERP5TypeTestCase.py", line 517, in setUp
PortalTestCase.setUp(self)
File "/usr/lib/erp5/lib/python/Testing/ZopeTestCase/PortalTestCase.py", line 62, in setUp
self.afterSetUp()
File "/home/buildbot/slave/full.ERP5.blade-nxd1-10.1/build/unit_test/Products/ERP5/tests/testBPMCore.py", line 619, in afterSetUp
TestBPMMixin.afterSetUp(self)
File "/home/buildbot/slave/full.ERP5.blade-nxd1-10.1/build/unit_test/Products/ERP5/tests/testBPMCore.py", line 208, in afterSetUp
self.createInvoiceTransactionRule()
File "/home/buildbot/slave/full.ERP5.blade-nxd1-10.1/build/unit_test/Products/ERP5/tests/testERP5SimulationBPMCore.py", line 68, in createInvoiceTransactionRule
matching_provider=True)
File "/home/buildbot/slave/full.ERP5.blade-nxd1-10.1/build/unit_test/Products/ERP5Type/Core/Folder.py", line 455, in newContent
return FolderMixIn.newContent(self, *args, **kw)
File "/home/buildbot/slave/full.ERP5.blade-nxd1-10.1/build/unit_test/Products/ERP5Type/Core/Folder.py", line 150, in newContent
raise ValueError('Disallowed subobject type: %s' % portal_type)
ValueError: Disallowed subobject type: Category Membership Divergence Tester
ERROR: test_isBuildable_OrderedInvoicedDelivered (Products.ERP5.tests.testBPMCore.TestBPMisBuildableImplementation), Test isBuildable for ordered, invoiced and delivered sequence
----------------------------------------------------------------------
Traceback (most recent call last):
File "/home/buildbot/slave/full.ERP5.blade-nxd1-10.1/build/products/ERP5Type/tests/backportUnittest.py", line 136, in run
self.setUp()
File "/home/buildbot/slave/full.ERP5.blade-nxd1-10.1/build/unit_test/Products/ERP5Type/tests/ERP5TypeTestCase.py", line 517, in setUp
PortalTestCase.setUp(self)
File "/usr/lib/erp5/lib/python/Testing/ZopeTestCase/PortalTestCase.py", line 62, in setUp
self.afterSetUp()
File "/home/buildbot/slave/full.ERP5.blade-nxd1-10.1/build/unit_test/Products/ERP5/tests/testBPMCore.py", line 619, in afterSetUp
TestBPMMixin.afterSetUp(self)
File "/home/buildbot/slave/full.ERP5.blade-nxd1-10.1/build/unit_test/Products/ERP5/tests/testBPMCore.py", line 208, in afterSetUp
self.createInvoiceTransactionRule()
File "/home/buildbot/slave/full.ERP5.blade-nxd1-10.1/build/unit_test/Products/ERP5/tests/testERP5SimulationBPMCore.py", line 68, in createInvoiceTransactionRule
matching_provider=True)
File "/home/buildbot/slave/full.ERP5.blade-nxd1-10.1/build/unit_test/Products/ERP5Type/Core/Folder.py", line 455, in newContent
return FolderMixIn.newContent(self, *args, **kw)
File "/home/buildbot/slave/full.ERP5.blade-nxd1-10.1/build/unit_test/Products/ERP5Type/Core/Folder.py", line 150, in newContent
raise ValueError('Disallowed subobject type: %s' % portal_type)
ValueError: Disallowed subobject type: Category Membership Divergence Tester
ERROR: test_isCompleted_OrderedDeliveredInvoiced (Products.ERP5.tests.testBPMCore.TestBPMisCompletedImplementation), Test isCompleted for ordered, delivered and invoiced sequence
----------------------------------------------------------------------
Traceback (most recent call last):
File "/home/buildbot/slave/full.ERP5.blade-nxd1-10.1/build/products/ERP5Type/tests/backportUnittest.py", line 136, in run
self.setUp()
File "/home/buildbot/slave/full.ERP5.blade-nxd1-10.1/build/unit_test/Products/ERP5Type/tests/ERP5TypeTestCase.py", line 517, in setUp
PortalTestCase.setUp(self)
File "/usr/lib/erp5/lib/python/Testing/ZopeTestCase/PortalTestCase.py", line 62, in setUp
self.afterSetUp()
File "/home/buildbot/slave/full.ERP5.blade-nxd1-10.1/build/unit_test/Products/ERP5/tests/testBPMCore.py", line 619, in afterSetUp
TestBPMMixin.afterSetUp(self)
File "/home/buildbot/slave/full.ERP5.blade-nxd1-10.1/build/unit_test/Products/ERP5/tests/testBPMCore.py", line 208, in afterSetUp
self.createInvoiceTransactionRule()
File "/home/buildbot/slave/full.ERP5.blade-nxd1-10.1/build/unit_test/Products/ERP5/tests/testERP5SimulationBPMCore.py", line 68, in createInvoiceTransactionRule
matching_provider=True)
File "/home/buildbot/slave/full.ERP5.blade-nxd1-10.1/build/unit_test/Products/ERP5Type/Core/Folder.py", line 455, in newContent
return FolderMixIn.newContent(self, *args, **kw)
File "/home/buildbot/slave/full.ERP5.blade-nxd1-10.1/build/unit_test/Products/ERP5Type/Core/Folder.py", line 150, in newContent
raise ValueError('Disallowed subobject type: %s' % portal_type)
ValueError: Disallowed subobject type: Category Membership Divergence Tester
ERROR: test_isCompleted_OrderedInvoicedDelivered (Products.ERP5.tests.testBPMCore.TestBPMisCompletedImplementation), Test isCompleted for ordered, invoiced and invoiced sequence
----------------------------------------------------------------------
Traceback (most recent call last):
File "/home/buildbot/slave/full.ERP5.blade-nxd1-10.1/build/products/ERP5Type/tests/backportUnittest.py", line 136, in run
self.setUp()
File "/home/buildbot/slave/full.ERP5.blade-nxd1-10.1/build/unit_test/Products/ERP5Type/tests/ERP5TypeTestCase.py", line 517, in setUp
PortalTestCase.setUp(self)
File "/usr/lib/erp5/lib/python/Testing/ZopeTestCase/PortalTestCase.py", line 62, in setUp
self.afterSetUp()
File "/home/buildbot/slave/full.ERP5.blade-nxd1-10.1/build/unit_test/Products/ERP5/tests/testBPMCore.py", line 619, in afterSetUp
TestBPMMixin.afterSetUp(self)
File "/home/buildbot/slave/full.ERP5.blade-nxd1-10.1/build/unit_test/Products/ERP5/tests/testBPMCore.py", line 208, in afterSetUp
self.createInvoiceTransactionRule()
File "/home/buildbot/slave/full.ERP5.blade-nxd1-10.1/build/unit_test/Products/ERP5/tests/testERP5SimulationBPMCore.py", line 68, in createInvoiceTransactionRule
matching_provider=True)
File "/home/buildbot/slave/full.ERP5.blade-nxd1-10.1/build/unit_test/Products/ERP5Type/Core/Folder.py", line 455, in newContent
return FolderMixIn.newContent(self, *args, **kw)
File "/home/buildbot/slave/full.ERP5.blade-nxd1-10.1/build/unit_test/Products/ERP5Type/Core/Folder.py", line 150, in newContent
raise ValueError('Disallowed subobject type: %s' % portal_type)
ValueError: Disallowed subobject type: Category Membership Divergence Tester
ERROR: test_isFrozen_OrderedDeliveredInvoiced (Products.ERP5.tests.testBPMCore.TestBPMisFrozenImplementation), Test isFrozen for ordered, delivered and invoiced sequence
----------------------------------------------------------------------
Traceback (most recent call last):
File "/home/buildbot/slave/full.ERP5.blade-nxd1-10.1/build/products/ERP5Type/tests/backportUnittest.py", line 136, in run
self.setUp()
File "/home/buildbot/slave/full.ERP5.blade-nxd1-10.1/build/unit_test/Products/ERP5Type/tests/ERP5TypeTestCase.py", line 517, in setUp
PortalTestCase.setUp(self)
File "/usr/lib/erp5/lib/python/Testing/ZopeTestCase/PortalTestCase.py", line 62, in setUp
self.afterSetUp()
File "/home/buildbot/slave/full.ERP5.blade-nxd1-10.1/build/unit_test/Products/ERP5/tests/testBPMCore.py", line 619, in afterSetUp
TestBPMMixin.afterSetUp(self)
File "/home/buildbot/slave/full.ERP5.blade-nxd1-10.1/build/unit_test/Products/ERP5/tests/testBPMCore.py", line 208, in afterSetUp
self.createInvoiceTransactionRule()
File "/home/buildbot/slave/full.ERP5.blade-nxd1-10.1/build/unit_test/Products/ERP5/tests/testERP5SimulationBPMCore.py", line 68, in createInvoiceTransactionRule
matching_provider=True)
File "/home/buildbot/slave/full.ERP5.blade-nxd1-10.1/build/unit_test/Products/ERP5Type/Core/Folder.py", line 455, in newContent
return FolderMixIn.newContent(self, *args, **kw)
File "/home/buildbot/slave/full.ERP5.blade-nxd1-10.1/build/unit_test/Products/ERP5Type/Core/Folder.py", line 150, in newContent
raise ValueError('Disallowed subobject type: %s' % portal_type)
ValueError: Disallowed subobject type: Category Membership Divergence Tester
ERROR: test_isFrozen_OrderedInvoicedDelivered (Products.ERP5.tests.testBPMCore.TestBPMisFrozenImplementation), Test isFrozen for ordered, invoiced and invoiced sequence
----------------------------------------------------------------------
Traceback (most recent call last):
File "/home/buildbot/slave/full.ERP5.blade-nxd1-10.1/build/products/ERP5Type/tests/backportUnittest.py", line 136, in run
self.setUp()
File "/home/buildbot/slave/full.ERP5.blade-nxd1-10.1/build/unit_test/Products/ERP5Type/tests/ERP5TypeTestCase.py", line 517, in setUp
PortalTestCase.setUp(self)
File "/usr/lib/erp5/lib/python/Testing/ZopeTestCase/PortalTestCase.py", line 62, in setUp
self.afterSetUp()
File "/home/buildbot/slave/full.ERP5.blade-nxd1-10.1/build/unit_test/Products/ERP5/tests/testBPMCore.py", line 619, in afterSetUp
TestBPMMixin.afterSetUp(self)
File "/home/buildbot/slave/full.ERP5.blade-nxd1-10.1/build/unit_test/Products/ERP5/tests/testBPMCore.py", line 208, in afterSetUp
self.createInvoiceTransactionRule()
File "/home/buildbot/slave/full.ERP5.blade-nxd1-10.1/build/unit_test/Products/ERP5/tests/testERP5SimulationBPMCore.py", line 68, in createInvoiceTransactionRule
matching_provider=True)
File "/home/buildbot/slave/full.ERP5.blade-nxd1-10.1/build/unit_test/Products/ERP5Type/Core/Folder.py", line 455, in newContent
return FolderMixIn.newContent(self, *args, **kw)
File "/home/buildbot/slave/full.ERP5.blade-nxd1-10.1/build/unit_test/Products/ERP5Type/Core/Folder.py", line 150, in newContent
raise ValueError('Disallowed subobject type: %s' % portal_type)
ValueError: Disallowed subobject type: Category Membership Divergence Tester
ERROR: test_Products.ERP5Type.ConsistencyMessage_ConsistencyMessage_implements_IConsistencyMessage (testERP5TypeInterfaces.TestERP5TypeInterfaces)
----------------------------------------------------------------------
Traceback (most recent call last):
File "/home/buildbot/slave/full.ERP5.blade-nxd1-10.5/build/products/ERP5Type/tests/backportUnittest.py", line 145, in run
testMethod()
File "/home/buildbot/slave/full.ERP5.blade-nxd1-10.5/build/Products/ERP5Type/tests/testERP5TypeInterfaces.py", line 66, in testMethod
verifyClass(Interface, Klass)
File "/usr/lib/erp5/lib/python/zope/interface/verify.py", line 90, in verifyClass
return _verify(iface, candidate, tentative, vtype='c')
File "/usr/lib/erp5/lib/python/zope/interface/verify.py", line 60, in _verify
raise BrokenImplementation(iface, n)
BrokenImplementation: An object has failed to implement interface <InterfaceClass Products.ERP5Type.interfaces.consistency_message.IConsistencyMessage>
The fix attribute was not provided.
FAIL: test_02_Table_07_CellFormat (testFormPrintoutAsODT.TestFormPrintoutAsODT), 7. Normal case: make sure that it is enable to use ODF cell format setting in FormPrintout
----------------------------------------------------------------------
Traceback (most recent call last):
File "/home/buildbot/slave/full.ERP5.blade-nxd1-10.1/build/products/ERP5Type/tests/backportUnittest.py", line 145, in run
testMethod()
File "/home/buildbot/slave/full.ERP5.blade-nxd1-10.1/build/unit_test/Products/ERP5OOo/tests/testFormPrintoutAsODT.py", line 633, in test_02_Table_07_CellFormat
self.assertEqual(date_column.attrib[date_value_attrib], '2009-04-20')
AssertionError: '2009-04-19' != '2009-04-20'
FAIL: test_01_renderEvent (testICal.TestICal)
----------------------------------------------------------------------
Traceback (most recent call last):
File "/home/buildbot/slave/full.ERP5.blade-nxd1-10.2/build/products/ERP5Type/tests/backportUnittest.py", line 145, in run
testMethod()
File "/home/buildbot/slave/full.ERP5.blade-nxd1-10.2/build/unit_test/Products/ERP5/tests/testICal.py", line 151, in test_01_renderEvent
self.assertEquals( # if this fail for you, try to set $TZ to Europe/Paris
AssertionError: '20070815T143000Z' != '20070815T083000Z'
ERROR: test_10_AcceptDecisionOnPackingList (testInvoice.TestSaleInvoice)
----------------------------------------------------------------------
Traceback (most recent call last):
File "/home/buildbot/slave/full.ERP5.blade-nxd1-10.5/build/products/ERP5Type/tests/backportUnittest.py", line 145, in run
testMethod()
File "/home/buildbot/slave/full.ERP5.blade-nxd1-10.5/build/unit_test/Products/ERP5/tests/testInvoice.py", line 2936, in test_10_AcceptDecisionOnPackingList
sequence_list.play(self, quiet=quiet)
File "/home/buildbot/slave/full.ERP5.blade-nxd1-10.5/build/unit_test/Products/ERP5Type/tests/Sequence.py", line 192, in play
sequence.play(context, sequence_number=i, quiet=quiet)
File "/home/buildbot/slave/full.ERP5.blade-nxd1-10.5/build/unit_test/Products/ERP5Type/tests/Sequence.py", line 113, in play
self._step_list[self._played_index] \
Current Sequence:
CreateEntities
CreateCurrency
CreateSaleInvoiceTransactionRule
CreateOrder
SetOrderProfile
SetOrderPriceCurrency
CreateNotVariatedResource
Tic
CreateOrderLine
SetOrderLineResource
SetOrderLineDefaultValues
OrderOrder
Tic
CheckDeliveryBuilding
ConfirmOrder
Tic
CheckOrderRule
CheckOrderSimulation
CheckDeliveryBuilding
AddPackingListContainer
AddPackingListContainerLine
SetContainerLineFullQuantity
Tic
CheckPackingListIsPacked
CheckInvoicingRule
DecreasePackingListLineQuantity
SetContainerFullQuantity
CheckPackingListIsCalculating
Tic
CheckPackingListIsDiverged
AcceptDecisionQuantity
Tic
CheckPackingListIsSolved
CheckPackingListNotSplitted
SetReadyPackingList
Tic
StartPackingList
CheckInvoicingRule
CheckInvoiceTransactionRule
Tic
CheckInvoiceBuilding
StopPackingList
Tic
DeliverPackingList
Tic
CheckPackingListIsNotDivergent
CheckPackingListIsSolved
CheckInvoiceTransactionRule
StartInvoice
Tic
StopInvoice
Tic
DeliverInvoice
Tic
CheckInvoiceNotSplitted
CheckInvoiceIsNotDivergent
CheckInvoiceIsSolved
RebuildAndCheckNothingIsCreated
CheckInvoicesConsistency
> Pdb
File "/home/buildbot/slave/full.ERP5.blade-nxd1-10.5/build/unit_test/Products/ERP5Type/tests/Sequence.py", line 96, in play
method(sequence=sequence)
File "/home/buildbot/slave/full.ERP5.blade-nxd1-10.5/build/unit_test/Products/ERP5Type/tests/ERP5TypeTestCase.py", line 1060, in stepPdb
tracer()
File "/usr/lib64/python2.4/bdb.py", line 52, in trace_dispatch
return self.dispatch_return(frame, arg)
File "/usr/lib64/python2.4/bdb.py", line 86, in dispatch_return
if self.quitting: raise BdbQuit
BdbQuit
FAIL: test_delivery_mode_and_incoterm_on_invoice (testInvoice.TestSaleInvoice)
----------------------------------------------------------------------
Traceback (most recent call last):
File "/home/buildbot/slave/full.ERP5.blade-nxd1-10.5/build/products/ERP5Type/tests/backportUnittest.py", line 145, in run
testMethod()
File "/home/buildbot/slave/full.ERP5.blade-nxd1-10.5/build/unit_test/Products/ERP5/tests/testInvoice.py", line 2208, in test_delivery_mode_and_incoterm_on_invoice
order.getDeliveryMode())
AssertionError: None != 'by_mail'
FAIL: test_delivery_mode_and_incoterm_on_invoice (testInvoice.TestPurchaseInvoice)
----------------------------------------------------------------------
Traceback (most recent call last):
File "/home/buildbot/slave/full.ERP5.blade-nxd1-10.5/build/products/ERP5Type/tests/backportUnittest.py", line 145, in run
testMethod()
File "/home/buildbot/slave/full.ERP5.blade-nxd1-10.5/build/unit_test/Products/ERP5/tests/testInvoice.py", line 2208, in test_delivery_mode_and_incoterm_on_invoice
order.getDeliveryMode())
AssertionError: None != 'by_mail'
ERROR: test_01_ItemSimpleTest (testItem.TestItem)
----------------------------------------------------------------------
Traceback (most recent call last):
File "/home/buildbot/slave/full.ERP5.blade-nxd1-10.1/build/products/ERP5Type/tests/backportUnittest.py", line 145, in run
testMethod()
File "/home/buildbot/slave/full.ERP5.blade-nxd1-10.1/build/unit_test/Products/ERP5/tests/testItem.py", line 221, in test_01_ItemSimpleTest
sequence_list.play(self, quiet=quiet)
File "/home/buildbot/slave/full.ERP5.blade-nxd1-10.1/build/unit_test/Products/ERP5Type/tests/Sequence.py", line 192, in play
sequence.play(context, sequence_number=i, quiet=quiet)
File "/home/buildbot/slave/full.ERP5.blade-nxd1-10.1/build/unit_test/Products/ERP5Type/tests/Sequence.py", line 113, in play
self._step_list[self._played_index] \
Current Sequence:
CreateOrganisation1
CreateOrganisation2
CreateOrganisation3
CreateItemList
CreateOrder
SetOrderProfile
CreateNotVariatedResource
Tic
CreateOrderLine
SetOrderLineResource
SetOrderLineDefaultValues
OrderLineSetAggregationList
ConfirmOrder
Tic
CheckOrderLineAggregate
CheckOrderSimulation
> CheckSimulationAggregate
CheckDeliveryBuilding
CheckPackingListLineAggregate
CheckPackingListIsNotDivergent
File "/home/buildbot/slave/full.ERP5.blade-nxd1-10.1/build/unit_test/Products/ERP5Type/tests/Sequence.py", line 96, in play
method(sequence=sequence)
File "/home/buildbot/slave/full.ERP5.blade-nxd1-10.1/build/unit_test/Products/ERP5/tests/testItem.py", line 165, in stepCheckSimulationAggregate
self.checkAggregate(line=simulation_movement, sequence=sequence)
File "/home/buildbot/slave/full.ERP5.blade-nxd1-10.1/build/unit_test/Products/ERP5/tests/testItem.py", line 184, in checkAggregate
self.assertEquals(len(line.getAggregateList()),1)
AttributeError: 'NoneType' object has no attribute 'getAggregateList'
ERROR: test_02_ItemWithInvoice (testItem.TestItem)
----------------------------------------------------------------------
Traceback (most recent call last):
File "/home/buildbot/slave/full.ERP5.blade-nxd1-10.1/build/products/ERP5Type/tests/backportUnittest.py", line 145, in run
testMethod()
File "/home/buildbot/slave/full.ERP5.blade-nxd1-10.1/build/unit_test/Products/ERP5/tests/testItem.py", line 265, in test_02_ItemWithInvoice
sequence_list.play(self, quiet=quiet)
File "/home/buildbot/slave/full.ERP5.blade-nxd1-10.1/build/unit_test/Products/ERP5Type/tests/Sequence.py", line 192, in play
sequence.play(context, sequence_number=i, quiet=quiet)
File "/home/buildbot/slave/full.ERP5.blade-nxd1-10.1/build/unit_test/Products/ERP5Type/tests/Sequence.py", line 113, in play
self._step_list[self._played_index] \
Current Sequence:
CreateEntities
CreateCurrency
CreateItemList
CreateSaleInvoiceTransactionRule
CreateOrder
SetOrderProfile
SetOrderPriceCurrency
CreateNotVariatedResource
Tic
CreateOrderLine
SetOrderLineResource
SetOrderLineDefaultValues
OrderLineSetAggregationList
ConfirmOrder
Tic
CheckOrderRule
CheckOrderLineAggregate
CheckOrderSimulation
> CheckSimulationAggregate
CheckDeliveryBuilding
CheckPackingListLineAggregate
AddPackingListContainer
AddPackingListContainerLine
SetContainerLineFullQuantity
Tic
CheckPackingListIsPacked
SetReadyPackingList
Tic
StartPackingList
CheckInvoicingRule
Tic
CheckInvoiceBuilding
RebuildAndCheckNothingIsCreated
CheckInvoicesConsistency
CheckInvoiceLineAggregate
File "/home/buildbot/slave/full.ERP5.blade-nxd1-10.1/build/unit_test/Products/ERP5Type/tests/Sequence.py", line 96, in play
method(sequence=sequence)
File "/home/buildbot/slave/full.ERP5.blade-nxd1-10.1/build/unit_test/Products/ERP5/tests/testItem.py", line 165, in stepCheckSimulationAggregate
self.checkAggregate(line=simulation_movement, sequence=sequence)
File "/home/buildbot/slave/full.ERP5.blade-nxd1-10.1/build/unit_test/Products/ERP5/tests/testItem.py", line 184, in checkAggregate
self.assertEquals(len(line.getAggregateList()),1)
AttributeError: 'NoneType' object has no attribute 'getAggregateList'
ERROR: test_01_testProductionSimulationExpand (testLegacyProductionOrder.TestProductionOrder)
----------------------------------------------------------------------
Traceback (most recent call last):
File "/home/buildbot/slave/full.ERP5.blade-nxd1-10.3/build/products/ERP5Type/tests/backportUnittest.py", line 145, in run
testMethod()
File "/home/buildbot/slave/full.ERP5.blade-nxd1-10.3/build/unit_test/Products/ERP5Legacy/tests/testLegacyProductionOrder.py", line 1331, in test_01_testProductionSimulationExpand
sequence_list.play(self)
File "/home/buildbot/slave/full.ERP5.blade-nxd1-10.3/build/unit_test/Products/ERP5Type/tests/Sequence.py", line 192, in play
sequence.play(context, sequence_number=i, quiet=quiet)
File "/home/buildbot/slave/full.ERP5.blade-nxd1-10.3/build/unit_test/Products/ERP5Type/tests/Sequence.py", line 113, in play
self._step_list[self._played_index] \
Current Sequence:
ClearActivities
CreateProductionOrganisation1
CreateProductionSC
CreateNotVariatedResource
CreateComponent1
CreateTransformation
CreateOrganisation
CreateOrder
CreateOrderLine
Tic
OrderOrder
> Tic
CheckProductionSimulation
File "/home/buildbot/slave/full.ERP5.blade-nxd1-10.3/build/unit_test/Products/ERP5Type/tests/Sequence.py", line 96, in play
method(sequence=sequence)
File "/home/buildbot/slave/full.ERP5.blade-nxd1-10.3/build/unit_test/Products/ERP5Type/tests/ERP5TypeTestCase.py", line 1071, in stepTic
self.tic()
File "/home/buildbot/slave/full.ERP5.blade-nxd1-10.3/build/unit_test/Products/ERP5Type/tests/ERP5TypeTestCase.py", line 719, in tic
raise RuntimeError,\
RuntimeError: tic is looping forever. These messages are pending: [('/erp5_portal_f9d5a9e0588ba4ee252164b55d086e03/product_module/1', 'immediateReindexObject', -1, 0)]
ERROR: test_02_testSourcingSimulationExpand (testLegacyProductionOrder.TestProductionOrder)
----------------------------------------------------------------------
Traceback (most recent call last):
File "/home/buildbot/slave/full.ERP5.blade-nxd1-10.3/build/products/ERP5Type/tests/backportUnittest.py", line 136, in run
self.setUp()
File "/home/buildbot/slave/full.ERP5.blade-nxd1-10.3/build/unit_test/Products/ERP5Type/tests/ERP5TypeTestCase.py", line 517, in setUp
PortalTestCase.setUp(self)
File "/usr/lib/erp5/lib/python/Testing/ZopeTestCase/PortalTestCase.py", line 62, in setUp
self.afterSetUp()
File "/home/buildbot/slave/full.ERP5.blade-nxd1-10.3/build/unit_test/Products/ERP5Legacy/tests/testLegacyProductionOrder.py", line 91, in afterSetUp
TestOrderMixin.afterSetUp(self)
File "/home/buildbot/slave/full.ERP5.blade-nxd1-10.3/build/unit_test/Products/ERP5Legacy/tests/testLegacyOrder.py", line 101, in afterSetUp
self.setUpPreferences()
File "/home/buildbot/slave/full.ERP5.blade-nxd1-10.3/build/unit_test/Products/ERP5Legacy/tests/testLegacyProductionOrder.py", line 88, in setUpPreferences
self.tic()
File "/home/buildbot/slave/full.ERP5.blade-nxd1-10.3/build/unit_test/Products/ERP5Type/tests/ERP5TypeTestCase.py", line 719, in tic
raise RuntimeError,\
RuntimeError: tic is looping forever. These messages are pending: [('/erp5_portal_f9d5a9e0588ba4ee252164b55d086e03/product_module/1', 'immediateReindexObject', -1, 0)]
ERROR: test_03_testIndustrialPhase (testLegacyProductionOrder.TestProductionOrder)
----------------------------------------------------------------------
Traceback (most recent call last):
File "/home/buildbot/slave/full.ERP5.blade-nxd1-10.3/build/products/ERP5Type/tests/backportUnittest.py", line 136, in run
self.setUp()
File "/home/buildbot/slave/full.ERP5.blade-nxd1-10.3/build/unit_test/Products/ERP5Type/tests/ERP5TypeTestCase.py", line 517, in setUp
PortalTestCase.setUp(self)
File "/usr/lib/erp5/lib/python/Testing/ZopeTestCase/PortalTestCase.py", line 62, in setUp
self.afterSetUp()
File "/home/buildbot/slave/full.ERP5.blade-nxd1-10.3/build/unit_test/Products/ERP5Legacy/tests/testLegacyProductionOrder.py", line 91, in afterSetUp
TestOrderMixin.afterSetUp(self)
File "/home/buildbot/slave/full.ERP5.blade-nxd1-10.3/build/unit_test/Products/ERP5Legacy/tests/testLegacyOrder.py", line 101, in afterSetUp
self.setUpPreferences()
File "/home/buildbot/slave/full.ERP5.blade-nxd1-10.3/build/unit_test/Products/ERP5Legacy/tests/testLegacyProductionOrder.py", line 88, in setUpPreferences
self.tic()
File "/home/buildbot/slave/full.ERP5.blade-nxd1-10.3/build/unit_test/Products/ERP5Type/tests/ERP5TypeTestCase.py", line 719, in tic
raise RuntimeError,\
RuntimeError: tic is looping forever. These messages are pending: [('/erp5_portal_f9d5a9e0588ba4ee252164b55d086e03/product_module/1', 'immediateReindexObject', -1, 0)]
ERROR: test_04_testProductionSimulationBuild (testLegacyProductionOrder.TestProductionOrder)
----------------------------------------------------------------------
Traceback (most recent call last):
File "/home/buildbot/slave/full.ERP5.blade-nxd1-10.3/build/products/ERP5Type/tests/backportUnittest.py", line 136, in run
self.setUp()
File "/home/buildbot/slave/full.ERP5.blade-nxd1-10.3/build/unit_test/Products/ERP5Type/tests/ERP5TypeTestCase.py", line 517, in setUp
PortalTestCase.setUp(self)
File "/usr/lib/erp5/lib/python/Testing/ZopeTestCase/PortalTestCase.py", line 62, in setUp
self.afterSetUp()
File "/home/buildbot/slave/full.ERP5.blade-nxd1-10.3/build/unit_test/Products/ERP5Legacy/tests/testLegacyProductionOrder.py", line 91, in afterSetUp
TestOrderMixin.afterSetUp(self)
File "/home/buildbot/slave/full.ERP5.blade-nxd1-10.3/build/unit_test/Products/ERP5Legacy/tests/testLegacyOrder.py", line 101, in afterSetUp
self.setUpPreferences()
File "/home/buildbot/slave/full.ERP5.blade-nxd1-10.3/build/unit_test/Products/ERP5Legacy/tests/testLegacyProductionOrder.py", line 88, in setUpPreferences
self.tic()
File "/home/buildbot/slave/full.ERP5.blade-nxd1-10.3/build/unit_test/Products/ERP5Type/tests/ERP5TypeTestCase.py", line 719, in tic
raise RuntimeError,\
RuntimeError: tic is looping forever. These messages are pending: [('/erp5_portal_f9d5a9e0588ba4ee252164b55d086e03/product_module/1', 'immediateReindexObject', -1, 0)]
ERROR: test_05_testSourcingSimulationBuild (testLegacyProductionOrder.TestProductionOrder)
----------------------------------------------------------------------
Traceback (most recent call last):
File "/home/buildbot/slave/full.ERP5.blade-nxd1-10.3/build/products/ERP5Type/tests/backportUnittest.py", line 136, in run
self.setUp()
File "/home/buildbot/slave/full.ERP5.blade-nxd1-10.3/build/unit_test/Products/ERP5Type/tests/ERP5TypeTestCase.py", line 517, in setUp
PortalTestCase.setUp(self)
File "/usr/lib/erp5/lib/python/Testing/ZopeTestCase/PortalTestCase.py", line 62, in setUp
self.afterSetUp()
File "/home/buildbot/slave/full.ERP5.blade-nxd1-10.3/build/unit_test/Products/ERP5Legacy/tests/testLegacyProductionOrder.py", line 91, in afterSetUp
TestOrderMixin.afterSetUp(self)
File "/home/buildbot/slave/full.ERP5.blade-nxd1-10.3/build/unit_test/Products/ERP5Legacy/tests/testLegacyOrder.py", line 101, in afterSetUp
self.setUpPreferences()
File "/home/buildbot/slave/full.ERP5.blade-nxd1-10.3/build/unit_test/Products/ERP5Legacy/tests/testLegacyProductionOrder.py", line 88, in setUpPreferences
self.tic()
File "/home/buildbot/slave/full.ERP5.blade-nxd1-10.3/build/unit_test/Products/ERP5Type/tests/ERP5TypeTestCase.py", line 719, in tic
raise RuntimeError,\
RuntimeError: tic is looping forever. These messages are pending: [('/erp5_portal_f9d5a9e0588ba4ee252164b55d086e03/product_module/1', 'immediateReindexObject', -1, 0)]
ERROR: test_06_testIndustrialPhase (testLegacyProductionOrder.TestProductionOrder)
----------------------------------------------------------------------
Traceback (most recent call last):
File "/home/buildbot/slave/full.ERP5.blade-nxd1-10.3/build/products/ERP5Type/tests/backportUnittest.py", line 136, in run
self.setUp()
File "/home/buildbot/slave/full.ERP5.blade-nxd1-10.3/build/unit_test/Products/ERP5Type/tests/ERP5TypeTestCase.py", line 517, in setUp
PortalTestCase.setUp(self)
File "/usr/lib/erp5/lib/python/Testing/ZopeTestCase/PortalTestCase.py", line 62, in setUp
self.afterSetUp()
File "/home/buildbot/slave/full.ERP5.blade-nxd1-10.3/build/unit_test/Products/ERP5Legacy/tests/testLegacyProductionOrder.py", line 91, in afterSetUp
TestOrderMixin.afterSetUp(self)
File "/home/buildbot/slave/full.ERP5.blade-nxd1-10.3/build/unit_test/Products/ERP5Legacy/tests/testLegacyOrder.py", line 101, in afterSetUp
self.setUpPreferences()
File "/home/buildbot/slave/full.ERP5.blade-nxd1-10.3/build/unit_test/Products/ERP5Legacy/tests/testLegacyProductionOrder.py", line 88, in setUpPreferences
self.tic()
File "/home/buildbot/slave/full.ERP5.blade-nxd1-10.3/build/unit_test/Products/ERP5Type/tests/ERP5TypeTestCase.py", line 719, in tic
raise RuntimeError,\
RuntimeError: tic is looping forever. These messages are pending: [('/erp5_portal_f9d5a9e0588ba4ee252164b55d086e03/product_module/1', 'immediateReindexObject', -1, 0)]
ERROR: test_07_testTransformationInteractionProductionOrderLine (testLegacyProductionOrder.TestProductionOrder)
----------------------------------------------------------------------
Traceback (most recent call last):
File "/home/buildbot/slave/full.ERP5.blade-nxd1-10.3/build/products/ERP5Type/tests/backportUnittest.py", line 136, in run
self.setUp()
File "/home/buildbot/slave/full.ERP5.blade-nxd1-10.3/build/unit_test/Products/ERP5Type/tests/ERP5TypeTestCase.py", line 517, in setUp
PortalTestCase.setUp(self)
File "/usr/lib/erp5/lib/python/Testing/ZopeTestCase/PortalTestCase.py", line 62, in setUp
self.afterSetUp()
File "/home/buildbot/slave/full.ERP5.blade-nxd1-10.3/build/unit_test/Products/ERP5Legacy/tests/testLegacyProductionOrder.py", line 91, in afterSetUp
TestOrderMixin.afterSetUp(self)
File "/home/buildbot/slave/full.ERP5.blade-nxd1-10.3/build/unit_test/Products/ERP5Legacy/tests/testLegacyOrder.py", line 101, in afterSetUp
self.setUpPreferences()
File "/home/buildbot/slave/full.ERP5.blade-nxd1-10.3/build/unit_test/Products/ERP5Legacy/tests/testLegacyProductionOrder.py", line 88, in setUpPreferences
self.tic()
File "/home/buildbot/slave/full.ERP5.blade-nxd1-10.3/build/unit_test/Products/ERP5Type/tests/ERP5TypeTestCase.py", line 719, in tic
raise RuntimeError,\
RuntimeError: tic is looping forever. These messages are pending: [('/erp5_portal_f9d5a9e0588ba4ee252164b55d086e03/product_module/1', 'immediateReindexObject', -1, 0)]
ERROR: test_08_testTransformationWithEfficiency (testLegacyProductionOrder.TestProductionOrder)
----------------------------------------------------------------------
Traceback (most recent call last):
File "/home/buildbot/slave/full.ERP5.blade-nxd1-10.3/build/products/ERP5Type/tests/backportUnittest.py", line 136, in run
self.setUp()
File "/home/buildbot/slave/full.ERP5.blade-nxd1-10.3/build/unit_test/Products/ERP5Type/tests/ERP5TypeTestCase.py", line 517, in setUp
PortalTestCase.setUp(self)
File "/usr/lib/erp5/lib/python/Testing/ZopeTestCase/PortalTestCase.py", line 62, in setUp
self.afterSetUp()
File "/home/buildbot/slave/full.ERP5.blade-nxd1-10.3/build/unit_test/Products/ERP5Legacy/tests/testLegacyProductionOrder.py", line 91, in afterSetUp
TestOrderMixin.afterSetUp(self)
File "/home/buildbot/slave/full.ERP5.blade-nxd1-10.3/build/unit_test/Products/ERP5Legacy/tests/testLegacyOrder.py", line 101, in afterSetUp
self.setUpPreferences()
File "/home/buildbot/slave/full.ERP5.blade-nxd1-10.3/build/unit_test/Products/ERP5Legacy/tests/testLegacyProductionOrder.py", line 88, in setUpPreferences
self.tic()
File "/home/buildbot/slave/full.ERP5.blade-nxd1-10.3/build/unit_test/Products/ERP5Type/tests/ERP5TypeTestCase.py", line 719, in tic
raise RuntimeError,\
RuntimeError: tic is looping forever. These messages are pending: [('/erp5_portal_f9d5a9e0588ba4ee252164b55d086e03/product_module/1', 'immediateReindexObject', -1, 0)]
ERROR: test_09_testTransformationWithVariation (testLegacyProductionOrder.TestProductionOrder)
----------------------------------------------------------------------
Traceback (most recent call last):
File "/home/buildbot/slave/full.ERP5.blade-nxd1-10.3/build/products/ERP5Type/tests/backportUnittest.py", line 136, in run
self.setUp()
File "/home/buildbot/slave/full.ERP5.blade-nxd1-10.3/build/unit_test/Products/ERP5Type/tests/ERP5TypeTestCase.py", line 517, in setUp
PortalTestCase.setUp(self)
File "/usr/lib/erp5/lib/python/Testing/ZopeTestCase/PortalTestCase.py", line 62, in setUp
self.afterSetUp()
File "/home/buildbot/slave/full.ERP5.blade-nxd1-10.3/build/unit_test/Products/ERP5Legacy/tests/testLegacyProductionOrder.py", line 91, in afterSetUp
TestOrderMixin.afterSetUp(self)
File "/home/buildbot/slave/full.ERP5.blade-nxd1-10.3/build/unit_test/Products/ERP5Legacy/tests/testLegacyOrder.py", line 101, in afterSetUp
self.setUpPreferences()
File "/home/buildbot/slave/full.ERP5.blade-nxd1-10.3/build/unit_test/Products/ERP5Legacy/tests/testLegacyProductionOrder.py", line 88, in setUpPreferences
self.tic()
File "/home/buildbot/slave/full.ERP5.blade-nxd1-10.3/build/unit_test/Products/ERP5Type/tests/ERP5TypeTestCase.py", line 719, in tic
raise RuntimeError,\
RuntimeError: tic is looping forever. These messages are pending: [('/erp5_portal_f9d5a9e0588ba4ee252164b55d086e03/product_module/1', 'immediateReindexObject', -1, 0)]
ERROR: test_50_testCopyPaste (testLegacyProductionOrder.TestProductionOrder)
----------------------------------------------------------------------
Traceback (most recent call last):
File "/home/buildbot/slave/full.ERP5.blade-nxd1-10.3/build/products/ERP5Type/tests/backportUnittest.py", line 136, in run
self.setUp()
File "/home/buildbot/slave/full.ERP5.blade-nxd1-10.3/build/unit_test/Products/ERP5Type/tests/ERP5TypeTestCase.py", line 517, in setUp
PortalTestCase.setUp(self)
File "/usr/lib/erp5/lib/python/Testing/ZopeTestCase/PortalTestCase.py", line 62, in setUp
self.afterSetUp()
File "/home/buildbot/slave/full.ERP5.blade-nxd1-10.3/build/unit_test/Products/ERP5Legacy/tests/testLegacyProductionOrder.py", line 91, in afterSetUp
TestOrderMixin.afterSetUp(self)
File "/home/buildbot/slave/full.ERP5.blade-nxd1-10.3/build/unit_test/Products/ERP5Legacy/tests/testLegacyOrder.py", line 101, in afterSetUp
self.setUpPreferences()
File "/home/buildbot/slave/full.ERP5.blade-nxd1-10.3/build/unit_test/Products/ERP5Legacy/tests/testLegacyProductionOrder.py", line 88, in setUpPreferences
self.tic()
File "/home/buildbot/slave/full.ERP5.blade-nxd1-10.3/build/unit_test/Products/ERP5Type/tests/ERP5TypeTestCase.py", line 719, in tic
raise RuntimeError,\
RuntimeError: tic is looping forever. These messages are pending: [('/erp5_portal_f9d5a9e0588ba4ee252164b55d086e03/product_module/1', 'immediateReindexObject', -1, 0)]
ERROR: test_51_testCutPasteInAnotherContainer (testLegacyProductionOrder.TestProductionOrder)
----------------------------------------------------------------------
Traceback (most recent call last):
File "/home/buildbot/slave/full.ERP5.blade-nxd1-10.3/build/products/ERP5Type/tests/backportUnittest.py", line 136, in run
self.setUp()
File "/home/buildbot/slave/full.ERP5.blade-nxd1-10.3/build/unit_test/Products/ERP5Type/tests/ERP5TypeTestCase.py", line 517, in setUp
PortalTestCase.setUp(self)
File "/usr/lib/erp5/lib/python/Testing/ZopeTestCase/PortalTestCase.py", line 62, in setUp
self.afterSetUp()
File "/home/buildbot/slave/full.ERP5.blade-nxd1-10.3/build/unit_test/Products/ERP5Legacy/tests/testLegacyProductionOrder.py", line 91, in afterSetUp
TestOrderMixin.afterSetUp(self)
File "/home/buildbot/slave/full.ERP5.blade-nxd1-10.3/build/unit_test/Products/ERP5Legacy/tests/testLegacyOrder.py", line 101, in afterSetUp
self.setUpPreferences()
File "/home/buildbot/slave/full.ERP5.blade-nxd1-10.3/build/unit_test/Products/ERP5Legacy/tests/testLegacyProductionOrder.py", line 88, in setUpPreferences
self.tic()
File "/home/buildbot/slave/full.ERP5.blade-nxd1-10.3/build/unit_test/Products/ERP5Type/tests/ERP5TypeTestCase.py", line 719, in tic
raise RuntimeError,\
RuntimeError: tic is looping forever. These messages are pending: [('/erp5_portal_f9d5a9e0588ba4ee252164b55d086e03/product_module/1', 'immediateReindexObject', -1, 0)]
ERROR: test_01_sourcingDelivery (testLegacyProductionPackingList.TestProductionDelivery)
----------------------------------------------------------------------
Traceback (most recent call last):
File "/home/buildbot/slave/full.ERP5.blade-nxd1-10.1/build/products/ERP5Type/tests/backportUnittest.py", line 145, in run
testMethod()
File "/home/buildbot/slave/full.ERP5.blade-nxd1-10.1/build/unit_test/Products/ERP5Legacy/tests/testLegacyProductionPackingList.py", line 776, in test_01_sourcingDelivery
sequence_list.play(self)
File "/home/buildbot/slave/full.ERP5.blade-nxd1-10.1/build/unit_test/Products/ERP5Type/tests/Sequence.py", line 192, in play
sequence.play(context, sequence_number=i, quiet=quiet)
File "/home/buildbot/slave/full.ERP5.blade-nxd1-10.1/build/unit_test/Products/ERP5Type/tests/Sequence.py", line 113, in play
self._step_list[self._played_index] \
Current Sequence:
ClearActivities
CreateProductionOrganisation1
CreateSupplyOrganisation1
CreateSourcingSC
CreateNotVariatedResource
CreateComponent1
CreateTransformation
CreateOrganisation
CreateOrder
CreateOrderLine
Tic
OrderOrder
> Tic
CheckSourcingSimulation
ConfirmOrder
Tic
CheckSourcingSimulation
CheckSourcingDeliverySimulation
CheckProducedDeliveryPackingListIsConfirmed
CheckProducedDeliveryPackingListIsSolved
CheckSupplyDeliveryPackingListIsConfirmed
CheckSupplyDeliveryPackingListIsSolved
CheckProducedReportIsConfirmed
CheckProducedReportIsSolved
CheckConsumedReportIsConfirmed
CheckConsumedReportIsSolved
File "/home/buildbot/slave/full.ERP5.blade-nxd1-10.1/build/unit_test/Products/ERP5Type/tests/Sequence.py", line 96, in play
method(sequence=sequence)
File "/home/buildbot/slave/full.ERP5.blade-nxd1-10.1/build/unit_test/Products/ERP5Type/tests/ERP5TypeTestCase.py", line 1071, in stepTic
self.tic()
File "/home/buildbot/slave/full.ERP5.blade-nxd1-10.1/build/unit_test/Products/ERP5Type/tests/ERP5TypeTestCase.py", line 719, in tic
raise RuntimeError,\
RuntimeError: tic is looping forever. These messages are pending: [('/erp5_portal_6cab96d659e1c177555f9ab27f36cd79/product_module/1', 'immediateReindexObject', -1, 0)]
FAIL: Make sure that _separate method works if argument is an empty list.
----------------------------------------------------------------------
Traceback (most recent call last):
File "/home/buildbot/slave/full.ERP5.blade-nxd1-10.3/build/unit_test/Products/ERP5/tests/testMovementGroup.py", line 446, in test_separateMethod
self.assertEqual(instance._separate([]), [])
AssertionError: [[[], {}]] != []
FAIL: test_safe_substitution_content (testNotificationMessageModule.TestNotificationMessageModule), Tests that 'safe' substitution is performed, unless safe_substitute is
----------------------------------------------------------------------
Traceback (most recent call last):
File "/home/buildbot/slave/full.ERP5.blade-nxd1-10.4/build/products/ERP5Type/tests/backportUnittest.py", line 145, in run
testMethod()
File "/home/buildbot/slave/full.ERP5.blade-nxd1-10.4/build/unit_test/Products/ERP5/tests/testNotificationMessageModule.py", line 186, in test_safe_substitution_content
self.assertEqual('substitution text: ${b}', text)
AssertionError: 'substitution text: ${b}' != 'substitution text: ${b}\n'
FAIL: test_substitution_content (testNotificationMessageModule.TestNotificationMessageModule), Tests that content and subject have string.Template based substitutions
----------------------------------------------------------------------
Traceback (most recent call last):
File "/home/buildbot/slave/full.ERP5.blade-nxd1-10.4/build/products/ERP5Type/tests/backportUnittest.py", line 145, in run
testMethod()
File "/home/buildbot/slave/full.ERP5.blade-nxd1-10.4/build/unit_test/Products/ERP5/tests/testNotificationMessageModule.py", line 129, in test_substitution_content
self.assertEqual('substitution text: b', text)
AssertionError: 'substitution text: b' != 'substitution text: b\n'
FAIL: test_substitution_content_and_convert (testNotificationMessageModule.TestNotificationMessageModule), Tests that substitution also works with different target format.
----------------------------------------------------------------------
Traceback (most recent call last):
File "/home/buildbot/slave/full.ERP5.blade-nxd1-10.4/build/products/ERP5Type/tests/backportUnittest.py", line 145, in run
testMethod()
File "/home/buildbot/slave/full.ERP5.blade-nxd1-10.4/build/unit_test/Products/ERP5/tests/testNotificationMessageModule.py", line 168, in test_substitution_content_and_convert
self.assertEqual('substitution text: b', text)
AssertionError: 'substitution text: b' != 'substitution text: b\n'
FAIL: test_substitution_content_parameters (testNotificationMessageModule.TestNotificationMessageModule), Tests that we can pass parameters to convert to the substitution method,
----------------------------------------------------------------------
Traceback (most recent call last):
File "/home/buildbot/slave/full.ERP5.blade-nxd1-10.4/build/products/ERP5Type/tests/backportUnittest.py", line 145, in run
testMethod()
File "/home/buildbot/slave/full.ERP5.blade-nxd1-10.4/build/unit_test/Products/ERP5/tests/testNotificationMessageModule.py", line 150, in test_substitution_content_parameters
self.assertEqual('substitution text: b', text)
AssertionError: 'substitution text: b' != 'substitution text: b\n'
FAIL: testOpenOrderRule (testOpenOrder.TestOpenOrder)
----------------------------------------------------------------------
Traceback (most recent call last):
File "/home/buildbot/slave/full.ERP5.blade-nxd1-10.2/build/products/ERP5Type/tests/backportUnittest.py", line 145, in run
testMethod()
File "/home/buildbot/slave/full.ERP5.blade-nxd1-10.2/build/unit_test/Products/ERP5/tests/testOpenOrder.py", line 303, in testOpenOrderRule
[(DateTime(3000,2,10,10,0), DateTime(3000,2,11,10,0)),
AssertionError: [(DateTime('3000/02/10 10:00:00 US/Eastern'), DateTime('3000/02/11 10:00:00 US/Eastern')), (DateTime('3000/02/17 10:00:00 US/Eastern'), DateTime('3000/02/18 10:00:00 US/Eastern')), (DateTime('3000/02/24 10:00:00 US/Eastern'), DateTime('3000/02/25 10:00:00 US/Eastern')), (DateTime('3000/03/03 10:00:00 US/Eastern'), DateTime('3000/03/04 10:00:00 US/Eastern')), (DateTime('3000/03/10 10:00:00 US/Eastern'), DateTime('3000/03/11 10:00:00 US/Eastern'))] != [(DateTime('3000/02/10 10:00:00 US/Eastern'), DateTime('3000/02/11 10:00:00 US/Eastern')), (DateTime('3000/02/17 10:00:00 US/Eastern'), DateTime('3000/02/18 10:00:00 US/Eastern')), (DateTime('3000/02/24 10:00:00 US/Eastern'), DateTime('3000/02/25 10:00:00 US/Eastern')), (DateTime('3000/03/03 10:00:00 US/Eastern'), DateTime('3000/03/04 10:00:00 US/Eastern')), (DateTime('3000/03/10 10:00:00 GMT-4'), DateTime('3000/03/11 10:00:00 GMT-4'))]
FAIL: testPeriodicityDateList (testOpenOrder.TestOpenOrder)
----------------------------------------------------------------------
Traceback (most recent call last):
File "/home/buildbot/slave/full.ERP5.blade-nxd1-10.2/build/products/ERP5Type/tests/backportUnittest.py", line 145, in run
testMethod()
File "/home/buildbot/slave/full.ERP5.blade-nxd1-10.2/build/unit_test/Products/ERP5/tests/testOpenOrder.py", line 185, in testPeriodicityDateList
[(D(2008,2,1,0,1), DateTime(2008,2,29)),
AssertionError: [(DateTime('2008/02/01 00:01:00 US/Eastern'), DateTime('2008/02/29')), (DateTime('2008/03/01 00:01:00 US/Eastern'), DateTime('2008/03/31')), (DateTime('2008/04/01 00:01:00 US/Eastern'), DateTime('2008/04/30')), (DateTime('2008/05/01 00:01:00 US/Eastern'), DateTime('2008/05/31')), (DateTime('2008/06/01 00:01:00 US/Eastern'), DateTime('2008/06/30')), (DateTime('2008/07/01 00:01:00 US/Eastern'), DateTime('2008/07/31')), (DateTime('2008/08/01 00:01:00 US/Eastern'), DateTime('2008/08/31')), (DateTime('2008/09/01 00:01:00 US/Eastern'), DateTime('2008/09/30')), (DateTime('2008/10/01 00:01:00 US/Eastern'), DateTime('2008/10/31')), (DateTime('2008/11/01 00:01:00 US/Eastern'), DateTime('2008/11/30'))] != [(DateTime('2008/02/01 00:01:00 US/Eastern'), DateTime('2008/02/29')), (DateTime('2008/03/01 00:01:00 US/Eastern'), DateTime('2008/03/31')), (DateTime('2008/04/01 00:01:00 GMT-4'), DateTime('2008/04/30')), (DateTime('2008/05/01 00:01:00 GMT-4'), DateTime('2008/05/31')), (DateTime('2008/06/01 00:01:00 GMT-4'), DateTime('2008/06/30')), (DateTime('2008/07/01 00:01:00 GMT-4'), DateTime('2008/07/31')), (DateTime('2008/08/01 00:01:00 GMT-4'), DateTime('2008/08/31')), (DateTime('2008/09/01 00:01:00 GMT-4'), DateTime('2008/09/30')), (DateTime('2008/10/01 00:01:00 GMT-4'), DateTime('2008/10/31')), (DateTime('2008/11/01 00:01:00 GMT-4'), DateTime('2008/11/30'))]
FAIL: test_AccountingLineGeneration (testPayroll.TestPayroll)
----------------------------------------------------------------------
Traceback (most recent call last):
File "/home/buildbot/slave/full.ERP5.blade-nxd1-10.2/build/products/ERP5Type/tests/backportUnittest.py", line 145, in run
testMethod()
File "/home/buildbot/slave/full.ERP5.blade-nxd1-10.2/build/unit_test/Products/ERP5/tests/testPayroll.py", line 3187, in test_AccountingLineGeneration
self.assertEquals(len(accounting_line_list), 4)
AssertionError: 0 != 4
ERROR: test_01_testProductionSimulationExpand (testProductionOrder.TestProductionOrder)
----------------------------------------------------------------------
Traceback (most recent call last):
File "/home/buildbot/slave/full.ERP5.blade-nxd1-10.1/build/products/ERP5Type/tests/backportUnittest.py", line 145, in run
testMethod()
File "/home/buildbot/slave/full.ERP5.blade-nxd1-10.1/build/unit_test/Products/ERP5/tests/testProductionOrder.py", line 1357, in test_01_testProductionSimulationExpand
sequence_list.play(self)
File "/home/buildbot/slave/full.ERP5.blade-nxd1-10.1/build/unit_test/Products/ERP5Type/tests/Sequence.py", line 192, in play
sequence.play(context, sequence_number=i, quiet=quiet)
File "/home/buildbot/slave/full.ERP5.blade-nxd1-10.1/build/unit_test/Products/ERP5Type/tests/Sequence.py", line 113, in play
self._step_list[self._played_index] \
Current Sequence:
ClearActivities
CreateProductionOrganisation1
CreateProductionSC
CreateNotVariatedResource
CreateComponent1
CreateTransformation
CreateOrganisation
CreateOrder
CreateOrderLine
Tic
OrderOrder
> Tic
CheckProductionSimulation
File "/home/buildbot/slave/full.ERP5.blade-nxd1-10.1/build/unit_test/Products/ERP5Type/tests/Sequence.py", line 96, in play
method(sequence=sequence)
File "/home/buildbot/slave/full.ERP5.blade-nxd1-10.1/build/unit_test/Products/ERP5Type/tests/ERP5TypeTestCase.py", line 1071, in stepTic
self.tic()
File "/home/buildbot/slave/full.ERP5.blade-nxd1-10.1/build/unit_test/Products/ERP5Type/tests/ERP5TypeTestCase.py", line 719, in tic
raise RuntimeError,\
RuntimeError: tic is looping forever. These messages are pending: [('/erp5_portal_f9d5a9e0588ba4ee252164b55d086e03/product_module/1', 'immediateReindexObject', -1, 0)]
ERROR: test_02_testSourcingSimulationExpand (testProductionOrder.TestProductionOrder)
----------------------------------------------------------------------
Traceback (most recent call last):
File "/home/buildbot/slave/full.ERP5.blade-nxd1-10.1/build/products/ERP5Type/tests/backportUnittest.py", line 136, in run
self.setUp()
File "/home/buildbot/slave/full.ERP5.blade-nxd1-10.1/build/unit_test/Products/ERP5Type/tests/ERP5TypeTestCase.py", line 517, in setUp
PortalTestCase.setUp(self)
File "/usr/lib/erp5/lib/python/Testing/ZopeTestCase/PortalTestCase.py", line 62, in setUp
self.afterSetUp()
File "/home/buildbot/slave/full.ERP5.blade-nxd1-10.1/build/unit_test/Products/ERP5/tests/testProductionOrder.py", line 91, in afterSetUp
TestOrderMixin.afterSetUp(self)
File "/home/buildbot/slave/full.ERP5.blade-nxd1-10.1/build/unit_test/Products/ERP5/tests/testOrder.py", line 101, in afterSetUp
self.setUpPreferences()
File "/home/buildbot/slave/full.ERP5.blade-nxd1-10.1/build/unit_test/Products/ERP5/tests/testProductionOrder.py", line 88, in setUpPreferences
self.tic()
File "/home/buildbot/slave/full.ERP5.blade-nxd1-10.1/build/unit_test/Products/ERP5Type/tests/ERP5TypeTestCase.py", line 719, in tic
raise RuntimeError,\
RuntimeError: tic is looping forever. These messages are pending: [('/erp5_portal_f9d5a9e0588ba4ee252164b55d086e03/product_module/1', 'immediateReindexObject', -1, 0)]
ERROR: test_03_testIndustrialPhase (testProductionOrder.TestProductionOrder)
----------------------------------------------------------------------
Traceback (most recent call last):
File "/home/buildbot/slave/full.ERP5.blade-nxd1-10.1/build/products/ERP5Type/tests/backportUnittest.py", line 136, in run
self.setUp()
File "/home/buildbot/slave/full.ERP5.blade-nxd1-10.1/build/unit_test/Products/ERP5Type/tests/ERP5TypeTestCase.py", line 517, in setUp
PortalTestCase.setUp(self)
File "/usr/lib/erp5/lib/python/Testing/ZopeTestCase/PortalTestCase.py", line 62, in setUp
self.afterSetUp()
File "/home/buildbot/slave/full.ERP5.blade-nxd1-10.1/build/unit_test/Products/ERP5/tests/testProductionOrder.py", line 91, in afterSetUp
TestOrderMixin.afterSetUp(self)
File "/home/buildbot/slave/full.ERP5.blade-nxd1-10.1/build/unit_test/Products/ERP5/tests/testOrder.py", line 101, in afterSetUp
self.setUpPreferences()
File "/home/buildbot/slave/full.ERP5.blade-nxd1-10.1/build/unit_test/Products/ERP5/tests/testProductionOrder.py", line 88, in setUpPreferences
self.tic()
File "/home/buildbot/slave/full.ERP5.blade-nxd1-10.1/build/unit_test/Products/ERP5Type/tests/ERP5TypeTestCase.py", line 719, in tic
raise RuntimeError,\
RuntimeError: tic is looping forever. These messages are pending: [('/erp5_portal_f9d5a9e0588ba4ee252164b55d086e03/product_module/1', 'immediateReindexObject', -1, 0)]
ERROR: test_04_testProductionSimulationBuild (testProductionOrder.TestProductionOrder)
----------------------------------------------------------------------
Traceback (most recent call last):
File "/home/buildbot/slave/full.ERP5.blade-nxd1-10.1/build/products/ERP5Type/tests/backportUnittest.py", line 136, in run
self.setUp()
File "/home/buildbot/slave/full.ERP5.blade-nxd1-10.1/build/unit_test/Products/ERP5Type/tests/ERP5TypeTestCase.py", line 517, in setUp
PortalTestCase.setUp(self)
File "/usr/lib/erp5/lib/python/Testing/ZopeTestCase/PortalTestCase.py", line 62, in setUp
self.afterSetUp()
File "/home/buildbot/slave/full.ERP5.blade-nxd1-10.1/build/unit_test/Products/ERP5/tests/testProductionOrder.py", line 91, in afterSetUp
TestOrderMixin.afterSetUp(self)
File "/home/buildbot/slave/full.ERP5.blade-nxd1-10.1/build/unit_test/Products/ERP5/tests/testOrder.py", line 101, in afterSetUp
self.setUpPreferences()
File "/home/buildbot/slave/full.ERP5.blade-nxd1-10.1/build/unit_test/Products/ERP5/tests/testProductionOrder.py", line 88, in setUpPreferences
self.tic()
File "/home/buildbot/slave/full.ERP5.blade-nxd1-10.1/build/unit_test/Products/ERP5Type/tests/ERP5TypeTestCase.py", line 719, in tic
raise RuntimeError,\
RuntimeError: tic is looping forever. These messages are pending: [('/erp5_portal_f9d5a9e0588ba4ee252164b55d086e03/product_module/1', 'immediateReindexObject', -1, 0)]
ERROR: test_05_testSourcingSimulationBuild (testProductionOrder.TestProductionOrder)
----------------------------------------------------------------------
Traceback (most recent call last):
File "/home/buildbot/slave/full.ERP5.blade-nxd1-10.1/build/products/ERP5Type/tests/backportUnittest.py", line 136, in run
self.setUp()
File "/home/buildbot/slave/full.ERP5.blade-nxd1-10.1/build/unit_test/Products/ERP5Type/tests/ERP5TypeTestCase.py", line 517, in setUp
PortalTestCase.setUp(self)
File "/usr/lib/erp5/lib/python/Testing/ZopeTestCase/PortalTestCase.py", line 62, in setUp
self.afterSetUp()
File "/home/buildbot/slave/full.ERP5.blade-nxd1-10.1/build/unit_test/Products/ERP5/tests/testProductionOrder.py", line 91, in afterSetUp
TestOrderMixin.afterSetUp(self)
File "/home/buildbot/slave/full.ERP5.blade-nxd1-10.1/build/unit_test/Products/ERP5/tests/testOrder.py", line 101, in afterSetUp
self.setUpPreferences()
File "/home/buildbot/slave/full.ERP5.blade-nxd1-10.1/build/unit_test/Products/ERP5/tests/testProductionOrder.py", line 88, in setUpPreferences
self.tic()
File "/home/buildbot/slave/full.ERP5.blade-nxd1-10.1/build/unit_test/Products/ERP5Type/tests/ERP5TypeTestCase.py", line 719, in tic
raise RuntimeError,\
RuntimeError: tic is looping forever. These messages are pending: [('/erp5_portal_f9d5a9e0588ba4ee252164b55d086e03/product_module/1', 'immediateReindexObject', -1, 0)]
ERROR: test_06_testIndustrialPhase (testProductionOrder.TestProductionOrder)
----------------------------------------------------------------------
Traceback (most recent call last):
File "/home/buildbot/slave/full.ERP5.blade-nxd1-10.1/build/products/ERP5Type/tests/backportUnittest.py", line 136, in run
self.setUp()
File "/home/buildbot/slave/full.ERP5.blade-nxd1-10.1/build/unit_test/Products/ERP5Type/tests/ERP5TypeTestCase.py", line 517, in setUp
PortalTestCase.setUp(self)
File "/usr/lib/erp5/lib/python/Testing/ZopeTestCase/PortalTestCase.py", line 62, in setUp
self.afterSetUp()
File "/home/buildbot/slave/full.ERP5.blade-nxd1-10.1/build/unit_test/Products/ERP5/tests/testProductionOrder.py", line 91, in afterSetUp
TestOrderMixin.afterSetUp(self)
File "/home/buildbot/slave/full.ERP5.blade-nxd1-10.1/build/unit_test/Products/ERP5/tests/testOrder.py", line 101, in afterSetUp
self.setUpPreferences()
File "/home/buildbot/slave/full.ERP5.blade-nxd1-10.1/build/unit_test/Products/ERP5/tests/testProductionOrder.py", line 88, in setUpPreferences
self.tic()
File "/home/buildbot/slave/full.ERP5.blade-nxd1-10.1/build/unit_test/Products/ERP5Type/tests/ERP5TypeTestCase.py", line 719, in tic
raise RuntimeError,\
RuntimeError: tic is looping forever. These messages are pending: [('/erp5_portal_f9d5a9e0588ba4ee252164b55d086e03/product_module/1', 'immediateReindexObject', -1, 0)]
ERROR: test_07_testTransformationInteractionProductionOrderLine (testProductionOrder.TestProductionOrder)
----------------------------------------------------------------------
Traceback (most recent call last):
File "/home/buildbot/slave/full.ERP5.blade-nxd1-10.1/build/products/ERP5Type/tests/backportUnittest.py", line 136, in run
self.setUp()
File "/home/buildbot/slave/full.ERP5.blade-nxd1-10.1/build/unit_test/Products/ERP5Type/tests/ERP5TypeTestCase.py", line 517, in setUp
PortalTestCase.setUp(self)
File "/usr/lib/erp5/lib/python/Testing/ZopeTestCase/PortalTestCase.py", line 62, in setUp
self.afterSetUp()
File "/home/buildbot/slave/full.ERP5.blade-nxd1-10.1/build/unit_test/Products/ERP5/tests/testProductionOrder.py", line 91, in afterSetUp
TestOrderMixin.afterSetUp(self)
File "/home/buildbot/slave/full.ERP5.blade-nxd1-10.1/build/unit_test/Products/ERP5/tests/testOrder.py", line 101, in afterSetUp
self.setUpPreferences()
File "/home/buildbot/slave/full.ERP5.blade-nxd1-10.1/build/unit_test/Products/ERP5/tests/testProductionOrder.py", line 88, in setUpPreferences
self.tic()
File "/home/buildbot/slave/full.ERP5.blade-nxd1-10.1/build/unit_test/Products/ERP5Type/tests/ERP5TypeTestCase.py", line 719, in tic
raise RuntimeError,\
RuntimeError: tic is looping forever. These messages are pending: [('/erp5_portal_f9d5a9e0588ba4ee252164b55d086e03/product_module/1', 'immediateReindexObject', -1, 0)]
ERROR: test_08_testTransformationWithEfficiency (testProductionOrder.TestProductionOrder)
----------------------------------------------------------------------
Traceback (most recent call last):
File "/home/buildbot/slave/full.ERP5.blade-nxd1-10.1/build/products/ERP5Type/tests/backportUnittest.py", line 136, in run
self.setUp()
File "/home/buildbot/slave/full.ERP5.blade-nxd1-10.1/build/unit_test/Products/ERP5Type/tests/ERP5TypeTestCase.py", line 517, in setUp
PortalTestCase.setUp(self)
File "/usr/lib/erp5/lib/python/Testing/ZopeTestCase/PortalTestCase.py", line 62, in setUp
self.afterSetUp()
File "/home/buildbot/slave/full.ERP5.blade-nxd1-10.1/build/unit_test/Products/ERP5/tests/testProductionOrder.py", line 91, in afterSetUp
TestOrderMixin.afterSetUp(self)
File "/home/buildbot/slave/full.ERP5.blade-nxd1-10.1/build/unit_test/Products/ERP5/tests/testOrder.py", line 101, in afterSetUp
self.setUpPreferences()
File "/home/buildbot/slave/full.ERP5.blade-nxd1-10.1/build/unit_test/Products/ERP5/tests/testProductionOrder.py", line 88, in setUpPreferences
self.tic()
File "/home/buildbot/slave/full.ERP5.blade-nxd1-10.1/build/unit_test/Products/ERP5Type/tests/ERP5TypeTestCase.py", line 719, in tic
raise RuntimeError,\
RuntimeError: tic is looping forever. These messages are pending: [('/erp5_portal_f9d5a9e0588ba4ee252164b55d086e03/product_module/1', 'immediateReindexObject', -1, 0)]
ERROR: test_09_testTransformationWithVariation (testProductionOrder.TestProductionOrder)
----------------------------------------------------------------------
Traceback (most recent call last):
File "/home/buildbot/slave/full.ERP5.blade-nxd1-10.1/build/products/ERP5Type/tests/backportUnittest.py", line 136, in run
self.setUp()
File "/home/buildbot/slave/full.ERP5.blade-nxd1-10.1/build/unit_test/Products/ERP5Type/tests/ERP5TypeTestCase.py", line 517, in setUp
PortalTestCase.setUp(self)
File "/usr/lib/erp5/lib/python/Testing/ZopeTestCase/PortalTestCase.py", line 62, in setUp
self.afterSetUp()
File "/home/buildbot/slave/full.ERP5.blade-nxd1-10.1/build/unit_test/Products/ERP5/tests/testProductionOrder.py", line 91, in afterSetUp
TestOrderMixin.afterSetUp(self)
File "/home/buildbot/slave/full.ERP5.blade-nxd1-10.1/build/unit_test/Products/ERP5/tests/testOrder.py", line 101, in afterSetUp
self.setUpPreferences()
File "/home/buildbot/slave/full.ERP5.blade-nxd1-10.1/build/unit_test/Products/ERP5/tests/testProductionOrder.py", line 88, in setUpPreferences
self.tic()
File "/home/buildbot/slave/full.ERP5.blade-nxd1-10.1/build/unit_test/Products/ERP5Type/tests/ERP5TypeTestCase.py", line 719, in tic
raise RuntimeError,\
RuntimeError: tic is looping forever. These messages are pending: [('/erp5_portal_f9d5a9e0588ba4ee252164b55d086e03/product_module/1', 'immediateReindexObject', -1, 0)]
ERROR: test_50_testCopyPaste (testProductionOrder.TestProductionOrder)
----------------------------------------------------------------------
Traceback (most recent call last):
File "/home/buildbot/slave/full.ERP5.blade-nxd1-10.1/build/products/ERP5Type/tests/backportUnittest.py", line 136, in run
self.setUp()
File "/home/buildbot/slave/full.ERP5.blade-nxd1-10.1/build/unit_test/Products/ERP5Type/tests/ERP5TypeTestCase.py", line 517, in setUp
PortalTestCase.setUp(self)
File "/usr/lib/erp5/lib/python/Testing/ZopeTestCase/PortalTestCase.py", line 62, in setUp
self.afterSetUp()
File "/home/buildbot/slave/full.ERP5.blade-nxd1-10.1/build/unit_test/Products/ERP5/tests/testProductionOrder.py", line 91, in afterSetUp
TestOrderMixin.afterSetUp(self)
File "/home/buildbot/slave/full.ERP5.blade-nxd1-10.1/build/unit_test/Products/ERP5/tests/testOrder.py", line 101, in afterSetUp
self.setUpPreferences()
File "/home/buildbot/slave/full.ERP5.blade-nxd1-10.1/build/unit_test/Products/ERP5/tests/testProductionOrder.py", line 88, in setUpPreferences
self.tic()
File "/home/buildbot/slave/full.ERP5.blade-nxd1-10.1/build/unit_test/Products/ERP5Type/tests/ERP5TypeTestCase.py", line 719, in tic
raise RuntimeError,\
RuntimeError: tic is looping forever. These messages are pending: [('/erp5_portal_f9d5a9e0588ba4ee252164b55d086e03/product_module/1', 'immediateReindexObject', -1, 0)]
ERROR: test_51_testCutPasteInAnotherContainer (testProductionOrder.TestProductionOrder)
----------------------------------------------------------------------
Traceback (most recent call last):
File "/home/buildbot/slave/full.ERP5.blade-nxd1-10.1/build/products/ERP5Type/tests/backportUnittest.py", line 136, in run
self.setUp()
File "/home/buildbot/slave/full.ERP5.blade-nxd1-10.1/build/unit_test/Products/ERP5Type/tests/ERP5TypeTestCase.py", line 517, in setUp
PortalTestCase.setUp(self)
File "/usr/lib/erp5/lib/python/Testing/ZopeTestCase/PortalTestCase.py", line 62, in setUp
self.afterSetUp()
File "/home/buildbot/slave/full.ERP5.blade-nxd1-10.1/build/unit_test/Products/ERP5/tests/testProductionOrder.py", line 91, in afterSetUp
TestOrderMixin.afterSetUp(self)
File "/home/buildbot/slave/full.ERP5.blade-nxd1-10.1/build/unit_test/Products/ERP5/tests/testOrder.py", line 101, in afterSetUp
self.setUpPreferences()
File "/home/buildbot/slave/full.ERP5.blade-nxd1-10.1/build/unit_test/Products/ERP5/tests/testProductionOrder.py", line 88, in setUpPreferences
self.tic()
File "/home/buildbot/slave/full.ERP5.blade-nxd1-10.1/build/unit_test/Products/ERP5Type/tests/ERP5TypeTestCase.py", line 719, in tic
raise RuntimeError,\
RuntimeError: tic is looping forever. These messages are pending: [('/erp5_portal_f9d5a9e0588ba4ee252164b55d086e03/product_module/1', 'immediateReindexObject', -1, 0)]
ERROR: test_01_testProductionSimulationExpand (testProductionOrderApparel.TestProductionOrderApparel)
----------------------------------------------------------------------
Traceback (most recent call last):
File "/home/buildbot/slave/full.ERP5.blade-nxd1-10.2/build/products/ERP5Type/tests/backportUnittest.py", line 145, in run
testMethod()
File "/home/buildbot/slave/full.ERP5.blade-nxd1-10.2/build/unit_test/Products/ERP5/tests/testProductionOrderApparel.py", line 969, in test_01_testProductionSimulationExpand
sequence_list.play(self)
File "/home/buildbot/slave/full.ERP5.blade-nxd1-10.2/build/unit_test/Products/ERP5Type/tests/Sequence.py", line 192, in play
sequence.play(context, sequence_number=i, quiet=quiet)
File "/home/buildbot/slave/full.ERP5.blade-nxd1-10.2/build/unit_test/Products/ERP5Type/tests/Sequence.py", line 113, in play
self._step_list[self._played_index] \
Current Sequence:
ClearActivities
CreateProductionOrganisation1
CreateProductionSC
CreateVariatedResource
CreateComponent1
CreateTransformation
CreateOrganisation
CreateOrder
CreateOrderLine
Tic
OrderOrder
> Tic
CheckProductionSimulation
File "/home/buildbot/slave/full.ERP5.blade-nxd1-10.2/build/unit_test/Products/ERP5Type/tests/Sequence.py", line 96, in play
method(sequence=sequence)
File "/home/buildbot/slave/full.ERP5.blade-nxd1-10.2/build/unit_test/Products/ERP5Type/tests/ERP5TypeTestCase.py", line 1071, in stepTic
self.tic()
File "/home/buildbot/slave/full.ERP5.blade-nxd1-10.2/build/unit_test/Products/ERP5Type/tests/ERP5TypeTestCase.py", line 719, in tic
raise RuntimeError,\
RuntimeError: tic is looping forever. These messages are pending: [('/erp5_portal_d229645c78cbb79edd9346d09a434541/apparel_model_module/1', 'immediateReindexObject', -1, 0)]
ERROR: test_02_testSourcingSimulationExpand (testProductionOrderApparel.TestProductionOrderApparel)
----------------------------------------------------------------------
Traceback (most recent call last):
File "/home/buildbot/slave/full.ERP5.blade-nxd1-10.2/build/products/ERP5Type/tests/backportUnittest.py", line 136, in run
self.setUp()
File "/home/buildbot/slave/full.ERP5.blade-nxd1-10.2/build/unit_test/Products/ERP5Type/tests/ERP5TypeTestCase.py", line 517, in setUp
PortalTestCase.setUp(self)
File "/usr/lib/erp5/lib/python/Testing/ZopeTestCase/PortalTestCase.py", line 62, in setUp
self.afterSetUp()
File "/home/buildbot/slave/full.ERP5.blade-nxd1-10.2/build/unit_test/Products/ERP5/tests/testOrder.py", line 101, in afterSetUp
self.setUpPreferences()
File "/home/buildbot/slave/full.ERP5.blade-nxd1-10.2/build/unit_test/Products/ERP5/tests/testOrder.py", line 91, in setUpPreferences
self.tic()
File "/home/buildbot/slave/full.ERP5.blade-nxd1-10.2/build/unit_test/Products/ERP5Type/tests/ERP5TypeTestCase.py", line 719, in tic
raise RuntimeError,\
RuntimeError: tic is looping forever. These messages are pending: [('/erp5_portal_d229645c78cbb79edd9346d09a434541/apparel_model_module/1', 'immediateReindexObject', -1, 0)]
ERROR: test_03_testIndustrialPhase (testProductionOrderApparel.TestProductionOrderApparel)
----------------------------------------------------------------------
Traceback (most recent call last):
File "/home/buildbot/slave/full.ERP5.blade-nxd1-10.2/build/products/ERP5Type/tests/backportUnittest.py", line 136, in run
self.setUp()
File "/home/buildbot/slave/full.ERP5.blade-nxd1-10.2/build/unit_test/Products/ERP5Type/tests/ERP5TypeTestCase.py", line 517, in setUp
PortalTestCase.setUp(self)
File "/usr/lib/erp5/lib/python/Testing/ZopeTestCase/PortalTestCase.py", line 62, in setUp
self.afterSetUp()
File "/home/buildbot/slave/full.ERP5.blade-nxd1-10.2/build/unit_test/Products/ERP5/tests/testOrder.py", line 101, in afterSetUp
self.setUpPreferences()
File "/home/buildbot/slave/full.ERP5.blade-nxd1-10.2/build/unit_test/Products/ERP5/tests/testOrder.py", line 91, in setUpPreferences
self.tic()
File "/home/buildbot/slave/full.ERP5.blade-nxd1-10.2/build/unit_test/Products/ERP5Type/tests/ERP5TypeTestCase.py", line 719, in tic
raise RuntimeError,\
RuntimeError: tic is looping forever. These messages are pending: [('/erp5_portal_d229645c78cbb79edd9346d09a434541/apparel_model_module/1', 'immediateReindexObject', -1, 0)]
ERROR: test_04_testProductionSimulationBuild (testProductionOrderApparel.TestProductionOrderApparel)
----------------------------------------------------------------------
Traceback (most recent call last):
File "/home/buildbot/slave/full.ERP5.blade-nxd1-10.2/build/products/ERP5Type/tests/backportUnittest.py", line 136, in run
self.setUp()
File "/home/buildbot/slave/full.ERP5.blade-nxd1-10.2/build/unit_test/Products/ERP5Type/tests/ERP5TypeTestCase.py", line 517, in setUp
PortalTestCase.setUp(self)
File "/usr/lib/erp5/lib/python/Testing/ZopeTestCase/PortalTestCase.py", line 62, in setUp
self.afterSetUp()
File "/home/buildbot/slave/full.ERP5.blade-nxd1-10.2/build/unit_test/Products/ERP5/tests/testOrder.py", line 101, in afterSetUp
self.setUpPreferences()
File "/home/buildbot/slave/full.ERP5.blade-nxd1-10.2/build/unit_test/Products/ERP5/tests/testOrder.py", line 91, in setUpPreferences
self.tic()
File "/home/buildbot/slave/full.ERP5.blade-nxd1-10.2/build/unit_test/Products/ERP5Type/tests/ERP5TypeTestCase.py", line 719, in tic
raise RuntimeError,\
RuntimeError: tic is looping forever. These messages are pending: [('/erp5_portal_d229645c78cbb79edd9346d09a434541/apparel_model_module/1', 'immediateReindexObject', -1, 0)]
ERROR: test_05_testSourcingSimulationBuild (testProductionOrderApparel.TestProductionOrderApparel)
----------------------------------------------------------------------
Traceback (most recent call last):
File "/home/buildbot/slave/full.ERP5.blade-nxd1-10.2/build/products/ERP5Type/tests/backportUnittest.py", line 136, in run
self.setUp()
File "/home/buildbot/slave/full.ERP5.blade-nxd1-10.2/build/unit_test/Products/ERP5Type/tests/ERP5TypeTestCase.py", line 517, in setUp
PortalTestCase.setUp(self)
File "/usr/lib/erp5/lib/python/Testing/ZopeTestCase/PortalTestCase.py", line 62, in setUp
self.afterSetUp()
File "/home/buildbot/slave/full.ERP5.blade-nxd1-10.2/build/unit_test/Products/ERP5/tests/testOrder.py", line 101, in afterSetUp
self.setUpPreferences()
File "/home/buildbot/slave/full.ERP5.blade-nxd1-10.2/build/unit_test/Products/ERP5/tests/testOrder.py", line 91, in setUpPreferences
self.tic()
File "/home/buildbot/slave/full.ERP5.blade-nxd1-10.2/build/unit_test/Products/ERP5Type/tests/ERP5TypeTestCase.py", line 719, in tic
raise RuntimeError,\
RuntimeError: tic is looping forever. These messages are pending: [('/erp5_portal_d229645c78cbb79edd9346d09a434541/apparel_model_module/1', 'immediateReindexObject', -1, 0)]
ERROR: test_06_testIndustrialPhase (testProductionOrderApparel.TestProductionOrderApparel)
----------------------------------------------------------------------
Traceback (most recent call last):
File "/home/buildbot/slave/full.ERP5.blade-nxd1-10.2/build/products/ERP5Type/tests/backportUnittest.py", line 136, in run
self.setUp()
File "/home/buildbot/slave/full.ERP5.blade-nxd1-10.2/build/unit_test/Products/ERP5Type/tests/ERP5TypeTestCase.py", line 517, in setUp
PortalTestCase.setUp(self)
File "/usr/lib/erp5/lib/python/Testing/ZopeTestCase/PortalTestCase.py", line 62, in setUp
self.afterSetUp()
File "/home/buildbot/slave/full.ERP5.blade-nxd1-10.2/build/unit_test/Products/ERP5/tests/testOrder.py", line 101, in afterSetUp
self.setUpPreferences()
File "/home/buildbot/slave/full.ERP5.blade-nxd1-10.2/build/unit_test/Products/ERP5/tests/testOrder.py", line 91, in setUpPreferences
self.tic()
File "/home/buildbot/slave/full.ERP5.blade-nxd1-10.2/build/unit_test/Products/ERP5Type/tests/ERP5TypeTestCase.py", line 719, in tic
raise RuntimeError,\
RuntimeError: tic is looping forever. These messages are pending: [('/erp5_portal_d229645c78cbb79edd9346d09a434541/apparel_model_module/1', 'immediateReindexObject', -1, 0)]
ERROR: test_07_testTransformationInteractionProductionOrderLine (testProductionOrderApparel.TestProductionOrderApparel)
----------------------------------------------------------------------
Traceback (most recent call last):
File "/home/buildbot/slave/full.ERP5.blade-nxd1-10.2/build/products/ERP5Type/tests/backportUnittest.py", line 136, in run
self.setUp()
File "/home/buildbot/slave/full.ERP5.blade-nxd1-10.2/build/unit_test/Products/ERP5Type/tests/ERP5TypeTestCase.py", line 517, in setUp
PortalTestCase.setUp(self)
File "/usr/lib/erp5/lib/python/Testing/ZopeTestCase/PortalTestCase.py", line 62, in setUp
self.afterSetUp()
File "/home/buildbot/slave/full.ERP5.blade-nxd1-10.2/build/unit_test/Products/ERP5/tests/testOrder.py", line 101, in afterSetUp
self.setUpPreferences()
File "/home/buildbot/slave/full.ERP5.blade-nxd1-10.2/build/unit_test/Products/ERP5/tests/testOrder.py", line 91, in setUpPreferences
self.tic()
File "/home/buildbot/slave/full.ERP5.blade-nxd1-10.2/build/unit_test/Products/ERP5Type/tests/ERP5TypeTestCase.py", line 719, in tic
raise RuntimeError,\
RuntimeError: tic is looping forever. These messages are pending: [('/erp5_portal_d229645c78cbb79edd9346d09a434541/apparel_model_module/1', 'immediateReindexObject', -1, 0)]
ERROR: test_50_testCopyPaste (testProductionOrderApparel.TestProductionOrderApparel)
----------------------------------------------------------------------
Traceback (most recent call last):
File "/home/buildbot/slave/full.ERP5.blade-nxd1-10.2/build/products/ERP5Type/tests/backportUnittest.py", line 136, in run
self.setUp()
File "/home/buildbot/slave/full.ERP5.blade-nxd1-10.2/build/unit_test/Products/ERP5Type/tests/ERP5TypeTestCase.py", line 517, in setUp
PortalTestCase.setUp(self)
File "/usr/lib/erp5/lib/python/Testing/ZopeTestCase/PortalTestCase.py", line 62, in setUp
self.afterSetUp()
File "/home/buildbot/slave/full.ERP5.blade-nxd1-10.2/build/unit_test/Products/ERP5/tests/testOrder.py", line 101, in afterSetUp
self.setUpPreferences()
File "/home/buildbot/slave/full.ERP5.blade-nxd1-10.2/build/unit_test/Products/ERP5/tests/testOrder.py", line 91, in setUpPreferences
self.tic()
File "/home/buildbot/slave/full.ERP5.blade-nxd1-10.2/build/unit_test/Products/ERP5Type/tests/ERP5TypeTestCase.py", line 719, in tic
raise RuntimeError,\
RuntimeError: tic is looping forever. These messages are pending: [('/erp5_portal_d229645c78cbb79edd9346d09a434541/apparel_model_module/1', 'immediateReindexObject', -1, 0)]
ERROR: test_51_testCutPasteInAnotherContainer (testProductionOrderApparel.TestProductionOrderApparel)
----------------------------------------------------------------------
Traceback (most recent call last):
File "/home/buildbot/slave/full.ERP5.blade-nxd1-10.2/build/products/ERP5Type/tests/backportUnittest.py", line 136, in run
self.setUp()
File "/home/buildbot/slave/full.ERP5.blade-nxd1-10.2/build/unit_test/Products/ERP5Type/tests/ERP5TypeTestCase.py", line 517, in setUp
PortalTestCase.setUp(self)
File "/usr/lib/erp5/lib/python/Testing/ZopeTestCase/PortalTestCase.py", line 62, in setUp
self.afterSetUp()
File "/home/buildbot/slave/full.ERP5.blade-nxd1-10.2/build/unit_test/Products/ERP5/tests/testOrder.py", line 101, in afterSetUp
self.setUpPreferences()
File "/home/buildbot/slave/full.ERP5.blade-nxd1-10.2/build/unit_test/Products/ERP5/tests/testOrder.py", line 91, in setUpPreferences
self.tic()
File "/home/buildbot/slave/full.ERP5.blade-nxd1-10.2/build/unit_test/Products/ERP5Type/tests/ERP5TypeTestCase.py", line 719, in tic
raise RuntimeError,\
RuntimeError: tic is looping forever. These messages are pending: [('/erp5_portal_d229645c78cbb79edd9346d09a434541/apparel_model_module/1', 'immediateReindexObject', -1, 0)]
ERROR: test_01_sourcingDelivery (testProductionPackingList.TestProductionDelivery)
----------------------------------------------------------------------
Traceback (most recent call last):
File "/home/buildbot/slave/full.ERP5.blade-nxd1-10.3/build/products/ERP5Type/tests/backportUnittest.py", line 145, in run
testMethod()
File "/home/buildbot/slave/full.ERP5.blade-nxd1-10.3/build/unit_test/Products/ERP5/tests/testProductionPackingList.py", line 776, in test_01_sourcingDelivery
sequence_list.play(self)
File "/home/buildbot/slave/full.ERP5.blade-nxd1-10.3/build/unit_test/Products/ERP5Type/tests/Sequence.py", line 192, in play
sequence.play(context, sequence_number=i, quiet=quiet)
File "/home/buildbot/slave/full.ERP5.blade-nxd1-10.3/build/unit_test/Products/ERP5Type/tests/Sequence.py", line 113, in play
self._step_list[self._played_index] \
Current Sequence:
ClearActivities
CreateProductionOrganisation1
CreateSupplyOrganisation1
CreateSourcingSC
CreateNotVariatedResource
CreateComponent1
CreateTransformation
CreateOrganisation
CreateOrder
CreateOrderLine
Tic
OrderOrder
> Tic
CheckSourcingSimulation
ConfirmOrder
Tic
CheckSourcingSimulation
CheckSourcingDeliverySimulation
CheckProducedDeliveryPackingListIsConfirmed
CheckProducedDeliveryPackingListIsSolved
CheckSupplyDeliveryPackingListIsConfirmed
CheckSupplyDeliveryPackingListIsSolved
CheckProducedReportIsConfirmed
CheckProducedReportIsSolved
CheckConsumedReportIsConfirmed
CheckConsumedReportIsSolved
File "/home/buildbot/slave/full.ERP5.blade-nxd1-10.3/build/unit_test/Products/ERP5Type/tests/Sequence.py", line 96, in play
method(sequence=sequence)
File "/home/buildbot/slave/full.ERP5.blade-nxd1-10.3/build/unit_test/Products/ERP5Type/tests/ERP5TypeTestCase.py", line 1071, in stepTic
self.tic()
File "/home/buildbot/slave/full.ERP5.blade-nxd1-10.3/build/unit_test/Products/ERP5Type/tests/ERP5TypeTestCase.py", line 719, in tic
raise RuntimeError,\
RuntimeError: tic is looping forever. These messages are pending: [('/erp5_portal_6cab96d659e1c177555f9ab27f36cd79/product_module/1', 'immediateReindexObject', -1, 0)]
ERROR: test_01_sourcingDelivery (testProductionPackingListApparel.TestProductionDeliveryApparel)
----------------------------------------------------------------------
Traceback (most recent call last):
File "/home/buildbot/slave/full.ERP5.blade-nxd1-10.6/build/products/ERP5Type/tests/backportUnittest.py", line 145, in run
testMethod()
File "/home/buildbot/slave/full.ERP5.blade-nxd1-10.6/build/unit_test/Products/ERP5/tests/testProductionPackingList.py", line 776, in test_01_sourcingDelivery
sequence_list.play(self)
File "/home/buildbot/slave/full.ERP5.blade-nxd1-10.6/build/unit_test/Products/ERP5Type/tests/Sequence.py", line 192, in play
sequence.play(context, sequence_number=i, quiet=quiet)
File "/home/buildbot/slave/full.ERP5.blade-nxd1-10.6/build/unit_test/Products/ERP5Type/tests/Sequence.py", line 113, in play
self._step_list[self._played_index] \
Current Sequence:
ClearActivities
CreateProductionOrganisation1
CreateSupplyOrganisation1
CreateSourcingSC
CreateVariatedResource
CreateComponent1
CreateTransformation
CreateOrganisation
CreateOrder
CreateOrderLine
Tic
OrderOrder
> Tic
CheckSourcingSimulation
ConfirmOrder
Tic
CheckSourcingSimulation
CheckSourcingDeliverySimulation
CheckProducedDeliveryPackingListIsConfirmed
CheckProducedDeliveryPackingListIsSolved
CheckSupplyDeliveryPackingListIsConfirmed
CheckSupplyDeliveryPackingListIsSolved
CheckProducedReportIsConfirmed
CheckProducedReportIsSolved
CheckConsumedReportIsConfirmed
CheckConsumedReportIsSolved
File "/home/buildbot/slave/full.ERP5.blade-nxd1-10.6/build/unit_test/Products/ERP5Type/tests/Sequence.py", line 96, in play
method(sequence=sequence)
File "/home/buildbot/slave/full.ERP5.blade-nxd1-10.6/build/unit_test/Products/ERP5Type/tests/ERP5TypeTestCase.py", line 1071, in stepTic
self.tic()
File "/home/buildbot/slave/full.ERP5.blade-nxd1-10.6/build/unit_test/Products/ERP5Type/tests/ERP5TypeTestCase.py", line 719, in tic
raise RuntimeError,\
RuntimeError: tic is looping forever. These messages are pending: [('/erp5_portal_be8786bf687d02870ffc89e7f41c8584/apparel_model_module/1', 'immediateReindexObject', -1, 0)]
FAIL: testSkinSelectionTemplateField (testProxyField.TestProxyField)
----------------------------------------------------------------------
Traceback (most recent call last):
File "/home/buildbot/slave/full.ERP5.blade-nxd1-10.1/build/products/ERP5Type/tests/backportUnittest.py", line 145, in run
testMethod()
File "/home/buildbot/slave/full.ERP5.blade-nxd1-10.1/build/unit_test/Products/ERP5Form/tests/testProxyField.py", line 189, in testSkinSelectionTemplateField
self.assertEquals('Customized Title', field.get_value('title'))
AssertionError: 'Customized Title' != 'Generic Title'
ERROR: test_sourceDestinationReferenceOnSupplyLineOnDefaultSupplyLine (testResource.TestResource), Check that it's possible to set and get a source/destination_reference
----------------------------------------------------------------------
Traceback (most recent call last):
File "/home/buildbot/slave/full.ERP5.blade-nxd1-10.2/build/products/ERP5Type/tests/backportUnittest.py", line 145, in run
testMethod()
File "/home/buildbot/slave/full.ERP5.blade-nxd1-10.2/build/unit_test/Products/ERP5/tests/testResource.py", line 1115, in test_sourceDestinationReferenceOnSupplyLineOnDefaultSupplyLine
self.assertEquals(resource.getPurchaseSupplyLineDestinationReference(),
AttributeError: getPurchaseSupplyLineDestinationReference
FAIL: test checking if the field values are of the proper type.
----------------------------------------------------------------------
Traceback (most recent call last):
File "/home/buildbot/slave/full.ERP5.blade-nxd1-10.4/build/unit_test/Products/Formulator/tests/testSerializeForm.py", line 358, in test_fieldValueTypes
self.assertEquals(field.values, field2.values)
AssertionError: {'alternate_name': '', 'title': 'Test Title', 'date_separator': '', 'editable': 0, 'input_order': 'mdy', 'start_datetime': None, 'description': '', 'default_now': 0, 'allow_empty_time': 0, 'ampm_time_style': 0, 'hide_day': 0, 'date_only': 0, 'time_separator': '$', 'hidden': 0, 'default': None, 'css_class': 'test_css', 'required': 1, 'enabled': 1, 'input_style': 'list', 'external_validator': '', 'hidden_day_is_last_day': 0, 'end_datetime': None, 'timezone_style': 0} != {'alternate_name': '', 'title': 'Test Title', 'date_separator': '', 'editable': 0, 'input_order': 'mdy', 'start_datetime': '', 'description': '', 'default_now': 0, 'allow_empty_time': 0, 'ampm_time_style': 0, 'hide_day': 0, 'date_only': 0, 'time_separator': '$', 'hidden': 0, 'default': '', 'css_class': 'test_css', 'required': 1, 'enabled': 1, 'input_style': 'list', 'external_validator': '', 'hidden_day_is_last_day': 0, 'end_datetime': '', 'timezone_style': 0}
FAIL: test_tax_line_build_accounting (testTaxLineTradeCondition.TestTaxLineOrderSimulationSaleOrder)
----------------------------------------------------------------------
Traceback (most recent call last):
File "/home/buildbot/slave/full.ERP5.blade-nxd1-10.6/build/products/ERP5Type/tests/backportUnittest.py", line 145, in run
testMethod()
File "/home/buildbot/slave/full.ERP5.blade-nxd1-10.6/build/unit_test/Products/ERP5/tests/testTaxLineTradeCondition.py", line 947, in test_tax_line_build_accounting
self.assertEquals(3, len(accounting_line_list))
AssertionError: 3 != 0
FAIL: test_tax_line_simulation (testTaxLineTradeCondition.TestTaxLineOrderSimulationSaleOrder)
----------------------------------------------------------------------
Traceback (most recent call last):
File "/home/buildbot/slave/full.ERP5.blade-nxd1-10.6/build/products/ERP5Type/tests/backportUnittest.py", line 145, in run
testMethod()
File "/home/buildbot/slave/full.ERP5.blade-nxd1-10.6/build/unit_test/Products/ERP5/tests/testTaxLineTradeCondition.py", line 699, in test_tax_line_simulation
self.assertEquals(1, len(invoice_rule_list))
AssertionError: 1 != 0
FAIL: test_tax_line_build_accounting (testTaxLineTradeCondition.TestTaxLineOrderSimulationPurchaseOrder)
----------------------------------------------------------------------
Traceback (most recent call last):
File "/home/buildbot/slave/full.ERP5.blade-nxd1-10.6/build/products/ERP5Type/tests/backportUnittest.py", line 145, in run
testMethod()
File "/home/buildbot/slave/full.ERP5.blade-nxd1-10.6/build/unit_test/Products/ERP5/tests/testTaxLineTradeCondition.py", line 947, in test_tax_line_build_accounting
self.assertEquals(3, len(accounting_line_list))
AssertionError: 3 != 0
FAIL: test_tax_line_simulation (testTaxLineTradeCondition.TestTaxLineOrderSimulationPurchaseOrder)
----------------------------------------------------------------------
Traceback (most recent call last):
File "/home/buildbot/slave/full.ERP5.blade-nxd1-10.6/build/products/ERP5Type/tests/backportUnittest.py", line 145, in run
testMethod()
File "/home/buildbot/slave/full.ERP5.blade-nxd1-10.6/build/unit_test/Products/ERP5/tests/testTaxLineTradeCondition.py", line 699, in test_tax_line_simulation
self.assertEquals(1, len(invoice_rule_list))
AssertionError: 1 != 0
FAIL: test_tax_line_simulation (testTaxLineTradeCondition.TestTaxLineInvoiceSimulationPurchaseInvoice)
----------------------------------------------------------------------
Traceback (most recent call last):
File "/home/buildbot/slave/full.ERP5.blade-nxd1-10.6/build/products/ERP5Type/tests/backportUnittest.py", line 145, in run
testMethod()
File "/home/buildbot/slave/full.ERP5.blade-nxd1-10.6/build/unit_test/Products/ERP5/tests/testTaxLineTradeCondition.py", line 1202, in test_tax_line_simulation
self.assertEquals(3, len(accounting_line_list))
AssertionError: 3 != 0
FAIL: test_tax_line_simulation (testTaxLineTradeCondition.TestTaxLineInvoiceSimulationSaleInvoice)
----------------------------------------------------------------------
Traceback (most recent call last):
File "/home/buildbot/slave/full.ERP5.blade-nxd1-10.6/build/products/ERP5Type/tests/backportUnittest.py", line 145, in run
testMethod()
File "/home/buildbot/slave/full.ERP5.blade-nxd1-10.6/build/unit_test/Products/ERP5/tests/testTaxLineTradeCondition.py", line 1202, in test_tax_line_simulation
self.assertEquals(3, len(accounting_line_list))
AssertionError: 3 != 0
FAIL: test_NonDeliveryTemplateNotIndexable (testTemplate.TestTemplate)
----------------------------------------------------------------------
Traceback (most recent call last):
File "/home/buildbot/slave/full.ERP5.blade-nxd1-10.2/build/products/ERP5Type/tests/backportUnittest.py", line 145, in run
testMethod()
File "/home/buildbot/slave/full.ERP5.blade-nxd1-10.2/build/unit_test/Products/ERP5/tests/testTemplate.py", line 345, in test_NonDeliveryTemplateNotIndexable
self._testTemplateNotIndexable(document)
File "/home/buildbot/slave/full.ERP5.blade-nxd1-10.2/build/unit_test/Products/ERP5/tests/testTemplate.py", line 315, in _testTemplateNotIndexable
self.assertEquals(0, len(self.portal.portal_catalog(uid=template.getUid())))
AssertionError: 0 != 1
FAIL: test_manyTemplatesWithoutReindexation (testTemplate.TestTemplate), Check what happen when templates are created one by one without reindexation
----------------------------------------------------------------------
Traceback (most recent call last):
File "/home/buildbot/slave/full.ERP5.blade-nxd1-10.2/build/products/ERP5Type/tests/backportUnittest.py", line 145, in run
testMethod()
File "/home/buildbot/slave/full.ERP5.blade-nxd1-10.2/build/unit_test/Products/ERP5/tests/testTemplate.py", line 279, in test_manyTemplatesWithoutReindexation
self.assertEqual(len(preference_id_list) + 1, len(new_preference_id_list))
AssertionError: 1 != 2
FAIL: test_TradeModelRuleSimulationBuildInvoiceInvoiceLineModifyDivergencyAndSolving (testTradeModelLine.TestTradeModelLineSale), Check that after changing invoice line invoice is properly diverged and it is possible to solve
----------------------------------------------------------------------
Traceback (most recent call last):
File "/home/buildbot/slave/full.ERP5.blade-nxd1-10.4/build/products/ERP5Type/tests/backportUnittest.py", line 145, in run
testMethod()
File "/home/buildbot/slave/full.ERP5.blade-nxd1-10.4/build/unit_test/Products/ERP5/tests/testTradeModelLine.py", line 2104, in test_TradeModelRuleSimulationBuildInvoiceInvoiceLineModifyDivergencyAndSolving
sequence_list.play(self, quiet=True)
File "/home/buildbot/slave/full.ERP5.blade-nxd1-10.4/build/unit_test/Products/ERP5Type/tests/Sequence.py", line 192, in play
sequence.play(context, sequence_number=i, quiet=quiet)
File "/home/buildbot/slave/full.ERP5.blade-nxd1-10.4/build/unit_test/Products/ERP5Type/tests/Sequence.py", line 113, in play
self._step_list[self._played_index] \
Current Sequence:
CreateServiceTax
CreateServiceDiscount
CreatePriceCurrency
CreateProductDiscounted
CreateProductTaxed
CreateProductDiscountedTaxed
CreateSource
CreateSourceSection
CreateDestination
CreateDestinationSection
Tic
CreateBusinessProcess
CreateBusinessState
ModifyBusinessStateTaxed
CreateBusinessState
ModifyBusinessStateInvoiced
CreateBusinessPath
ModifyBusinessPathTaxing
CreateBusinessPath
ModifyBusinessPathDiscounting
CreateTradeCondition
SpecialiseTradeConditionWithBusinessProcess
CreateTradeModelLine
ModifyTradeModelLineTax
CreateTradeModelLine
ModifyTradeModelLineDiscount
Tic
CreateOrder
SpecialiseOrderTradeCondition
FillOrder
Tic
CreateOrderLine
ModifyOrderLineTaxed
CreateOrderLine
ModifyOrderLineDiscounted
CreateOrderLine
ModifyOrderLineDiscountedTaxed
Tic
CheckOrderComplexTradeConditionAggregatedAmountList
CheckOrderLineTaxedAggregatedAmountList
CheckOrderLineDiscountedTaxedAggregatedAmountList
CheckOrderLineDiscountedAggregatedAmountList
Tic
PlanOrder
Tic
CheckOrderLineTaxedSimulation
CheckOrderLineDiscountedSimulation
CheckOrderLineDiscountedTaxedSimulation
ConfirmOrder
Tic
CheckOrderLineTaxedSimulation
CheckOrderLineDiscountedSimulation
CheckOrderLineDiscountedTaxedSimulation
GetPackingList
PackPackingList
Tic
CheckOrderLineTaxedSimulation
CheckOrderLineDiscountedSimulation
CheckOrderLineDiscountedTaxedSimulation
StartPackingList
StopPackingList
DeliverPackingList
Tic
CheckOrderLineTaxedSimulation
CheckOrderLineDiscountedSimulation
CheckOrderLineDiscountedTaxedSimulation
GetInvoice
CheckInvoiceCausalityStateSolved
CheckInvoiceNormalMovements
GetInvoiceLineDiscounted
GetInvoiceLineDiscountedTaxed
GetInvoiceLineTaxed
ModifyQuantityInvoiceLineDiscounted
ModifyQuantityInvoiceLineDiscountedTaxed
ModifyQuantityInvoiceLineTaxed
Tic
CheckInvoiceCausalityStateDiverged
AcceptDecisionQuantityInvoice
Tic
> CheckInvoiceCausalityStateSolved
CheckInvoiceNormalMovements
File "/home/buildbot/slave/full.ERP5.blade-nxd1-10.4/build/unit_test/Products/ERP5Type/tests/Sequence.py", line 96, in play
method(sequence=sequence)
File "/home/buildbot/slave/full.ERP5.blade-nxd1-10.4/build/unit_test/Products/ERP5/tests/testTradeModelLine.py", line 459, in stepCheckInvoiceCausalityStateSolved
invoice.getDivergenceList())
AssertionError: [<DivergenceMessage object at 0x76343f8
'decision_value': 1.9999999999999998
'divergence_scope': 'quantity'
'prevision_value': 5.0
'mapping': {}
'object_relative_url': 'accounting_module/5/5'
'simulation_movement': <SimulationMovement at /erp5_portal_ad634f4ece1810b728855e61e26535eb/portal_simulation/8/3/1/1/1/1/2/1>
'tested_property': 'quantity'
'decision_title': '1.9999999999999998'
'message': 'Quantity'>, <DivergenceMessage object at 0x7a18f38
'decision_value': -0.60000000000000009
'divergence_scope': 'quantity'
'prevision_value': -1.5
'mapping': {}
'object_relative_url': 'accounting_module/5/5'
'simulation_movement': <SimulationMovement at /erp5_portal_ad634f4ece1810b728855e61e26535eb/portal_simulation/8/2/1/1/1/1/2/2>
'tested_property': 'quantity'
'decision_title': '-0.60000000000000009'
'message': 'Quantity'>, <DivergenceMessage object at 0x7bbcab8
'decision_value': 28.5
'divergence_scope': 'quantity'
'prevision_value': 71.25
'mapping': {}
'object_relative_url': 'accounting_module/5/5'
'simulation_movement': <SimulationMovement at /erp5_portal_ad634f4ece1810b728855e61e26535eb/portal_simulation/8/1/1/1/1/1/2/2>
'tested_property': 'quantity'
'decision_title': '28.5'
'message': 'Quantity'>, <DivergenceMessage object at 0x68ce440
'decision_value': 12.0
'divergence_scope': 'quantity'
'prevision_value': 30.0
'mapping': {}
'object_relative_url': 'accounting_module/5/4'
'simulation_movement': <SimulationMovement at /erp5_portal_ad634f4ece1810b728855e61e26535eb/portal_simulation/8/2/1/1/1/1/2/1>
'tested_property': 'quantity'
'decision_title': '12.0'
'message': 'Quantity'>, <DivergenceMessage object at 0xa0e3560
'decision_value': 30.0
'divergence_scope': 'quantity'
'prevision_value': 75.0
'mapping': {}
'object_relative_url': 'accounting_module/5/4'
'simulation_movement': <SimulationMovement at /erp5_portal_ad634f4ece1810b728855e61e26535eb/portal_simulation/8/1/1/1/1/1/2/1>
'tested_property': 'quantity'
'decision_title': '30.0'
'message': 'Quantity'>]
FAIL: test_TradeModelRuleSimulationPackingListSplitBuildInvoiceBuildDifferentRatio (testTradeModelLine.TestTradeModelLineSale), Check building invoice after splitting packing list using different ratio
----------------------------------------------------------------------
Traceback (most recent call last):
File "/home/buildbot/slave/full.ERP5.blade-nxd1-10.4/build/products/ERP5Type/tests/backportUnittest.py", line 145, in run
testMethod()
File "/home/buildbot/slave/full.ERP5.blade-nxd1-10.4/build/unit_test/Products/ERP5/tests/testTradeModelLine.py", line 2185, in test_TradeModelRuleSimulationPackingListSplitBuildInvoiceBuildDifferentRatio
sequence_list.play(self, quiet=True)
File "/home/buildbot/slave/full.ERP5.blade-nxd1-10.4/build/unit_test/Products/ERP5Type/tests/Sequence.py", line 192, in play
sequence.play(context, sequence_number=i, quiet=quiet)
File "/home/buildbot/slave/full.ERP5.blade-nxd1-10.4/build/unit_test/Products/ERP5Type/tests/Sequence.py", line 113, in play
self._step_list[self._played_index] \
Current Sequence:
CreateServiceTax
CreateServiceDiscount
CreatePriceCurrency
CreateProductDiscounted
CreateProductTaxed
CreateProductDiscountedTaxed
CreateSource
CreateSourceSection
CreateDestination
CreateDestinationSection
Tic
CreateBusinessProcess
CreateBusinessState
ModifyBusinessStateTaxed
CreateBusinessState
ModifyBusinessStateInvoiced
CreateBusinessPath
ModifyBusinessPathTaxing
CreateBusinessPath
ModifyBusinessPathDiscounting
CreateTradeCondition
SpecialiseTradeConditionWithBusinessProcess
CreateTradeModelLine
ModifyTradeModelLineTax
CreateTradeModelLine
ModifyTradeModelLineDiscount
Tic
CreateOrder
SpecialiseOrderTradeCondition
FillOrder
Tic
CreateOrderLine
ModifyOrderLineTaxed
CreateOrderLine
ModifyOrderLineDiscounted
CreateOrderLine
ModifyOrderLineDiscountedTaxed
Tic
CheckOrderComplexTradeConditionAggregatedAmountList
CheckOrderLineTaxedAggregatedAmountList
CheckOrderLineDiscountedTaxedAggregatedAmountList
CheckOrderLineDiscountedAggregatedAmountList
Tic
PlanOrder
Tic
CheckOrderLineTaxedSimulation
CheckOrderLineDiscountedSimulation
CheckOrderLineDiscountedTaxedSimulation
ConfirmOrder
Tic
CheckOrderLineTaxedSimulation
CheckOrderLineDiscountedSimulation
CheckOrderLineDiscountedTaxedSimulation
GetPackingList
DecreasePackingListLineListQuantity
Tic
CheckOrderLineTaxedSimulation
CheckOrderLineDiscountedSimulation
CheckOrderLineDiscountedTaxedSimulation
CheckPackingListDiverged
SplitAndDeferPackingList
Tic
CheckOrderLineTaxedSimulation
CheckOrderLineDiscountedSimulation
CheckOrderLineDiscountedTaxedSimulation
GetNewPackingList
PackPackingList
Tic
CheckOrderLineTaxedSimulation
CheckOrderLineDiscountedSimulation
CheckOrderLineDiscountedTaxedSimulation
StartPackingList
StopPackingList
DeliverPackingList
Tic
CheckOrderLineTaxedSimulation
CheckOrderLineDiscountedSimulation
CheckOrderLineDiscountedTaxedSimulation
GetInvoice
> CheckInvoiceCausalityStateSolved
CheckInvoiceNormalMovements
SetNewPackingListAsPackingList
PackPackingList
Tic
StartPackingList
CheckOrderLineTaxedSimulation
CheckOrderLineDiscountedSimulation
CheckOrderLineDiscountedTaxedSimulation
StopPackingList
DeliverPackingList
Tic
CheckOrderLineTaxedSimulation
CheckOrderLineDiscountedSimulation
CheckOrderLineDiscountedTaxedSimulation
GetInvoice
CheckInvoiceCausalityStateSolved
CheckInvoiceNormalMovements
File "/home/buildbot/slave/full.ERP5.blade-nxd1-10.4/build/unit_test/Products/ERP5Type/tests/Sequence.py", line 96, in play
method(sequence=sequence)
File "/home/buildbot/slave/full.ERP5.blade-nxd1-10.4/build/unit_test/Products/ERP5/tests/testTradeModelLine.py", line 459, in stepCheckInvoiceCausalityStateSolved
invoice.getDivergenceList())
AssertionError: [<DivergenceMessage object at 0x84910e0
'decision_value': -0.049999999999999989
'divergence_scope': 'property'
'prevision_value': -0.050000000000000003
'mapping': {}
'object_relative_url': 'accounting_module/12/5'
'simulation_movement': <SimulationMovement at /erp5_portal_ad634f4ece1810b728855e61e26535eb/portal_simulation/21/2/1/1/1/1/2/1>
'tested_property': 'price'
'message': 'Price'>, <DivergenceMessage object at 0x8cb2ea8
'decision_value': -0.049999999999999989
'divergence_scope': 'property'
'prevision_value': -0.050000000000000003
'mapping': {}
'object_relative_url': 'accounting_module/12/5'
'simulation_movement': <SimulationMovement at /erp5_portal_ad634f4ece1810b728855e61e26535eb/portal_simulation/21/1/1/1/1/1/2/1>
'tested_property': 'price'
'message': 'Price'>]
FAIL: test_TradeModelRuleSimulationBuildInvoiceInvoiceLineModifyDivergencyAndSolving (testTradeModelLinePurchase.TestTradeModelLinePurchase), Check that after changing invoice line invoice is properly diverged and it is possible to solve
----------------------------------------------------------------------
Traceback (most recent call last):
File "/home/buildbot/slave/full.ERP5.blade-nxd1-10.6/build/products/ERP5Type/tests/backportUnittest.py", line 145, in run
testMethod()
File "/home/buildbot/slave/full.ERP5.blade-nxd1-10.6/build/unit_test/Products/ERP5/tests/testTradeModelLine.py", line 2104, in test_TradeModelRuleSimulationBuildInvoiceInvoiceLineModifyDivergencyAndSolving
sequence_list.play(self, quiet=True)
File "/home/buildbot/slave/full.ERP5.blade-nxd1-10.6/build/unit_test/Products/ERP5Type/tests/Sequence.py", line 192, in play
sequence.play(context, sequence_number=i, quiet=quiet)
File "/home/buildbot/slave/full.ERP5.blade-nxd1-10.6/build/unit_test/Products/ERP5Type/tests/Sequence.py", line 113, in play
self._step_list[self._played_index] \
Current Sequence:
CreateServiceTax
CreateServiceDiscount
CreatePriceCurrency
CreateProductDiscounted
CreateProductTaxed
CreateProductDiscountedTaxed
CreateSource
CreateSourceSection
CreateDestination
CreateDestinationSection
Tic
CreateBusinessProcess
CreateBusinessState
ModifyBusinessStateTaxed
CreateBusinessState
ModifyBusinessStateInvoiced
CreateBusinessPath
ModifyBusinessPathTaxing
CreateBusinessPath
ModifyBusinessPathDiscounting
CreateTradeCondition
SpecialiseTradeConditionWithBusinessProcess
CreateTradeModelLine
ModifyTradeModelLineTax
CreateTradeModelLine
ModifyTradeModelLineDiscount
Tic
CreateOrder
SpecialiseOrderTradeCondition
FillOrder
Tic
CreateOrderLine
ModifyOrderLineTaxed
CreateOrderLine
ModifyOrderLineDiscounted
CreateOrderLine
ModifyOrderLineDiscountedTaxed
Tic
CheckOrderComplexTradeConditionAggregatedAmountList
CheckOrderLineTaxedAggregatedAmountList
CheckOrderLineDiscountedTaxedAggregatedAmountList
CheckOrderLineDiscountedAggregatedAmountList
Tic
PlanOrder
Tic
CheckOrderLineTaxedSimulation
CheckOrderLineDiscountedSimulation
CheckOrderLineDiscountedTaxedSimulation
ConfirmOrder
Tic
CheckOrderLineTaxedSimulation
CheckOrderLineDiscountedSimulation
CheckOrderLineDiscountedTaxedSimulation
GetPackingList
PackPackingList
Tic
CheckOrderLineTaxedSimulation
CheckOrderLineDiscountedSimulation
CheckOrderLineDiscountedTaxedSimulation
StartPackingList
StopPackingList
DeliverPackingList
Tic
CheckOrderLineTaxedSimulation
CheckOrderLineDiscountedSimulation
CheckOrderLineDiscountedTaxedSimulation
GetInvoice
CheckInvoiceCausalityStateSolved
CheckInvoiceNormalMovements
GetInvoiceLineDiscounted
GetInvoiceLineDiscountedTaxed
GetInvoiceLineTaxed
ModifyQuantityInvoiceLineDiscounted
ModifyQuantityInvoiceLineDiscountedTaxed
ModifyQuantityInvoiceLineTaxed
Tic
CheckInvoiceCausalityStateDiverged
AcceptDecisionQuantityInvoice
Tic
> CheckInvoiceCausalityStateSolved
CheckInvoiceNormalMovements
File "/home/buildbot/slave/full.ERP5.blade-nxd1-10.6/build/unit_test/Products/ERP5Type/tests/Sequence.py", line 96, in play
method(sequence=sequence)
File "/home/buildbot/slave/full.ERP5.blade-nxd1-10.6/build/unit_test/Products/ERP5/tests/testTradeModelLine.py", line 459, in stepCheckInvoiceCausalityStateSolved
invoice.getDivergenceList())
AssertionError: [<DivergenceMessage object at 0xa3c9e60
'decision_value': 1.9999999999999998
'divergence_scope': 'quantity'
'prevision_value': 5.0
'mapping': {}
'object_relative_url': 'accounting_module/5/5'
'simulation_movement': <SimulationMovement at /erp5_portal_f961ca546667fb6832d17eeef19b90b9/portal_simulation/8/3/1/1/1/1/2/1>
'tested_property': 'quantity'
'decision_title': '1.9999999999999998'
'message': 'Quantity'>, <DivergenceMessage object at 0xb9a86c8
'decision_value': -0.60000000000000009
'divergence_scope': 'quantity'
'prevision_value': -1.5
'mapping': {}
'object_relative_url': 'accounting_module/5/5'
'simulation_movement': <SimulationMovement at /erp5_portal_f961ca546667fb6832d17eeef19b90b9/portal_simulation/8/2/1/1/1/1/2/2>
'tested_property': 'quantity'
'decision_title': '-0.60000000000000009'
'message': 'Quantity'>, <DivergenceMessage object at 0x8bcaf38
'decision_value': 28.5
'divergence_scope': 'quantity'
'prevision_value': 71.25
'mapping': {}
'object_relative_url': 'accounting_module/5/5'
'simulation_movement': <SimulationMovement at /erp5_portal_f961ca546667fb6832d17eeef19b90b9/portal_simulation/8/1/1/1/1/1/2/2>
'tested_property': 'quantity'
'decision_title': '28.5'
'message': 'Quantity'>, <DivergenceMessage object at 0x849e758
'decision_value': 12.0
'divergence_scope': 'quantity'
'prevision_value': 30.0
'mapping': {}
'object_relative_url': 'accounting_module/5/4'
'simulation_movement': <SimulationMovement at /erp5_portal_f961ca546667fb6832d17eeef19b90b9/portal_simulation/8/2/1/1/1/1/2/1>
'tested_property': 'quantity'
'decision_title': '12.0'
'message': 'Quantity'>, <DivergenceMessage object at 0x8aea320
'decision_value': 30.0
'divergence_scope': 'quantity'
'prevision_value': 75.0
'mapping': {}
'object_relative_url': 'accounting_module/5/4'
'simulation_movement': <SimulationMovement at /erp5_portal_f961ca546667fb6832d17eeef19b90b9/portal_simulation/8/1/1/1/1/1/2/1>
'tested_property': 'quantity'
'decision_title': '30.0'
'message': 'Quantity'>]
FAIL: test_TradeModelRuleSimulationPackingListSplitBuildInvoiceBuildDifferentRatio (testTradeModelLinePurchase.TestTradeModelLinePurchase), Check building invoice after splitting packing list using different ratio
----------------------------------------------------------------------
Traceback (most recent call last):
File "/home/buildbot/slave/full.ERP5.blade-nxd1-10.6/build/products/ERP5Type/tests/backportUnittest.py", line 145, in run
testMethod()
File "/home/buildbot/slave/full.ERP5.blade-nxd1-10.6/build/unit_test/Products/ERP5/tests/testTradeModelLine.py", line 2185, in test_TradeModelRuleSimulationPackingListSplitBuildInvoiceBuildDifferentRatio
sequence_list.play(self, quiet=True)
File "/home/buildbot/slave/full.ERP5.blade-nxd1-10.6/build/unit_test/Products/ERP5Type/tests/Sequence.py", line 192, in play
sequence.play(context, sequence_number=i, quiet=quiet)
File "/home/buildbot/slave/full.ERP5.blade-nxd1-10.6/build/unit_test/Products/ERP5Type/tests/Sequence.py", line 113, in play
self._step_list[self._played_index] \
Current Sequence:
CreateServiceTax
CreateServiceDiscount
CreatePriceCurrency
CreateProductDiscounted
CreateProductTaxed
CreateProductDiscountedTaxed
CreateSource
CreateSourceSection
CreateDestination
CreateDestinationSection
Tic
CreateBusinessProcess
CreateBusinessState
ModifyBusinessStateTaxed
CreateBusinessState
ModifyBusinessStateInvoiced
CreateBusinessPath
ModifyBusinessPathTaxing
CreateBusinessPath
ModifyBusinessPathDiscounting
CreateTradeCondition
SpecialiseTradeConditionWithBusinessProcess
CreateTradeModelLine
ModifyTradeModelLineTax
CreateTradeModelLine
ModifyTradeModelLineDiscount
Tic
CreateOrder
SpecialiseOrderTradeCondition
FillOrder
Tic
CreateOrderLine
ModifyOrderLineTaxed
CreateOrderLine
ModifyOrderLineDiscounted
CreateOrderLine
ModifyOrderLineDiscountedTaxed
Tic
CheckOrderComplexTradeConditionAggregatedAmountList
CheckOrderLineTaxedAggregatedAmountList
CheckOrderLineDiscountedTaxedAggregatedAmountList
CheckOrderLineDiscountedAggregatedAmountList
Tic
PlanOrder
Tic
CheckOrderLineTaxedSimulation
CheckOrderLineDiscountedSimulation
CheckOrderLineDiscountedTaxedSimulation
ConfirmOrder
Tic
CheckOrderLineTaxedSimulation
CheckOrderLineDiscountedSimulation
CheckOrderLineDiscountedTaxedSimulation
GetPackingList
DecreasePackingListLineListQuantity
Tic
CheckOrderLineTaxedSimulation
CheckOrderLineDiscountedSimulation
CheckOrderLineDiscountedTaxedSimulation
CheckPackingListDiverged
SplitAndDeferPackingList
Tic
CheckOrderLineTaxedSimulation
CheckOrderLineDiscountedSimulation
CheckOrderLineDiscountedTaxedSimulation
GetNewPackingList
PackPackingList
Tic
CheckOrderLineTaxedSimulation
CheckOrderLineDiscountedSimulation
CheckOrderLineDiscountedTaxedSimulation
StartPackingList
StopPackingList
DeliverPackingList
Tic
CheckOrderLineTaxedSimulation
CheckOrderLineDiscountedSimulation
CheckOrderLineDiscountedTaxedSimulation
GetInvoice
> CheckInvoiceCausalityStateSolved
CheckInvoiceNormalMovements
SetNewPackingListAsPackingList
PackPackingList
Tic
StartPackingList
CheckOrderLineTaxedSimulation
CheckOrderLineDiscountedSimulation
CheckOrderLineDiscountedTaxedSimulation
StopPackingList
DeliverPackingList
Tic
CheckOrderLineTaxedSimulation
CheckOrderLineDiscountedSimulation
CheckOrderLineDiscountedTaxedSimulation
GetInvoice
CheckInvoiceCausalityStateSolved
CheckInvoiceNormalMovements
File "/home/buildbot/slave/full.ERP5.blade-nxd1-10.6/build/unit_test/Products/ERP5Type/tests/Sequence.py", line 96, in play
method(sequence=sequence)
File "/home/buildbot/slave/full.ERP5.blade-nxd1-10.6/build/unit_test/Products/ERP5/tests/testTradeModelLine.py", line 459, in stepCheckInvoiceCausalityStateSolved
invoice.getDivergenceList())
AssertionError: [<DivergenceMessage object at 0xb3809e0
'decision_value': -0.049999999999999989
'divergence_scope': 'property'
'prevision_value': -0.050000000000000003
'mapping': {}
'object_relative_url': 'accounting_module/12/5'
'simulation_movement': <SimulationMovement at /erp5_portal_f961ca546667fb6832d17eeef19b90b9/portal_simulation/21/2/1/1/1/1/2/1>
'tested_property': 'price'
'message': 'Price'>, <DivergenceMessage object at 0x8b008c0
'decision_value': -0.049999999999999989
'divergence_scope': 'property'
'prevision_value': -0.050000000000000003
'mapping': {}
'object_relative_url': 'accounting_module/12/5'
'simulation_movement': <SimulationMovement at /erp5_portal_f961ca546667fb6832d17eeef19b90b9/portal_simulation/21/1/1/1/1/1/2/1>
'tested_property': 'price'
'message': 'Price'>]
FAIL: test_configurationOfFieldLibrary (testXHTML.TestXHTML)
----------------------------------------------------------------------
Traceback (most recent call last):
File "/home/buildbot/slave/full.ERP5.blade-nxd1-10.3/build/products/ERP5Type/tests/backportUnittest.py", line 145, in run
testMethod()
File "/home/buildbot/slave/full.ERP5.blade-nxd1-10.3/build/unit_test/Products/ERP5/tests/testXHTML.py", line 186, in test_configurationOfFieldLibrary
self.fail(message) # uncomment above for details on each field
AssertionError: 5417 fields to modify
FAIL: test_deadProxyFields (testXHTML.TestXHTML)
----------------------------------------------------------------------
Traceback (most recent call last):
File "/home/buildbot/slave/full.ERP5.blade-nxd1-10.3/build/products/ERP5Type/tests/backportUnittest.py", line 145, in run
testMethod()
File "/home/buildbot/slave/full.ERP5.blade-nxd1-10.3/build/unit_test/Products/ERP5/tests/testXHTML.py", line 172, in test_deadProxyFields
self.fail(message)
AssertionError:
Dead proxy field list('Print', 'Base_viewTradeFieldLibrary/my_report_mode_at_date', 'Base_viewFieldLibrary', 'my_report_mode_at_date')
('View', 'Base_viewTradeFieldLibrary/my_report_mode_at_date', 'Base_viewFieldLibrary', 'my_report_mode_at_date')
FAIL: test_erp5_dms_Drawing_OOoDocument_viewAsWeb (testXHTML.TestXHTML)
----------------------------------------------------------------------
Traceback (most recent call last):
File "/home/buildbot/slave/full.ERP5.blade-nxd1-10.3/build/products/ERP5Type/tests/backportUnittest.py", line 145, in run
testMethod()
File "/home/buildbot/slave/full.ERP5.blade-nxd1-10.3/build/unit_test/Products/ERP5/tests/testXHTML.py", line 425, in testMethod
bt_name=bt_name))
AssertionError: Using w3c validator to parse the view "OOoDocument_viewAsWeb" (from erp5_dms bt) with warnings displayed :
Error: line 520 column 43 : there is no attribute "class"
Error: line 520 column 63 : there is no attribute "style"
Error: line 520 column 105 : there is no attribute "src"
Error: line 520 column 222 : there is no attribute "onload"
Error: line 520 column 244 : element "iframe" undefined
FAIL: test_erp5_dms_Presentation_OOoDocument_viewAsWeb (testXHTML.TestXHTML)
----------------------------------------------------------------------
Traceback (most recent call last):
File "/home/buildbot/slave/full.ERP5.blade-nxd1-10.3/build/products/ERP5Type/tests/backportUnittest.py", line 145, in run
testMethod()
File "/home/buildbot/slave/full.ERP5.blade-nxd1-10.3/build/unit_test/Products/ERP5/tests/testXHTML.py", line 425, in testMethod
bt_name=bt_name))
AssertionError: Using w3c validator to parse the view "OOoDocument_viewAsWeb" (from erp5_dms bt) with warnings displayed :
Error: line 520 column 43 : there is no attribute "class"
Error: line 520 column 63 : there is no attribute "style"
Error: line 520 column 105 : there is no attribute "src"
Error: line 520 column 222 : there is no attribute "onload"
Error: line 520 column 244 : element "iframe" undefined
FAIL: test_listActionInListbox (testXHTML.TestXHTML)
----------------------------------------------------------------------
Traceback (most recent call last):
File "/home/buildbot/slave/full.ERP5.blade-nxd1-10.3/build/products/ERP5Type/tests/backportUnittest.py", line 145, in run
testMethod()
File "/home/buildbot/slave/full.ERP5.blade-nxd1-10.3/build/unit_test/Products/ERP5/tests/testXHTML.py", line 254, in test_listActionInListbox
self.assertEquals(error_list, [])
AssertionError: [('erp5_core/Documentation_view/my_dynamic_accessor_list', 'bla'), ('erp5_core/Documentation_view/my_dynamic_category_list', 'bla'), ('erp5_core/Documentation_view/my_static_property_list', 'bla'), ('erp5_core/Documentation_view/my_static_method_list', 'bla'), ('erp5_core/Documentation_view/my_dynamic_property_list', 'bla'), ('erp5_core/Documentation_view/my_dynamic_method_list', 'bla'), ('erp5_web_widget_library/WebSection_viewLatestDocumentListGadget/listbox', 'WebSite_viewLatestAdditionList'), ('erp5_project/Project_viewQuantityReport/listbox', 'Folder_viewContent')] != []
More information about the Erp5-report
mailing list