[Erp5-report] ERP5 r33307: 3197 Tests, 36 Errors, 52 Failures, 81 Skips
nobody at svn.erp5.org
nobody at svn.erp5.org
Wed Mar 3 12:15:53 CET 2010
Test Suite: ERP5
Revision: 33307
Result: FAIL
All tests: 3197
Failures: 52
Errors: 36
Skips: 81
The following tests failed:
testAdvancedInvoicing (1 failures, 2 errors)
test_10_ManuallyAddedMovements (testAdvancedInvoicing.TestAdvancedSaleInvoice)
test_11_ManuallyAddedMovementsManyTransactions (testAdvancedInvoicing.TestAdvancedSaleInvoice)
test_CreatingAccountingTransactionThroughInvoice (testAdvancedInvoicing.TestAdvancedSaleInvoice), test creating simple invoice and accounting transaction
testBusinessTemplate (1 failures, 1 errors)
test_165_checkCopyBuildInstall (testBusinessTemplate.TestBusinessTemplate)
test_164_checkCopyBuild (testBusinessTemplate.TestBusinessTemplate)
testCRM (1 failures)
test_Base_getEntityListFromFromHeader (testCRM.TestCRMMailIngestion)
testConversionInSimulation (1 failures)
test_01_delivery_mode_on_sale_packing_list_and_invoice (testConversionInSimulation.TestConversionInSimulation)
testDivergenceTester (5 errors)
test_01_QuantityDivergenceTester (testDivergenceTester.TestDivergenceTester)
testERP5Interfaces (20 errors)
test_Products.ERP5.AggregatedAmountList_AggregatedAmountList_implements_IAmountList (testERP5Interfaces.TestERP5Interfaces)
test_Products.ERP5Type.Document.BusinessPath_BusinessPath_implements_IBusinessPath (testERP5Interfaces.TestERP5Interfaces)
test_Products.ERP5Type.Document.BusinessPath_BusinessPath_implements_ICategoryAccessProvider (testERP5Interfaces.TestERP5Interfaces)
test_Products.ERP5Type.Document.Document_Document_implements_IDocument (testERP5Interfaces.TestERP5Interfaces)
test_Products.ERP5Type.Document.EmailDocument_EmailDocument_implements_IDocument (testERP5Interfaces.TestERP5Interfaces)
test_Products.ERP5Type.Document.Event_Event_implements_IDocument (testERP5Interfaces.TestERP5Interfaces)
test_Products.ERP5Type.Document.File_File_implements_IDocument (testERP5Interfaces.TestERP5Interfaces)
test_Products.ERP5Type.Document.Image_Image_implements_IDocument (testERP5Interfaces.TestERP5Interfaces)
test_Products.ERP5Type.Document.OOoDocument_OOoDocument_implements_IDocument (testERP5Interfaces.TestERP5Interfaces)
test_Products.ERP5Type.Document.TextDocument_TextDocument_implements_IDocument (testERP5Interfaces.TestERP5Interfaces)
test_Products.ERP5Type.Document.TradeCondition_TradeCondition_implements_IAmountGenerator (testERP5Interfaces.TestERP5Interfaces)
test_Products.ERP5Type.Document.TradeModelCell_TradeModelCell_implements_IAmountGenerator (testERP5Interfaces.TestERP5Interfaces)
test_Products.ERP5Type.Document.TradeModelCell_TradeModelCell_implements_IVariated (testERP5Interfaces.TestERP5Interfaces)
test_Products.ERP5Type.Document.TradeModelLine_TradeModelLine_implements_IAmountGenerator (testERP5Interfaces.TestERP5Interfaces)
test_Products.ERP5Type.Document.TradeModelLine_TradeModelLine_implements_IVariated (testERP5Interfaces.TestERP5Interfaces)
test_Products.ERP5Type.Document.TradeModelRule_TradeModelRule_implements_IRule (testERP5Interfaces.TestERP5Interfaces)
test_Products.ERP5Type.Document.TransformationRule_TransformationRule_implements_IRule (testERP5Interfaces.TestERP5Interfaces)
test_Products.ERP5Type.Document.Transformation_Transformation_implements_IAmountGenerator (testERP5Interfaces.TestERP5Interfaces)
test_Products.ERP5Type.Document.Transformation_Transformation_implements_IVariated (testERP5Interfaces.TestERP5Interfaces)
test_Products.ERP5Type.Document.TransformedResource_TransformedResource_implements_IVariated (testERP5Interfaces.TestERP5Interfaces)
testERP5SimulationBPMCore (1 errors)
test_BusinessState_getRemainingTradePhaseList (Products.ERP5.tests.testBPMCore.TestBPMImplementation)
testERP5TypeInterfaces (1 errors)
test_Products.ERP5Type.ConsistencyMessage_ConsistencyMessage_implements_IConsistencyMessage (testERP5TypeInterfaces.TestERP5TypeInterfaces)
testFormPrintoutAsODT (1 failures, 1 skips)
test_02_Table_07_CellFormat (testFormPrintoutAsODT.TestFormPrintoutAsODT), 7. Normal case: cell format cetting
testICal (1 failures)
test_01_renderEvent (testICal.TestICal)
testImmobilisation (1 failures)
test_19_TestAccountingBuildingAndDivergence (testImmobilisation.TestImmobilisation)
testInvoice (2 failures, 1 errors)
test_12_SplitPackingListAndAcceptInvoice (testInvoice.TestSaleInvoice)
test_delivery_mode_and_incoterm_on_invoice (testInvoice.TestSaleInvoice)
test_delivery_mode_and_incoterm_on_invoice (testInvoice.TestPurchaseInvoice)
testItem (2 errors)
test_01_ItemSimpleTest (testItem.TestItem)
test_02_ItemWithInvoice (testItem.TestItem)
testLegacyOrder (1 failures, 2 errors)
test_Order_viewAsODT_big_image (testLegacyOrder.TestOrder)
test_Order_viewAsODT_image (testLegacyOrder.TestOrder)
test_order_payment_condition_not_copied (testLegacyOrder.TestOrder)
testMovementGroup (1 failures)
Make sure that _separate method works if argument is an empty list.
testNotificationMessageModule (4 failures)
test_safe_substitution_content (testNotificationMessageModule.TestNotificationMessageModule), Tests that 'safe' substitution is performed, unless safe_substitute is
test_substitution_content (testNotificationMessageModule.TestNotificationMessageModule), Tests that content and subject have string.Template based substitutions
test_substitution_content_and_convert (testNotificationMessageModule.TestNotificationMessageModule), Tests that substitution also works with different target format.
test_substitution_content_parameters (testNotificationMessageModule.TestNotificationMessageModule), Tests that we can pass parameters to convert to the substitution method,
testOpenOrder (2 failures)
testOpenOrderRule (testOpenOrder.TestOpenOrder)
testPeriodicityDateList (testOpenOrder.TestOpenOrder)
testOrder (1 failures)
test_order_payment_condition_not_copied (testOrder.TestOrder)
testPayroll (1 failures)
test_AccountingLineGeneration (testPayroll.TestPayroll)
testProductionOrder (2 failures)
test_02_testSourcingSimulationExpand (testProductionOrder.TestProductionOrder)
test_05_testSourcingSimulationBuild (testProductionOrder.TestProductionOrder)
testProductionOrderApparel (1 failures)
test_03_testIndustrialPhase (testProductionOrderApparel.TestProductionOrderApparel)
testProductionPackingList (1 failures)
test_01_sourcingDelivery (testProductionPackingList.TestProductionDelivery)
testProductionPackingListApparel (1 failures)
test_01_sourcingDelivery (testProductionPackingListApparel.TestProductionDeliveryApparel)
testProxyField (1 failures)
testSkinSelectionTemplateField (testProxyField.TestProxyField)
testPurchaseOrder (1 failures)
test_order_payment_condition_not_copied (testPurchaseOrder.TestPurchaseOrder)
testResource (1 errors)
test_sourceDestinationReferenceOnSupplyLineOnDefaultSupplyLine (testResource.TestResource), Check that it's possible to set and get a source/destination_reference
testSerializeForm (1 failures)
test checking if the field values are of the proper type.
testTaxLineTradeCondition (6 failures)
test_tax_line_build_accounting (testTaxLineTradeCondition.TestTaxLineOrderSimulationSaleOrder)
test_tax_line_simulation (testTaxLineTradeCondition.TestTaxLineOrderSimulationSaleOrder)
test_tax_line_build_accounting (testTaxLineTradeCondition.TestTaxLineOrderSimulationPurchaseOrder)
test_tax_line_simulation (testTaxLineTradeCondition.TestTaxLineOrderSimulationPurchaseOrder)
test_tax_line_simulation (testTaxLineTradeCondition.TestTaxLineInvoiceSimulationPurchaseInvoice)
test_tax_line_simulation (testTaxLineTradeCondition.TestTaxLineInvoiceSimulationSaleInvoice)
testTemplate (2 failures)
test_NonDeliveryTemplateNotIndexable (testTemplate.TestTemplate)
test_manyTemplatesWithoutReindexation (testTemplate.TestTemplate), Check what happen when templates are created one by one without reindexation
testTradeModelLine (6 failures)
test_BuildTradeModelLineAndAccountingFromInvoice (testTradeModelLine.TestTradeModelLineSale)
test_BuildTradeModelLineAndAccountingFromOrder (testTradeModelLine.TestTradeModelLineSale)
test_TradeModelRuleSimulationBuildInvoiceBuildInvoiceTransactionLines (testTradeModelLine.TestTradeModelLineSale), Check that having properly configured invoice transaction rule it invoice transaction lines are nicely generated and have proper amounts
test_TradeModelRuleSimulationBuildInvoiceInvoiceLineModifyDivergencyAndSolving (testTradeModelLine.TestTradeModelLineSale), Check that after changing invoice line invoice is properly diverged and it is possible to solve
test_TradeModelRuleSimulationBuildInvoiceNewInvoiceLineSupport (testTradeModelLine.TestTradeModelLineSale), Check how is supported addition of invoice line to invoice build from order
test_TradeModelRuleSimulationPackingListSplitBuildInvoiceBuildDifferentRatio (testTradeModelLine.TestTradeModelLineSale), Check building invoice after splitting packing list using different ratio
testTradeModelLinePurchase (6 failures)
test_BuildTradeModelLineAndAccountingFromInvoice (testTradeModelLinePurchase.TestTradeModelLinePurchase)
test_BuildTradeModelLineAndAccountingFromOrder (testTradeModelLinePurchase.TestTradeModelLinePurchase)
test_TradeModelRuleSimulationBuildInvoiceBuildInvoiceTransactionLines (testTradeModelLinePurchase.TestTradeModelLinePurchase), Check that having properly configured invoice transaction rule it invoice transaction lines are nicely generated and have proper amounts
test_TradeModelRuleSimulationBuildInvoiceInvoiceLineModifyDivergencyAndSolving (testTradeModelLinePurchase.TestTradeModelLinePurchase), Check that after changing invoice line invoice is properly diverged and it is possible to solve
test_TradeModelRuleSimulationBuildInvoiceNewInvoiceLineSupport (testTradeModelLinePurchase.TestTradeModelLinePurchase), Check how is supported addition of invoice line to invoice build from order
test_TradeModelRuleSimulationPackingListSplitBuildInvoiceBuildDifferentRatio (testTradeModelLinePurchase.TestTradeModelLinePurchase), Check building invoice after splitting packing list using different ratio
testXHTML (5 failures)
test_configurationOfFieldLibrary (testXHTML.TestXHTML)
test_deadProxyFields (testXHTML.TestXHTML)
test_erp5_dms_Drawing_OOoDocument_viewAsWeb (testXHTML.TestXHTML)
test_erp5_dms_Presentation_OOoDocument_viewAsWeb (testXHTML.TestXHTML)
test_listActionInListbox (testXHTML.TestXHTML)
The following tests were at least partly skipped:
testBase (3 skips)
testERP5Catalog (4 skips)
testERP5Simulation (61 skips)
testMRP (4 skips)
testSQLCachedWorklist (1 skips)
testSelectionTool (7 skips)
The following tests have an unknown status:
'Products/ERP5Type/tests/runUnitTest.py' '--erp5_sql_connection_string' 'test5 test' 'testArchive'
'Products/ERP5Type/tests/runUnitTest.py' '--erp5_sql_connection_string' 'test1 test' 'testERP5Administration'
'Products/ERP5Type/tests/runUnitTest.py' '--erp5_sql_connection_string' 'test3 test' 'testInventoryAPI'
-------------- next part --------------
ERROR: test_10_ManuallyAddedMovements (testAdvancedInvoicing.TestAdvancedSaleInvoice)
----------------------------------------------------------------------
Traceback (most recent call last):
File "/home/buildbot/slave/full.ERP5.blade-nxd1-10.4/build/products/ERP5Type/tests/backportUnittest.py", line 145, in run
testMethod()
File "/home/buildbot/slave/full.ERP5.blade-nxd1-10.4/build/unit_test/Products/ERP5/tests/testAdvancedInvoicing.py", line 928, in test_10_ManuallyAddedMovements
sequence_list.play(self, quiet=quiet)
File "/home/buildbot/slave/full.ERP5.blade-nxd1-10.4/build/unit_test/Products/ERP5Type/tests/Sequence.py", line 192, in play
sequence.play(context, sequence_number=i, quiet=quiet)
File "/home/buildbot/slave/full.ERP5.blade-nxd1-10.4/build/unit_test/Products/ERP5Type/tests/Sequence.py", line 113, in play
self._step_list[self._played_index] \
Current Sequence:
CreateEntities
CreateCurrency
CreateSaleInvoiceTransactionRule
CreateOrder
SetOrderProfile
SetOrderPriceCurrency
CreateNotVariatedResource
Tic
CreateOrderLine
SetOrderLineResource
SetOrderLineDefaultValues
OrderOrder
Tic
CheckDeliveryBuilding
ConfirmOrder
Tic
CheckOrderRule
CheckOrderSimulation
CheckDeliveryBuilding
AddPackingListContainer
AddPackingListContainerLine
SetContainerLineFullQuantity
Tic
CheckPackingListIsPacked
SetReadyPackingList
Tic
StartPackingList
CheckInvoicingRule
Tic
CheckInvoiceBuilding
RebuildAndCheckNothingIsCreated
CheckInvoicesConsistency
StartInvoice
Tic
> AddInvoiceTransactionLines
Tic
CheckSimulationTrees
File "/home/buildbot/slave/full.ERP5.blade-nxd1-10.4/build/unit_test/Products/ERP5Type/tests/Sequence.py", line 96, in play
method(sequence=sequence)
File "/home/buildbot/slave/full.ERP5.blade-nxd1-10.4/build/unit_test/Products/ERP5/tests/testAdvancedInvoicing.py", line 150, in stepAddInvoiceTransactionLines
invoice_transaction.newContent(portal_type=self.invoice_transaction_line_portal_type,
AttributeError: 'NoneType' object has no attribute 'newContent'
ERROR: test_11_ManuallyAddedMovementsManyTransactions (testAdvancedInvoicing.TestAdvancedSaleInvoice)
----------------------------------------------------------------------
Traceback (most recent call last):
File "/home/buildbot/slave/full.ERP5.blade-nxd1-10.4/build/products/ERP5Type/tests/backportUnittest.py", line 145, in run
testMethod()
File "/home/buildbot/slave/full.ERP5.blade-nxd1-10.4/build/unit_test/Products/ERP5/tests/testAdvancedInvoicing.py", line 962, in test_11_ManuallyAddedMovementsManyTransactions
sequence_list.play(self, quiet=quiet)
File "/home/buildbot/slave/full.ERP5.blade-nxd1-10.4/build/unit_test/Products/ERP5Type/tests/Sequence.py", line 192, in play
sequence.play(context, sequence_number=i, quiet=quiet)
File "/home/buildbot/slave/full.ERP5.blade-nxd1-10.4/build/unit_test/Products/ERP5Type/tests/Sequence.py", line 113, in play
self._step_list[self._played_index] \
Current Sequence:
CreateEntities
CreateCurrency
CreateSaleInvoiceTransactionRule
CreateOrder
SetOrderProfile
SetOrderPriceCurrency
CreateNotVariatedResource
Tic
CreateOrderLine
SetOrderLineResource
SetOrderLineDefaultValues
OrderOrder
Tic
CheckDeliveryBuilding
ConfirmOrder
Tic
CheckOrderRule
CheckOrderSimulation
CheckDeliveryBuilding
AddPackingListContainer
AddPackingListContainerLine
SetContainerLineFullQuantity
Tic
CheckPackingListIsPacked
SetReadyPackingList
Tic
StartPackingList
CheckInvoicingRule
Tic
CheckInvoiceBuilding
RebuildAndCheckNothingIsCreated
CheckInvoicesConsistency
Tic
CheckInvoiceIsSolved
StartInvoice
Tic
> AddInvoiceLinesManyTransactions
Tic
CheckSimulationTrees
File "/home/buildbot/slave/full.ERP5.blade-nxd1-10.4/build/unit_test/Products/ERP5Type/tests/Sequence.py", line 96, in play
method(sequence=sequence)
File "/home/buildbot/slave/full.ERP5.blade-nxd1-10.4/build/unit_test/Products/ERP5/tests/testAdvancedInvoicing.py", line 167, in stepAddInvoiceLinesManyTransactions
transaction_line_1 = invoice_transaction.newContent(portal_type=self.invoice_transaction_line_portal_type)
AttributeError: 'NoneType' object has no attribute 'newContent'
FAIL: test_CreatingAccountingTransactionThroughInvoice (testAdvancedInvoicing.TestAdvancedSaleInvoice), test creating simple invoice and accounting transaction
----------------------------------------------------------------------
Traceback (most recent call last):
File "/home/buildbot/slave/full.ERP5.blade-nxd1-10.4/build/products/ERP5Type/tests/backportUnittest.py", line 145, in run
testMethod()
File "/home/buildbot/slave/full.ERP5.blade-nxd1-10.4/build/unit_test/Products/ERP5/tests/testAdvancedInvoicing.py", line 273, in test_CreatingAccountingTransactionThroughInvoice
self.assertNotEquals(invoice_transaction, None)
AssertionError: None == None
Loading Zope ...
Cleaning static files ...
Instance at '/home/buildbot/slave/full.ERP5.blade-nxd1-10.5/build/unit_test' loaded ...
Traceback (most recent call last):
File "Products/ERP5Type/tests/runUnitTest.py", line 580, in ?
main()
File "Products/ERP5Type/tests/runUnitTest.py", line 563, in main
debug=debug)
File "Products/ERP5Type/tests/runUnitTest.py", line 430, in runUnitTestList
suite = test_loader.loadTestsFromNames(test_list)
File "/usr/lib64/python2.4/unittest.py", line 556, in loadTestsFromNames
suites = [self.loadTestsFromName(name, module) for name in names]
File "Products/ERP5Type/tests/runUnitTest.py", line 228, in loadTestsFromName
return unittest.TestLoader.loadTestsFromName(self, name, module)
File "/usr/lib64/python2.4/unittest.py", line 524, in loadTestsFromName
module = __import__('.'.join(parts_copy))
File "/home/buildbot/slave/full.ERP5.blade-nxd1-10.5/build/unit_test/Products/ERP5Catalog/tests/testArchive.py", line 46, in ?
from Products.ERP5.tests.testInventoryAPI import InventoryAPITestCase
File "/home/buildbot/slave/full.ERP5.blade-nxd1-10.5/build/unit_test/Products/ERP5/tests/testInventoryAPI.py", line 44, in ?
from Products.ERP5.Document.OrderRule import OrderRule
ImportError: No module named OrderRule
ERROR: test_165_checkCopyBuildInstall (testBusinessTemplate.TestBusinessTemplate)
----------------------------------------------------------------------
Traceback (most recent call last):
File "/home/buildbot/slave/full.ERP5.blade-nxd1-10.1/build/products/ERP5Type/tests/backportUnittest.py", line 145, in run
testMethod()
File "/home/buildbot/slave/full.ERP5.blade-nxd1-10.1/build/unit_test/Products/ERP5/tests/testBusinessTemplate.py", line 5909, in test_165_checkCopyBuildInstall
sequence_list.play(self, quiet=quiet)
File "/home/buildbot/slave/full.ERP5.blade-nxd1-10.1/build/unit_test/Products/ERP5Type/tests/Sequence.py", line 192, in play
sequence.play(context, sequence_number=i, quiet=quiet)
File "/home/buildbot/slave/full.ERP5.blade-nxd1-10.1/build/unit_test/Products/ERP5Type/tests/Sequence.py", line 113, in play
self._step_list[self._played_index] \
Current Sequence:
UseCoreBusinessTemplate
CopyCoreBusinessTemplate
BuildCopyCoreBusinessTemplate
> InstallCopyCoreBusinessTemplate
File "/home/buildbot/slave/full.ERP5.blade-nxd1-10.1/build/unit_test/Products/ERP5Type/tests/Sequence.py", line 96, in play
method(sequence=sequence)
File "/home/buildbot/slave/full.ERP5.blade-nxd1-10.1/build/unit_test/Products/ERP5/tests/testBusinessTemplate.py", line 219, in stepInstallCopyCoreBusinessTemplate
bt.install()
File "/home/buildbot/slave/full.ERP5.blade-nxd1-10.1/build/unit_test/Products/ERP5Type/Base.py", line 237, in __call__
result = apply(self.__dict__['_m'], (instance,) + args, kw)
File "/home/buildbot/slave/full.ERP5.blade-nxd1-10.1/build/unit_test/Products/ERP5/Document/BusinessTemplate.py", line 5203, in install
return self._install(**kw)
File "/home/buildbot/slave/full.ERP5.blade-nxd1-10.1/build/unit_test/Products/ERP5/Document/BusinessTemplate.py", line 5139, in _install
trashbin=trashbin, installed_bt=installed_bt)
File "/home/buildbot/slave/full.ERP5.blade-nxd1-10.1/build/unit_test/Products/ERP5/Document/BusinessTemplate.py", line 1831, in install
for wf_id in self._objects[path].split(', '):
AttributeError: 'list' object has no attribute 'split'
FAIL: test_164_checkCopyBuild (testBusinessTemplate.TestBusinessTemplate)
----------------------------------------------------------------------
Traceback (most recent call last):
File "/home/buildbot/slave/full.ERP5.blade-nxd1-10.1/build/products/ERP5Type/tests/backportUnittest.py", line 145, in run
testMethod()
File "/home/buildbot/slave/full.ERP5.blade-nxd1-10.1/build/unit_test/Products/ERP5/tests/testBusinessTemplate.py", line 5893, in test_164_checkCopyBuild
sequence_list.play(self, quiet=quiet)
File "/home/buildbot/slave/full.ERP5.blade-nxd1-10.1/build/unit_test/Products/ERP5Type/tests/Sequence.py", line 192, in play
sequence.play(context, sequence_number=i, quiet=quiet)
File "/home/buildbot/slave/full.ERP5.blade-nxd1-10.1/build/unit_test/Products/ERP5Type/tests/Sequence.py", line 113, in play
self._step_list[self._played_index] \
Current Sequence:
UseCoreBusinessTemplate
CopyCoreBusinessTemplate
BuildCopyCoreBusinessTemplate
> CheckOriginalAndCopyBusinessTemplate
File "/home/buildbot/slave/full.ERP5.blade-nxd1-10.1/build/unit_test/Products/ERP5Type/tests/Sequence.py", line 96, in play
method(sequence=sequence)
File "/home/buildbot/slave/full.ERP5.blade-nxd1-10.1/build/unit_test/Products/ERP5/tests/testBusinessTemplate.py", line 233, in stepCheckOriginalAndCopyBusinessTemplate
self.assertEquals(original_obj.getKeys(), copy_obj.getKeys())
AssertionError: ['StandardSecurity', 'DocumentExtraction'] != ['ExtensionTemplateItem/StandardSecurity', 'ExtensionTemplateItem/DocumentExtraction']
FAIL: test_Base_getEntityListFromFromHeader (testCRM.TestCRMMailIngestion)
----------------------------------------------------------------------
Traceback (most recent call last):
File "/home/buildbot/slave/full.ERP5.blade-nxd1-10.2/build/products/ERP5Type/tests/backportUnittest.py", line 145, in run
testMethod()
File "/home/buildbot/slave/full.ERP5.blade-nxd1-10.2/build/unit_test/Products/ERP5/tests/testCRM.py", line 452, in test_Base_getEntityListFromFromHeader
'%r should return %r, but returned %r' %
AssertionError: '"me at erp5.org,sender at customer.com," <he at erp5.org>' should return ['person_module/he'], but returned ['person_module/sender', 'person_module/he']
FAIL: test_01_delivery_mode_on_sale_packing_list_and_invoice (testConversionInSimulation.TestConversionInSimulation)
----------------------------------------------------------------------
Traceback (most recent call last):
File "/home/buildbot/slave/full.ERP5.blade-nxd1-10.4/build/products/ERP5Type/tests/backportUnittest.py", line 145, in run
testMethod()
File "/home/buildbot/slave/full.ERP5.blade-nxd1-10.4/build/unit_test/Products/ERP5/tests/testConversionInSimulation.py", line 775, in test_01_delivery_mode_on_sale_packing_list_and_invoice
order.getDeliveryMode())
AssertionError: None != 'by_mail'
ERROR: test_01_QuantityDivergenceTester (testDivergenceTester.TestDivergenceTester)
----------------------------------------------------------------------
Traceback (most recent call last):
File "/home/buildbot/slave/full.ERP5.blade-nxd1-10.3/build/products/ERP5Type/tests/backportUnittest.py", line 136, in run
self.setUp()
File "/home/buildbot/slave/full.ERP5.blade-nxd1-10.3/build/unit_test/Products/ERP5Type/tests/ERP5TypeTestCase.py", line 516, in setUp
erp5_catalog_storage=erp5_catalog_storage)
File "/home/buildbot/slave/full.ERP5.blade-nxd1-10.3/build/unit_test/Products/ERP5Type/tests/ERP5TypeTestCase.py", line 994, in setUpERP5Site
setup_once()
File "/home/buildbot/slave/full.ERP5.blade-nxd1-10.3/build/unit_test/Products/ERP5/tests/testDivergenceTester.py", line 92, in setUpOnce
self.bootstrapSite()
File "/home/buildbot/slave/full.ERP5.blade-nxd1-10.3/build/unit_test/Products/ERP5/tests/testDivergenceTester.py", line 83, in bootstrapSite
sequence_list.play(self, quiet=self.quiet)
File "/home/buildbot/slave/full.ERP5.blade-nxd1-10.3/build/unit_test/Products/ERP5Type/tests/Sequence.py", line 192, in play
sequence.play(context, sequence_number=i, quiet=quiet)
File "/home/buildbot/slave/full.ERP5.blade-nxd1-10.3/build/unit_test/Products/ERP5Type/tests/Sequence.py", line 113, in play
self._step_list[self._played_index] \
Current Sequence:
> RemoveDivergenceTesters
CreateOrganisation1
CreateOrganisation2
CreateOrganisation3
CreateOrder
SetOrderProfile
CreateNotVariatedResource
Tic
CreateOrderLine
SetOrderLineResource
SetOrderLineDefaultValues
OrderOrder
Tic
ConfirmOrder
Tic
File "/home/buildbot/slave/full.ERP5.blade-nxd1-10.3/build/unit_test/Products/ERP5Type/tests/Sequence.py", line 96, in play
method(sequence=sequence)
File "/home/buildbot/slave/full.ERP5.blade-nxd1-10.3/build/unit_test/Products/ERP5/tests/testDivergenceTester.py", line 54, in stepRemoveDivergenceTesters
rule.manage_delObjects(
File "/home/buildbot/slave/full.ERP5.blade-nxd1-10.3/build/unit_test/Products/ERP5Type/CopySupport.py", line 224, in manage_delObjects
ob=self.getPortalObject().portal_catalog.getObject(uid)
File "/home/buildbot/slave/full.ERP5.blade-nxd1-10.3/build/unit_test/Products/ZSQLCatalog/ZSQLCatalog.py", line 948, in getobject
path = self.getpath(uid, sql_catalog_id=sql_catalog_id)
File "/home/buildbot/slave/full.ERP5.blade-nxd1-10.3/build/unit_test/Products/ZSQLCatalog/ZSQLCatalog.py", line 926, in getpath
object = catalog[uid]
File "/home/buildbot/slave/full.ERP5.blade-nxd1-10.3/build/unit_test/Products/ZSQLCatalog/SQLCatalog.py", line 860, in __getitem__
raise KeyError, uid
KeyError: 13L
Loading Zope ...
Cleaning static files ...
Instance at '/home/buildbot/slave/full.ERP5.blade-nxd1-10.1/build/unit_test' loaded ...
Traceback (most recent call last):
File "Products/ERP5Type/tests/runUnitTest.py", line 580, in ?
main()
File "Products/ERP5Type/tests/runUnitTest.py", line 563, in main
debug=debug)
File "Products/ERP5Type/tests/runUnitTest.py", line 430, in runUnitTestList
suite = test_loader.loadTestsFromNames(test_list)
File "/usr/lib64/python2.4/unittest.py", line 556, in loadTestsFromNames
suites = [self.loadTestsFromName(name, module) for name in names]
File "Products/ERP5Type/tests/runUnitTest.py", line 228, in loadTestsFromName
return unittest.TestLoader.loadTestsFromName(self, name, module)
File "/usr/lib64/python2.4/unittest.py", line 524, in loadTestsFromName
module = __import__('.'.join(parts_copy))
File "/home/buildbot/slave/full.ERP5.blade-nxd1-10.1/build/unit_test/Products/ERP5/tests/testERP5Administration.py", line 32, in ?
from Products.ERP5.tests.testInventoryAPI import InventoryAPITestCase
File "/home/buildbot/slave/full.ERP5.blade-nxd1-10.1/build/unit_test/Products/ERP5/tests/testInventoryAPI.py", line 44, in ?
from Products.ERP5.Document.OrderRule import OrderRule
ImportError: No module named OrderRule
ERROR: test_Products.ERP5.AggregatedAmountList_AggregatedAmountList_implements_IAmountList (testERP5Interfaces.TestERP5Interfaces)
----------------------------------------------------------------------
Traceback (most recent call last):
File "/home/buildbot/slave/full.ERP5.blade-nxd1-10.1/build/products/ERP5Type/tests/backportUnittest.py", line 145, in run
testMethod()
File "/home/buildbot/slave/full.ERP5.blade-nxd1-10.1/build/unit_test/Products/ERP5Type/tests/testERP5TypeInterfaces.py", line 66, in testMethod
verifyClass(Interface, Klass)
File "/usr/lib/erp5/lib/python/zope/interface/verify.py", line 90, in verifyClass
return _verify(iface, candidate, tentative, vtype='c')
File "/usr/lib/erp5/lib/python/zope/interface/verify.py", line 51, in _verify
raise DoesNotImplement(iface)
DoesNotImplement: An object does not implement interface <InterfaceClass IAmountList.IAmountList>
ERROR: test_Products.ERP5Type.Document.BusinessPath_BusinessPath_implements_IBusinessPath (testERP5Interfaces.TestERP5Interfaces)
----------------------------------------------------------------------
Traceback (most recent call last):
File "/home/buildbot/slave/full.ERP5.blade-nxd1-10.1/build/products/ERP5Type/tests/backportUnittest.py", line 145, in run
testMethod()
File "/home/buildbot/slave/full.ERP5.blade-nxd1-10.1/build/unit_test/Products/ERP5Type/tests/testERP5TypeInterfaces.py", line 66, in testMethod
verifyClass(Interface, Klass)
File "/usr/lib/erp5/lib/python/zope/interface/verify.py", line 90, in verifyClass
return _verify(iface, candidate, tentative, vtype='c')
File "/usr/lib/erp5/lib/python/zope/interface/verify.py", line 60, in _verify
raise BrokenImplementation(iface, n)
BrokenImplementation: An object has failed to implement interface <InterfaceClass IBusinessPath.IBusinessPath>
The getExpectedCompletionDuration attribute was not provided.
ERROR: test_Products.ERP5Type.Document.BusinessPath_BusinessPath_implements_ICategoryAccessProvider (testERP5Interfaces.TestERP5Interfaces)
----------------------------------------------------------------------
Traceback (most recent call last):
File "/home/buildbot/slave/full.ERP5.blade-nxd1-10.1/build/products/ERP5Type/tests/backportUnittest.py", line 145, in run
testMethod()
File "/home/buildbot/slave/full.ERP5.blade-nxd1-10.1/build/unit_test/Products/ERP5Type/tests/testERP5TypeInterfaces.py", line 66, in testMethod
verifyClass(Interface, Klass)
File "/usr/lib/erp5/lib/python/zope/interface/verify.py", line 90, in verifyClass
return _verify(iface, candidate, tentative, vtype='c')
File "/usr/lib/erp5/lib/python/zope/interface/verify.py", line 85, in _verify
raise BrokenMethodImplementation(n, mess)
BrokenMethodImplementation: The implementation of _getAcquiredCategoryMembershipList violates its contract
because implementation doesn't allow enough arguments.
ERROR: test_Products.ERP5Type.Document.Document_Document_implements_IDocument (testERP5Interfaces.TestERP5Interfaces)
----------------------------------------------------------------------
Traceback (most recent call last):
File "/home/buildbot/slave/full.ERP5.blade-nxd1-10.1/build/products/ERP5Type/tests/backportUnittest.py", line 145, in run
testMethod()
File "/home/buildbot/slave/full.ERP5.blade-nxd1-10.1/build/unit_test/Products/ERP5Type/tests/testERP5TypeInterfaces.py", line 66, in testMethod
verifyClass(Interface, Klass)
File "/usr/lib/erp5/lib/python/zope/interface/verify.py", line 90, in verifyClass
return _verify(iface, candidate, tentative, vtype='c')
File "/usr/lib/erp5/lib/python/zope/interface/verify.py", line 51, in _verify
raise DoesNotImplement(iface)
DoesNotImplement: An object does not implement interface <InterfaceClass IDocument.IDocument>
ERROR: test_Products.ERP5Type.Document.EmailDocument_EmailDocument_implements_IDocument (testERP5Interfaces.TestERP5Interfaces)
----------------------------------------------------------------------
Traceback (most recent call last):
File "/home/buildbot/slave/full.ERP5.blade-nxd1-10.1/build/products/ERP5Type/tests/backportUnittest.py", line 145, in run
testMethod()
File "/home/buildbot/slave/full.ERP5.blade-nxd1-10.1/build/unit_test/Products/ERP5Type/tests/testERP5TypeInterfaces.py", line 66, in testMethod
verifyClass(Interface, Klass)
File "/usr/lib/erp5/lib/python/zope/interface/verify.py", line 90, in verifyClass
return _verify(iface, candidate, tentative, vtype='c')
File "/usr/lib/erp5/lib/python/zope/interface/verify.py", line 51, in _verify
raise DoesNotImplement(iface)
DoesNotImplement: An object does not implement interface <InterfaceClass IDocument.IDocument>
ERROR: test_Products.ERP5Type.Document.Event_Event_implements_IDocument (testERP5Interfaces.TestERP5Interfaces)
----------------------------------------------------------------------
Traceback (most recent call last):
File "/home/buildbot/slave/full.ERP5.blade-nxd1-10.1/build/products/ERP5Type/tests/backportUnittest.py", line 145, in run
testMethod()
File "/home/buildbot/slave/full.ERP5.blade-nxd1-10.1/build/unit_test/Products/ERP5Type/tests/testERP5TypeInterfaces.py", line 66, in testMethod
verifyClass(Interface, Klass)
File "/usr/lib/erp5/lib/python/zope/interface/verify.py", line 90, in verifyClass
return _verify(iface, candidate, tentative, vtype='c')
File "/usr/lib/erp5/lib/python/zope/interface/verify.py", line 51, in _verify
raise DoesNotImplement(iface)
DoesNotImplement: An object does not implement interface <InterfaceClass IDocument.IDocument>
ERROR: test_Products.ERP5Type.Document.File_File_implements_IDocument (testERP5Interfaces.TestERP5Interfaces)
----------------------------------------------------------------------
Traceback (most recent call last):
File "/home/buildbot/slave/full.ERP5.blade-nxd1-10.1/build/products/ERP5Type/tests/backportUnittest.py", line 145, in run
testMethod()
File "/home/buildbot/slave/full.ERP5.blade-nxd1-10.1/build/unit_test/Products/ERP5Type/tests/testERP5TypeInterfaces.py", line 66, in testMethod
verifyClass(Interface, Klass)
File "/usr/lib/erp5/lib/python/zope/interface/verify.py", line 90, in verifyClass
return _verify(iface, candidate, tentative, vtype='c')
File "/usr/lib/erp5/lib/python/zope/interface/verify.py", line 51, in _verify
raise DoesNotImplement(iface)
DoesNotImplement: An object does not implement interface <InterfaceClass IDocument.IDocument>
ERROR: test_Products.ERP5Type.Document.Image_Image_implements_IDocument (testERP5Interfaces.TestERP5Interfaces)
----------------------------------------------------------------------
Traceback (most recent call last):
File "/home/buildbot/slave/full.ERP5.blade-nxd1-10.1/build/products/ERP5Type/tests/backportUnittest.py", line 145, in run
testMethod()
File "/home/buildbot/slave/full.ERP5.blade-nxd1-10.1/build/unit_test/Products/ERP5Type/tests/testERP5TypeInterfaces.py", line 66, in testMethod
verifyClass(Interface, Klass)
File "/usr/lib/erp5/lib/python/zope/interface/verify.py", line 90, in verifyClass
return _verify(iface, candidate, tentative, vtype='c')
File "/usr/lib/erp5/lib/python/zope/interface/verify.py", line 51, in _verify
raise DoesNotImplement(iface)
DoesNotImplement: An object does not implement interface <InterfaceClass IDocument.IDocument>
ERROR: test_Products.ERP5Type.Document.OOoDocument_OOoDocument_implements_IDocument (testERP5Interfaces.TestERP5Interfaces)
----------------------------------------------------------------------
Traceback (most recent call last):
File "/home/buildbot/slave/full.ERP5.blade-nxd1-10.1/build/products/ERP5Type/tests/backportUnittest.py", line 145, in run
testMethod()
File "/home/buildbot/slave/full.ERP5.blade-nxd1-10.1/build/unit_test/Products/ERP5Type/tests/testERP5TypeInterfaces.py", line 66, in testMethod
verifyClass(Interface, Klass)
File "/usr/lib/erp5/lib/python/zope/interface/verify.py", line 90, in verifyClass
return _verify(iface, candidate, tentative, vtype='c')
File "/usr/lib/erp5/lib/python/zope/interface/verify.py", line 51, in _verify
raise DoesNotImplement(iface)
DoesNotImplement: An object does not implement interface <InterfaceClass IDocument.IDocument>
ERROR: test_Products.ERP5Type.Document.TextDocument_TextDocument_implements_IDocument (testERP5Interfaces.TestERP5Interfaces)
----------------------------------------------------------------------
Traceback (most recent call last):
File "/home/buildbot/slave/full.ERP5.blade-nxd1-10.1/build/products/ERP5Type/tests/backportUnittest.py", line 145, in run
testMethod()
File "/home/buildbot/slave/full.ERP5.blade-nxd1-10.1/build/unit_test/Products/ERP5Type/tests/testERP5TypeInterfaces.py", line 66, in testMethod
verifyClass(Interface, Klass)
File "/usr/lib/erp5/lib/python/zope/interface/verify.py", line 90, in verifyClass
return _verify(iface, candidate, tentative, vtype='c')
File "/usr/lib/erp5/lib/python/zope/interface/verify.py", line 51, in _verify
raise DoesNotImplement(iface)
DoesNotImplement: An object does not implement interface <InterfaceClass IDocument.IDocument>
ERROR: test_Products.ERP5Type.Document.TradeCondition_TradeCondition_implements_IAmountGenerator (testERP5Interfaces.TestERP5Interfaces)
----------------------------------------------------------------------
Traceback (most recent call last):
File "/home/buildbot/slave/full.ERP5.blade-nxd1-10.1/build/products/ERP5Type/tests/backportUnittest.py", line 145, in run
testMethod()
File "/home/buildbot/slave/full.ERP5.blade-nxd1-10.1/build/unit_test/Products/ERP5Type/tests/testERP5TypeInterfaces.py", line 66, in testMethod
verifyClass(Interface, Klass)
File "/usr/lib/erp5/lib/python/zope/interface/verify.py", line 90, in verifyClass
return _verify(iface, candidate, tentative, vtype='c')
File "/usr/lib/erp5/lib/python/zope/interface/verify.py", line 60, in _verify
raise BrokenImplementation(iface, n)
BrokenImplementation: An object has failed to implement interface <InterfaceClass IAmountGenerator.IAmountGenerator>
The getGeneratedAmountList attribute was not provided.
ERROR: test_Products.ERP5Type.Document.TradeModelCell_TradeModelCell_implements_IAmountGenerator (testERP5Interfaces.TestERP5Interfaces)
----------------------------------------------------------------------
Traceback (most recent call last):
File "/home/buildbot/slave/full.ERP5.blade-nxd1-10.1/build/products/ERP5Type/tests/backportUnittest.py", line 145, in run
testMethod()
File "/home/buildbot/slave/full.ERP5.blade-nxd1-10.1/build/unit_test/Products/ERP5Type/tests/testERP5TypeInterfaces.py", line 66, in testMethod
verifyClass(Interface, Klass)
File "/usr/lib/erp5/lib/python/zope/interface/verify.py", line 90, in verifyClass
return _verify(iface, candidate, tentative, vtype='c')
File "/usr/lib/erp5/lib/python/zope/interface/verify.py", line 60, in _verify
raise BrokenImplementation(iface, n)
BrokenImplementation: An object has failed to implement interface <InterfaceClass IAmountGenerator.IAmountGenerator>
The getGeneratedAmountList attribute was not provided.
ERROR: test_Products.ERP5Type.Document.TradeModelCell_TradeModelCell_implements_IVariated (testERP5Interfaces.TestERP5Interfaces)
----------------------------------------------------------------------
Traceback (most recent call last):
File "/home/buildbot/slave/full.ERP5.blade-nxd1-10.1/build/products/ERP5Type/tests/backportUnittest.py", line 145, in run
testMethod()
File "/home/buildbot/slave/full.ERP5.blade-nxd1-10.1/build/unit_test/Products/ERP5Type/tests/testERP5TypeInterfaces.py", line 66, in testMethod
verifyClass(Interface, Klass)
File "/usr/lib/erp5/lib/python/zope/interface/verify.py", line 90, in verifyClass
return _verify(iface, candidate, tentative, vtype='c')
File "/usr/lib/erp5/lib/python/zope/interface/verify.py", line 85, in _verify
raise BrokenMethodImplementation(n, mess)
BrokenMethodImplementation: The implementation of setVariationCategoryList violates its contract
because implementation doesn't allow enough arguments.
ERROR: test_Products.ERP5Type.Document.TradeModelLine_TradeModelLine_implements_IAmountGenerator (testERP5Interfaces.TestERP5Interfaces)
----------------------------------------------------------------------
Traceback (most recent call last):
File "/home/buildbot/slave/full.ERP5.blade-nxd1-10.1/build/products/ERP5Type/tests/backportUnittest.py", line 145, in run
testMethod()
File "/home/buildbot/slave/full.ERP5.blade-nxd1-10.1/build/unit_test/Products/ERP5Type/tests/testERP5TypeInterfaces.py", line 66, in testMethod
verifyClass(Interface, Klass)
File "/usr/lib/erp5/lib/python/zope/interface/verify.py", line 90, in verifyClass
return _verify(iface, candidate, tentative, vtype='c')
File "/usr/lib/erp5/lib/python/zope/interface/verify.py", line 60, in _verify
raise BrokenImplementation(iface, n)
BrokenImplementation: An object has failed to implement interface <InterfaceClass IAmountGenerator.IAmountGenerator>
The getGeneratedAmountList attribute was not provided.
ERROR: test_Products.ERP5Type.Document.TradeModelLine_TradeModelLine_implements_IVariated (testERP5Interfaces.TestERP5Interfaces)
----------------------------------------------------------------------
Traceback (most recent call last):
File "/home/buildbot/slave/full.ERP5.blade-nxd1-10.1/build/products/ERP5Type/tests/backportUnittest.py", line 145, in run
testMethod()
File "/home/buildbot/slave/full.ERP5.blade-nxd1-10.1/build/unit_test/Products/ERP5Type/tests/testERP5TypeInterfaces.py", line 66, in testMethod
verifyClass(Interface, Klass)
File "/usr/lib/erp5/lib/python/zope/interface/verify.py", line 90, in verifyClass
return _verify(iface, candidate, tentative, vtype='c')
File "/usr/lib/erp5/lib/python/zope/interface/verify.py", line 85, in _verify
raise BrokenMethodImplementation(n, mess)
BrokenMethodImplementation: The implementation of setVariationCategoryList violates its contract
because implementation doesn't allow enough arguments.
ERROR: test_Products.ERP5Type.Document.TradeModelRule_TradeModelRule_implements_IRule (testERP5Interfaces.TestERP5Interfaces)
----------------------------------------------------------------------
Traceback (most recent call last):
File "/home/buildbot/slave/full.ERP5.blade-nxd1-10.1/build/products/ERP5Type/tests/backportUnittest.py", line 145, in run
testMethod()
File "/home/buildbot/slave/full.ERP5.blade-nxd1-10.1/build/unit_test/Products/ERP5Type/tests/testERP5TypeInterfaces.py", line 66, in testMethod
verifyClass(Interface, Klass)
File "/usr/lib/erp5/lib/python/zope/interface/verify.py", line 90, in verifyClass
return _verify(iface, candidate, tentative, vtype='c')
File "/usr/lib/erp5/lib/python/zope/interface/verify.py", line 60, in _verify
raise BrokenImplementation(iface, n)
BrokenImplementation: An object has failed to implement interface <InterfaceClass IRule.IRule>
The updateMovementCollection attribute was not provided.
ERROR: test_Products.ERP5Type.Document.TransformationRule_TransformationRule_implements_IRule (testERP5Interfaces.TestERP5Interfaces)
----------------------------------------------------------------------
Traceback (most recent call last):
File "/home/buildbot/slave/full.ERP5.blade-nxd1-10.1/build/products/ERP5Type/tests/backportUnittest.py", line 145, in run
testMethod()
File "/home/buildbot/slave/full.ERP5.blade-nxd1-10.1/build/unit_test/Products/ERP5Type/tests/testERP5TypeInterfaces.py", line 66, in testMethod
verifyClass(Interface, Klass)
File "/usr/lib/erp5/lib/python/zope/interface/verify.py", line 90, in verifyClass
return _verify(iface, candidate, tentative, vtype='c')
File "/usr/lib/erp5/lib/python/zope/interface/verify.py", line 60, in _verify
raise BrokenImplementation(iface, n)
BrokenImplementation: An object has failed to implement interface <InterfaceClass IRule.IRule>
The updateMovementCollection attribute was not provided.
ERROR: test_Products.ERP5Type.Document.Transformation_Transformation_implements_IAmountGenerator (testERP5Interfaces.TestERP5Interfaces)
----------------------------------------------------------------------
Traceback (most recent call last):
File "/home/buildbot/slave/full.ERP5.blade-nxd1-10.1/build/products/ERP5Type/tests/backportUnittest.py", line 145, in run
testMethod()
File "/home/buildbot/slave/full.ERP5.blade-nxd1-10.1/build/unit_test/Products/ERP5Type/tests/testERP5TypeInterfaces.py", line 66, in testMethod
verifyClass(Interface, Klass)
File "/usr/lib/erp5/lib/python/zope/interface/verify.py", line 90, in verifyClass
return _verify(iface, candidate, tentative, vtype='c')
File "/usr/lib/erp5/lib/python/zope/interface/verify.py", line 60, in _verify
raise BrokenImplementation(iface, n)
BrokenImplementation: An object has failed to implement interface <InterfaceClass IAmountGenerator.IAmountGenerator>
The getGeneratedAmountList attribute was not provided.
ERROR: test_Products.ERP5Type.Document.Transformation_Transformation_implements_IVariated (testERP5Interfaces.TestERP5Interfaces)
----------------------------------------------------------------------
Traceback (most recent call last):
File "/home/buildbot/slave/full.ERP5.blade-nxd1-10.1/build/products/ERP5Type/tests/backportUnittest.py", line 145, in run
testMethod()
File "/home/buildbot/slave/full.ERP5.blade-nxd1-10.1/build/unit_test/Products/ERP5Type/tests/testERP5TypeInterfaces.py", line 66, in testMethod
verifyClass(Interface, Klass)
File "/usr/lib/erp5/lib/python/zope/interface/verify.py", line 90, in verifyClass
return _verify(iface, candidate, tentative, vtype='c')
File "/usr/lib/erp5/lib/python/zope/interface/verify.py", line 85, in _verify
raise BrokenMethodImplementation(n, mess)
BrokenMethodImplementation: The implementation of getVariationRangeCategoryItemList violates its contract
because implementation doesn't allow enough arguments.
ERROR: test_Products.ERP5Type.Document.TransformedResource_TransformedResource_implements_IVariated (testERP5Interfaces.TestERP5Interfaces)
----------------------------------------------------------------------
Traceback (most recent call last):
File "/home/buildbot/slave/full.ERP5.blade-nxd1-10.1/build/products/ERP5Type/tests/backportUnittest.py", line 145, in run
testMethod()
File "/home/buildbot/slave/full.ERP5.blade-nxd1-10.1/build/unit_test/Products/ERP5Type/tests/testERP5TypeInterfaces.py", line 66, in testMethod
verifyClass(Interface, Klass)
File "/usr/lib/erp5/lib/python/zope/interface/verify.py", line 90, in verifyClass
return _verify(iface, candidate, tentative, vtype='c')
File "/usr/lib/erp5/lib/python/zope/interface/verify.py", line 85, in _verify
raise BrokenMethodImplementation(n, mess)
BrokenMethodImplementation: The implementation of setVariationCategoryList violates its contract
because implementation doesn't allow enough arguments.
ERROR: test_BusinessState_getRemainingTradePhaseList (Products.ERP5.tests.testBPMCore.TestBPMImplementation)
----------------------------------------------------------------------
Traceback (most recent call last):
File "/home/buildbot/slave/full.ERP5.blade-nxd1-10.5/build/products/ERP5Type/tests/backportUnittest.py", line 145, in run
testMethod()
File "/home/buildbot/slave/full.ERP5.blade-nxd1-10.5/build/unit_test/Products/ERP5/tests/testBPMCore.py", line 402, in test_BusinessState_getRemainingTradePhaseList
self.stepTic()
File "/home/buildbot/slave/full.ERP5.blade-nxd1-10.5/build/unit_test/Products/ERP5Type/tests/ERP5TypeTestCase.py", line 1078, in stepTic
self.tic()
File "/home/buildbot/slave/full.ERP5.blade-nxd1-10.5/build/unit_test/Products/ERP5Type/tests/ERP5TypeTestCase.py", line 719, in tic
raise RuntimeError,\
RuntimeError: tic is looping forever. These messages are pending: [('/erp5_portal_3ca444db9340e33ca90c2ef0e137d2e3/sale_order_module/1', 'expand', -2, 5)]
Last error message:
AttributeError
getUpdatablePropertyDict
Traceback (innermost last):
Module Products.CMFActivity.ActivityTool, line 295, in __call__
Module Products.ERP5Type.UnrestrictedMethod, line 69, in <lambda>
Module Products.ERP5Type.UnrestrictedMethod, line 105, in unrestricted_apply
Module Products.ERP5.Document.Delivery, line 790, in expand
Module Products.ERP5Type.UnrestrictedMethod, line 69, in <lambda>
Module Products.ERP5Type.UnrestrictedMethod, line 105, in unrestricted_apply
Module Products.ERP5Type.Document.AppliedRule, line 115, in expand
Module Products.ERP5.mixin.rule, line 114, in expand
Module Products.ERP5.mixin.movement_collection_updater, line 176, in updateMovementCollection
Module Products.ERP5.mixin.movement_collection_updater, line 71, in getMovementCollectionDiff
Module Products.ERP5Type.Document.OrderRootSimulationRule, line 108, in getGeneratedMovementList
Module Products.ERP5.mixin.movement_generator, line 92, in _getPropertyAndCategoryList
AttributeError: getUpdatablePropertyDict
ERROR: test_Products.ERP5Type.ConsistencyMessage_ConsistencyMessage_implements_IConsistencyMessage (testERP5TypeInterfaces.TestERP5TypeInterfaces)
----------------------------------------------------------------------
Traceback (most recent call last):
File "/home/buildbot/slave/full.ERP5.blade-nxd1-10.4/build/products/ERP5Type/tests/backportUnittest.py", line 145, in run
testMethod()
File "/home/buildbot/slave/full.ERP5.blade-nxd1-10.4/build/Products/ERP5Type/tests/testERP5TypeInterfaces.py", line 66, in testMethod
verifyClass(Interface, Klass)
File "/usr/lib/erp5/lib/python/zope/interface/verify.py", line 90, in verifyClass
return _verify(iface, candidate, tentative, vtype='c')
File "/usr/lib/erp5/lib/python/zope/interface/verify.py", line 60, in _verify
raise BrokenImplementation(iface, n)
BrokenImplementation: An object has failed to implement interface <InterfaceClass Products.ERP5Type.interfaces.consistency_message.IConsistencyMessage>
The fix attribute was not provided.
FAIL: test_02_Table_07_CellFormat (testFormPrintoutAsODT.TestFormPrintoutAsODT), 7. Normal case: cell format cetting
----------------------------------------------------------------------
Traceback (most recent call last):
File "/home/buildbot/slave/full.ERP5.blade-nxd1-10.4/build/products/ERP5Type/tests/backportUnittest.py", line 145, in run
testMethod()
File "/home/buildbot/slave/full.ERP5.blade-nxd1-10.4/build/unit_test/Products/ERP5OOo/tests/testFormPrintoutAsODT.py", line 633, in test_02_Table_07_CellFormat
self.assertEqual(date_column.attrib[date_value_attrib], '2009-04-20')
AssertionError: '2009-04-19' != '2009-04-20'
FAIL: test_01_renderEvent (testICal.TestICal)
----------------------------------------------------------------------
Traceback (most recent call last):
File "/home/buildbot/slave/full.ERP5.blade-nxd1-10.6/build/products/ERP5Type/tests/backportUnittest.py", line 145, in run
testMethod()
File "/home/buildbot/slave/full.ERP5.blade-nxd1-10.6/build/unit_test/Products/ERP5/tests/testICal.py", line 151, in test_01_renderEvent
self.assertEquals( # if this fail for you, try to set $TZ to Europe/Paris
AssertionError: '20070815T143000Z' != '20070815T083000Z'
FAIL: test_19_TestAccountingBuildingAndDivergence (testImmobilisation.TestImmobilisation)
----------------------------------------------------------------------
Traceback (most recent call last):
File "/home/buildbot/slave/full.ERP5.blade-nxd1-10.5/build/products/ERP5Type/tests/backportUnittest.py", line 145, in run
testMethod()
File "/home/buildbot/slave/full.ERP5.blade-nxd1-10.5/build/unit_test/Products/ERP5/tests/testImmobilisation.py", line 3683, in test_19_TestAccountingBuildingAndDivergence
sequence_list.play(self)
File "/home/buildbot/slave/full.ERP5.blade-nxd1-10.5/build/unit_test/Products/ERP5Type/tests/Sequence.py", line 192, in play
sequence.play(context, sequence_number=i, quiet=quiet)
File "/home/buildbot/slave/full.ERP5.blade-nxd1-10.5/build/unit_test/Products/ERP5Type/tests/Sequence.py", line 113, in play
self._step_list[self._played_index] \
Current Sequence:
SetTest19SequenceData
DeleteAccounting
Tic
DeleteAllPackingLists
Tic
TestAllAppliedRulesAreEmpty
CreatePackingList
DeliverPackingList
AggregateItems
Tic
BuildAccounting
Tic
TestSimpleAccountingBuild
SetTest19SequenceData2
CreatePackingList
DeliverPackingList
AggregateItems
Tic
TestSimulationBuildAfterFirstAccountingChange
BuildAccounting
Tic
TestAccountingBuildAfterFirstChange
DeletePackingList
Tic
TestSimulationBuildAfterSecondAccountingChange
BuildAccounting
Tic
TestAccountingBuildAfterSecondChange
AdoptPrevision
Tic
TestAccountingBuildAfterAdoptPrevision
Test19ModifyPackingList
Tic
TestSimulationBuildAfterPackingListModification
BuildAccounting
Tic
> TestAccountingBuildAfterPackingListModification
File "/home/buildbot/slave/full.ERP5.blade-nxd1-10.5/build/unit_test/Products/ERP5Type/tests/Sequence.py", line 96, in play
method(sequence=sequence)
File "/home/buildbot/slave/full.ERP5.blade-nxd1-10.5/build/unit_test/Products/ERP5/tests/testImmobilisation.py", line 2704, in stepTestAccountingBuildAfterPackingListModification
self._testAccountingBuild(c_transaction_list, e_transaction_list)
File "/home/buildbot/slave/full.ERP5.blade-nxd1-10.5/build/unit_test/Products/ERP5/tests/testImmobilisation.py", line 2983, in _testAccountingBuild
self.failUnless(e_found_transaction is not None)
AssertionError
Loading Zope ...
Cleaning static files ...
Instance at '/home/buildbot/slave/full.ERP5.blade-nxd1-10.3/build/unit_test' loaded ...
Traceback (most recent call last):
File "Products/ERP5Type/tests/runUnitTest.py", line 580, in ?
main()
File "Products/ERP5Type/tests/runUnitTest.py", line 563, in main
debug=debug)
File "Products/ERP5Type/tests/runUnitTest.py", line 430, in runUnitTestList
suite = test_loader.loadTestsFromNames(test_list)
File "/usr/lib64/python2.4/unittest.py", line 556, in loadTestsFromNames
suites = [self.loadTestsFromName(name, module) for name in names]
File "Products/ERP5Type/tests/runUnitTest.py", line 228, in loadTestsFromName
return unittest.TestLoader.loadTestsFromName(self, name, module)
File "/usr/lib64/python2.4/unittest.py", line 524, in loadTestsFromName
module = __import__('.'.join(parts_copy))
File "/home/buildbot/slave/full.ERP5.blade-nxd1-10.3/build/unit_test/Products/ERP5/tests/testInventoryAPI.py", line 44, in ?
from Products.ERP5.Document.OrderRule import OrderRule
ImportError: No module named OrderRule
ERROR: test_12_SplitPackingListAndAcceptInvoice (testInvoice.TestSaleInvoice)
----------------------------------------------------------------------
Traceback (most recent call last):
File "/home/buildbot/slave/full.ERP5.blade-nxd1-10.4/build/products/ERP5Type/tests/backportUnittest.py", line 145, in run
testMethod()
File "/home/buildbot/slave/full.ERP5.blade-nxd1-10.4/build/unit_test/Products/ERP5/tests/testInvoice.py", line 3350, in test_12_SplitPackingListAndAcceptInvoice
self.playSequence(sequence, quiet=quiet)
File "/home/buildbot/slave/full.ERP5.blade-nxd1-10.4/build/unit_test/Products/ERP5/tests/testAccountingRules.py", line 115, in playSequence
sequence_list.play(self, quiet=quiet)
File "/home/buildbot/slave/full.ERP5.blade-nxd1-10.4/build/unit_test/Products/ERP5Type/tests/Sequence.py", line 192, in play
sequence.play(context, sequence_number=i, quiet=quiet)
File "/home/buildbot/slave/full.ERP5.blade-nxd1-10.4/build/unit_test/Products/ERP5Type/tests/Sequence.py", line 113, in play
self._step_list[self._played_index] \
Current Sequence:
CreateEntities
CreateCurrency
CreateSaleInvoiceTransactionRule
CreateOrder
SetOrderProfile
SetOrderPriceCurrency
CreateNotVariatedResource
Tic
CreateOrderLine
SetOrderLineResource
SetOrderLineDefaultValues
OrderOrder
Tic
CheckDeliveryBuilding
ConfirmOrder
Tic
CheckOrderRule
CheckOrderSimulation
CheckDeliveryBuilding
AddPackingListContainer
AddPackingListContainerLine
SetContainerLineFullQuantity
Tic
CheckPackingListIsPacked
CheckInvoicingRule
DecreasePackingListLineQuantity
SetContainerFullQuantity
CheckPackingListIsCalculating
Tic
CheckPackingListIsDiverged
SplitAndDeferPackingList
Tic
CheckPackingListIsSolved
CheckPackingListSplitted
SetReadyPackingList
Tic
StartPackingList
CheckInvoicingRule
CheckInvoiceTransactionRule
Tic
CheckInvoiceBuilding
StopPackingList
Tic
DeliverPackingList
Tic
CheckPackingListIsSolved
CheckPackingListSplitted
IncreaseInvoiceLineQuantity
CheckInvoiceIsCalculating
Tic
CheckInvoiceIsDiverged
AcceptDecisionQuantityInvoice
Tic
StartInvoice
Tic
CheckPaymentBuilding
StopInvoice
Tic
DeliverInvoice
Tic
CheckInvoiceIsSolved
CheckInvoiceNotSplitted
CheckPackingListIsNotDivergent
CheckPackingListIsSolved
CheckInvoiceTransactionRule
RebuildAndCheckNothingIsCreated
CheckInvoicesConsistency
SwitchPackingLists
AddPackingListContainer
SetContainerFullQuantity
Tic
CheckPackingListIsSolved
SetReadyPackingList
Tic
StartPackingList
CheckInvoicingRule
CheckInvoiceTransactionRule
Tic
CheckInvoiceBuilding
StopPackingList
Tic
DeliverPackingList
Tic
CheckPackingListIsSolved
SetInvoiceLineQuantityToZero
CheckInvoiceIsCalculating
Tic
CheckInvoiceIsDiverged
AcceptDecisionQuantityInvoice
Tic
StartInvoice
Tic
> CheckPaymentBuilding
StopInvoice
Tic
DeliverInvoice
Tic
CheckInvoiceIsSolved
CheckInvoiceNotSplitted
CheckPackingListIsNotDivergent
CheckPackingListIsSolved
CheckInvoiceTransactionRule
RebuildAndCheckNothingIsCreated
CheckInvoicesConsistency
File "/home/buildbot/slave/full.ERP5.blade-nxd1-10.4/build/unit_test/Products/ERP5Type/tests/Sequence.py", line 96, in play
method(sequence=sequence)
File "/home/buildbot/slave/full.ERP5.blade-nxd1-10.4/build/unit_test/Products/ERP5/tests/testInvoice.py", line 713, in stepCheckPaymentBuilding
self.assertEquals(related_simulation_movement.getQuantity() /\
ZeroDivisionError: float division
FAIL: test_delivery_mode_and_incoterm_on_invoice (testInvoice.TestSaleInvoice)
----------------------------------------------------------------------
Traceback (most recent call last):
File "/home/buildbot/slave/full.ERP5.blade-nxd1-10.4/build/products/ERP5Type/tests/backportUnittest.py", line 145, in run
testMethod()
File "/home/buildbot/slave/full.ERP5.blade-nxd1-10.4/build/unit_test/Products/ERP5/tests/testInvoice.py", line 2389, in test_delivery_mode_and_incoterm_on_invoice
order.getDeliveryMode())
AssertionError: None != 'by_mail'
FAIL: test_delivery_mode_and_incoterm_on_invoice (testInvoice.TestPurchaseInvoice)
----------------------------------------------------------------------
Traceback (most recent call last):
File "/home/buildbot/slave/full.ERP5.blade-nxd1-10.4/build/products/ERP5Type/tests/backportUnittest.py", line 145, in run
testMethod()
File "/home/buildbot/slave/full.ERP5.blade-nxd1-10.4/build/unit_test/Products/ERP5/tests/testInvoice.py", line 2389, in test_delivery_mode_and_incoterm_on_invoice
order.getDeliveryMode())
AssertionError: None != 'by_mail'
ERROR: test_01_ItemSimpleTest (testItem.TestItem)
----------------------------------------------------------------------
Traceback (most recent call last):
File "/home/buildbot/slave/full.ERP5.blade-nxd1-10.4/build/products/ERP5Type/tests/backportUnittest.py", line 145, in run
testMethod()
File "/home/buildbot/slave/full.ERP5.blade-nxd1-10.4/build/unit_test/Products/ERP5/tests/testItem.py", line 221, in test_01_ItemSimpleTest
sequence_list.play(self, quiet=quiet)
File "/home/buildbot/slave/full.ERP5.blade-nxd1-10.4/build/unit_test/Products/ERP5Type/tests/Sequence.py", line 192, in play
sequence.play(context, sequence_number=i, quiet=quiet)
File "/home/buildbot/slave/full.ERP5.blade-nxd1-10.4/build/unit_test/Products/ERP5Type/tests/Sequence.py", line 113, in play
self._step_list[self._played_index] \
Current Sequence:
CreateOrganisation1
CreateOrganisation2
CreateOrganisation3
CreateItemList
CreateOrder
SetOrderProfile
CreateNotVariatedResource
Tic
CreateOrderLine
SetOrderLineResource
SetOrderLineDefaultValues
OrderLineSetAggregationList
ConfirmOrder
Tic
CheckOrderLineAggregate
CheckOrderSimulation
> CheckSimulationAggregate
CheckDeliveryBuilding
CheckPackingListLineAggregate
CheckPackingListIsNotDivergent
File "/home/buildbot/slave/full.ERP5.blade-nxd1-10.4/build/unit_test/Products/ERP5Type/tests/Sequence.py", line 96, in play
method(sequence=sequence)
File "/home/buildbot/slave/full.ERP5.blade-nxd1-10.4/build/unit_test/Products/ERP5/tests/testItem.py", line 165, in stepCheckSimulationAggregate
self.checkAggregate(line=simulation_movement, sequence=sequence)
File "/home/buildbot/slave/full.ERP5.blade-nxd1-10.4/build/unit_test/Products/ERP5/tests/testItem.py", line 184, in checkAggregate
self.assertEquals(len(line.getAggregateList()),1)
AttributeError: 'NoneType' object has no attribute 'getAggregateList'
ERROR: test_02_ItemWithInvoice (testItem.TestItem)
----------------------------------------------------------------------
Traceback (most recent call last):
File "/home/buildbot/slave/full.ERP5.blade-nxd1-10.4/build/products/ERP5Type/tests/backportUnittest.py", line 145, in run
testMethod()
File "/home/buildbot/slave/full.ERP5.blade-nxd1-10.4/build/unit_test/Products/ERP5/tests/testItem.py", line 265, in test_02_ItemWithInvoice
sequence_list.play(self, quiet=quiet)
File "/home/buildbot/slave/full.ERP5.blade-nxd1-10.4/build/unit_test/Products/ERP5Type/tests/Sequence.py", line 192, in play
sequence.play(context, sequence_number=i, quiet=quiet)
File "/home/buildbot/slave/full.ERP5.blade-nxd1-10.4/build/unit_test/Products/ERP5Type/tests/Sequence.py", line 113, in play
self._step_list[self._played_index] \
Current Sequence:
CreateEntities
CreateCurrency
CreateItemList
CreateSaleInvoiceTransactionRule
CreateOrder
SetOrderProfile
SetOrderPriceCurrency
CreateNotVariatedResource
Tic
CreateOrderLine
SetOrderLineResource
SetOrderLineDefaultValues
OrderLineSetAggregationList
ConfirmOrder
Tic
CheckOrderRule
CheckOrderLineAggregate
CheckOrderSimulation
> CheckSimulationAggregate
CheckDeliveryBuilding
CheckPackingListLineAggregate
AddPackingListContainer
AddPackingListContainerLine
SetContainerLineFullQuantity
Tic
CheckPackingListIsPacked
SetReadyPackingList
Tic
StartPackingList
CheckInvoicingRule
Tic
CheckInvoiceBuilding
RebuildAndCheckNothingIsCreated
CheckInvoicesConsistency
CheckInvoiceLineAggregate
File "/home/buildbot/slave/full.ERP5.blade-nxd1-10.4/build/unit_test/Products/ERP5Type/tests/Sequence.py", line 96, in play
method(sequence=sequence)
File "/home/buildbot/slave/full.ERP5.blade-nxd1-10.4/build/unit_test/Products/ERP5/tests/testItem.py", line 165, in stepCheckSimulationAggregate
self.checkAggregate(line=simulation_movement, sequence=sequence)
File "/home/buildbot/slave/full.ERP5.blade-nxd1-10.4/build/unit_test/Products/ERP5/tests/testItem.py", line 184, in checkAggregate
self.assertEquals(len(line.getAggregateList()),1)
AttributeError: 'NoneType' object has no attribute 'getAggregateList'
ERROR: test_Order_viewAsODT_big_image (testLegacyOrder.TestOrder)
----------------------------------------------------------------------
Traceback (most recent call last):
File "/home/buildbot/slave/full.ERP5.blade-nxd1-10.3/build/products/ERP5Type/tests/backportUnittest.py", line 145, in run
testMethod()
File "/home/buildbot/slave/full.ERP5.blade-nxd1-10.3/build/unit_test/Products/ERP5Legacy/tests/testLegacyOrder.py", line 2691, in test_Order_viewAsODT_big_image
'test_data', 'images', 'erp5_logo.bmp'), 'rb')
File "/home/buildbot/slave/full.ERP5.blade-nxd1-10.3/build/unit_test/Products/ERP5Type/tests/utils.py", line 48, in __init__
file.__init__(self, path)
IOError: [Errno 2] No such file or directory: '/home/buildbot/slave/full.ERP5.blade-nxd1-10.3/build/unit_test/Products/ERP5Legacy/tests/test_data/images/erp5_logo.bmp'
ERROR: test_Order_viewAsODT_image (testLegacyOrder.TestOrder)
----------------------------------------------------------------------
Traceback (most recent call last):
File "/home/buildbot/slave/full.ERP5.blade-nxd1-10.3/build/products/ERP5Type/tests/backportUnittest.py", line 145, in run
testMethod()
File "/home/buildbot/slave/full.ERP5.blade-nxd1-10.3/build/unit_test/Products/ERP5Legacy/tests/testLegacyOrder.py", line 2655, in test_Order_viewAsODT_image
'test_data', 'images', 'erp5_logo.png'), 'rb')
File "/home/buildbot/slave/full.ERP5.blade-nxd1-10.3/build/unit_test/Products/ERP5Type/tests/utils.py", line 48, in __init__
file.__init__(self, path)
IOError: [Errno 2] No such file or directory: '/home/buildbot/slave/full.ERP5.blade-nxd1-10.3/build/unit_test/Products/ERP5Legacy/tests/test_data/images/erp5_logo.png'
FAIL: test_order_payment_condition_not_copied (testLegacyOrder.TestOrder)
----------------------------------------------------------------------
Traceback (most recent call last):
File "/home/buildbot/slave/full.ERP5.blade-nxd1-10.3/build/products/ERP5Type/tests/backportUnittest.py", line 145, in run
testMethod()
File "/home/buildbot/slave/full.ERP5.blade-nxd1-10.3/build/unit_test/Products/ERP5Legacy/tests/testLegacyOrder.py", line 2576, in test_order_payment_condition_not_copied
self.assertEquals(0, len(related_packing_list.contentValues(
AssertionError: 0 != 1
FAIL: Make sure that _separate method works if argument is an empty list.
----------------------------------------------------------------------
Traceback (most recent call last):
File "/home/buildbot/slave/full.ERP5.blade-nxd1-10.4/build/unit_test/Products/ERP5/tests/testMovementGroup.py", line 446, in test_separateMethod
self.assertEqual(instance._separate([]), [])
AssertionError: [[[], {}]] != []
FAIL: test_safe_substitution_content (testNotificationMessageModule.TestNotificationMessageModule), Tests that 'safe' substitution is performed, unless safe_substitute is
----------------------------------------------------------------------
Traceback (most recent call last):
File "/home/buildbot/slave/full.ERP5.blade-nxd1-10.3/build/products/ERP5Type/tests/backportUnittest.py", line 145, in run
testMethod()
File "/home/buildbot/slave/full.ERP5.blade-nxd1-10.3/build/unit_test/Products/ERP5/tests/testNotificationMessageModule.py", line 186, in test_safe_substitution_content
self.assertEqual('substitution text: ${b}', text)
AssertionError: 'substitution text: ${b}' != 'substitution text: ${b}\n'
FAIL: test_substitution_content (testNotificationMessageModule.TestNotificationMessageModule), Tests that content and subject have string.Template based substitutions
----------------------------------------------------------------------
Traceback (most recent call last):
File "/home/buildbot/slave/full.ERP5.blade-nxd1-10.3/build/products/ERP5Type/tests/backportUnittest.py", line 145, in run
testMethod()
File "/home/buildbot/slave/full.ERP5.blade-nxd1-10.3/build/unit_test/Products/ERP5/tests/testNotificationMessageModule.py", line 129, in test_substitution_content
self.assertEqual('substitution text: b', text)
AssertionError: 'substitution text: b' != 'substitution text: b\n'
FAIL: test_substitution_content_and_convert (testNotificationMessageModule.TestNotificationMessageModule), Tests that substitution also works with different target format.
----------------------------------------------------------------------
Traceback (most recent call last):
File "/home/buildbot/slave/full.ERP5.blade-nxd1-10.3/build/products/ERP5Type/tests/backportUnittest.py", line 145, in run
testMethod()
File "/home/buildbot/slave/full.ERP5.blade-nxd1-10.3/build/unit_test/Products/ERP5/tests/testNotificationMessageModule.py", line 168, in test_substitution_content_and_convert
self.assertEqual('substitution text: b', text)
AssertionError: 'substitution text: b' != 'substitution text: b\n'
FAIL: test_substitution_content_parameters (testNotificationMessageModule.TestNotificationMessageModule), Tests that we can pass parameters to convert to the substitution method,
----------------------------------------------------------------------
Traceback (most recent call last):
File "/home/buildbot/slave/full.ERP5.blade-nxd1-10.3/build/products/ERP5Type/tests/backportUnittest.py", line 145, in run
testMethod()
File "/home/buildbot/slave/full.ERP5.blade-nxd1-10.3/build/unit_test/Products/ERP5/tests/testNotificationMessageModule.py", line 150, in test_substitution_content_parameters
self.assertEqual('substitution text: b', text)
AssertionError: 'substitution text: b' != 'substitution text: b\n'
FAIL: testOpenOrderRule (testOpenOrder.TestOpenOrder)
----------------------------------------------------------------------
Traceback (most recent call last):
File "/home/buildbot/slave/full.ERP5.blade-nxd1-10.2/build/products/ERP5Type/tests/backportUnittest.py", line 145, in run
testMethod()
File "/home/buildbot/slave/full.ERP5.blade-nxd1-10.2/build/unit_test/Products/ERP5/tests/testOpenOrder.py", line 303, in testOpenOrderRule
[(DateTime(3000,2,10,10,0), DateTime(3000,2,11,10,0)),
AssertionError: [(DateTime('3000/02/10 10:00:00 US/Eastern'), DateTime('3000/02/11 10:00:00 US/Eastern')), (DateTime('3000/02/17 10:00:00 US/Eastern'), DateTime('3000/02/18 10:00:00 US/Eastern')), (DateTime('3000/02/24 10:00:00 US/Eastern'), DateTime('3000/02/25 10:00:00 US/Eastern')), (DateTime('3000/03/03 10:00:00 US/Eastern'), DateTime('3000/03/04 10:00:00 US/Eastern')), (DateTime('3000/03/10 10:00:00 US/Eastern'), DateTime('3000/03/11 10:00:00 US/Eastern'))] != [(DateTime('3000/02/10 10:00:00 US/Eastern'), DateTime('3000/02/11 10:00:00 US/Eastern')), (DateTime('3000/02/17 10:00:00 US/Eastern'), DateTime('3000/02/18 10:00:00 US/Eastern')), (DateTime('3000/02/24 10:00:00 US/Eastern'), DateTime('3000/02/25 10:00:00 US/Eastern')), (DateTime('3000/03/03 10:00:00 US/Eastern'), DateTime('3000/03/04 10:00:00 US/Eastern')), (DateTime('3000/03/10 10:00:00 GMT-4'), DateTime('3000/03/11 10:00:00 GMT-4'))]
FAIL: testPeriodicityDateList (testOpenOrder.TestOpenOrder)
----------------------------------------------------------------------
Traceback (most recent call last):
File "/home/buildbot/slave/full.ERP5.blade-nxd1-10.2/build/products/ERP5Type/tests/backportUnittest.py", line 145, in run
testMethod()
File "/home/buildbot/slave/full.ERP5.blade-nxd1-10.2/build/unit_test/Products/ERP5/tests/testOpenOrder.py", line 185, in testPeriodicityDateList
[(D(2008,2,1,0,1), DateTime(2008,2,29)),
AssertionError: [(DateTime('2008/02/01 00:01:00 US/Eastern'), DateTime('2008/02/29')), (DateTime('2008/03/01 00:01:00 US/Eastern'), DateTime('2008/03/31')), (DateTime('2008/04/01 00:01:00 US/Eastern'), DateTime('2008/04/30')), (DateTime('2008/05/01 00:01:00 US/Eastern'), DateTime('2008/05/31')), (DateTime('2008/06/01 00:01:00 US/Eastern'), DateTime('2008/06/30')), (DateTime('2008/07/01 00:01:00 US/Eastern'), DateTime('2008/07/31')), (DateTime('2008/08/01 00:01:00 US/Eastern'), DateTime('2008/08/31')), (DateTime('2008/09/01 00:01:00 US/Eastern'), DateTime('2008/09/30')), (DateTime('2008/10/01 00:01:00 US/Eastern'), DateTime('2008/10/31')), (DateTime('2008/11/01 00:01:00 US/Eastern'), DateTime('2008/11/30'))] != [(DateTime('2008/02/01 00:01:00 US/Eastern'), DateTime('2008/02/29')), (DateTime('2008/03/01 00:01:00 US/Eastern'), DateTime('2008/03/31')), (DateTime('2008/04/01 00:01:00 GMT-4'), DateTime('2008/04/30')), (DateTime('2008/05/01 00:01:00 GMT-4'), DateTime('2008/05/31')), (DateTime('2008/06/01 00:01:00 GMT-4'), DateTime('2008/06/30')), (DateTime('2008/07/01 00:01:00 GMT-4'), DateTime('2008/07/31')), (DateTime('2008/08/01 00:01:00 GMT-4'), DateTime('2008/08/31')), (DateTime('2008/09/01 00:01:00 GMT-4'), DateTime('2008/09/30')), (DateTime('2008/10/01 00:01:00 GMT-4'), DateTime('2008/10/31')), (DateTime('2008/11/01 00:01:00 GMT-4'), DateTime('2008/11/30'))]
FAIL: test_order_payment_condition_not_copied (testOrder.TestOrder)
----------------------------------------------------------------------
Traceback (most recent call last):
File "/home/buildbot/slave/full.ERP5.blade-nxd1-10.6/build/products/ERP5Type/tests/backportUnittest.py", line 145, in run
testMethod()
File "/home/buildbot/slave/full.ERP5.blade-nxd1-10.6/build/unit_test/Products/ERP5/tests/testOrder.py", line 2578, in test_order_payment_condition_not_copied
self.assertEquals(0, len(related_packing_list.contentValues(
AssertionError: 0 != 1
FAIL: test_AccountingLineGeneration (testPayroll.TestPayroll)
----------------------------------------------------------------------
Traceback (most recent call last):
File "/home/buildbot/slave/full.ERP5.blade-nxd1-10.2/build/products/ERP5Type/tests/backportUnittest.py", line 145, in run
testMethod()
File "/home/buildbot/slave/full.ERP5.blade-nxd1-10.2/build/unit_test/Products/ERP5/tests/testPayroll.py", line 3187, in test_AccountingLineGeneration
self.assertEquals(len(accounting_line_list), 4)
AssertionError: 0 != 4
FAIL: test_02_testSourcingSimulationExpand (testProductionOrder.TestProductionOrder)
----------------------------------------------------------------------
Traceback (most recent call last):
File "/home/buildbot/slave/full.ERP5.blade-nxd1-10.4/build/products/ERP5Type/tests/backportUnittest.py", line 145, in run
testMethod()
File "/home/buildbot/slave/full.ERP5.blade-nxd1-10.4/build/unit_test/Products/ERP5/tests/testProductionOrder.py", line 1384, in test_02_testSourcingSimulationExpand
sequence_list.play(self)
File "/home/buildbot/slave/full.ERP5.blade-nxd1-10.4/build/unit_test/Products/ERP5Type/tests/Sequence.py", line 192, in play
sequence.play(context, sequence_number=i, quiet=quiet)
File "/home/buildbot/slave/full.ERP5.blade-nxd1-10.4/build/unit_test/Products/ERP5Type/tests/Sequence.py", line 113, in play
self._step_list[self._played_index] \
Current Sequence:
ClearActivities
CreateProductionOrganisation1
CreateSupplyOrganisation1
CreateSourcingSC
CreateNotVariatedResource
CreateComponent1
CreateTransformation
CreateOrganisation
CreateOrder
CreateOrderLine
Tic
OrderOrder
Tic
> CheckSourcingSimulation
File "/home/buildbot/slave/full.ERP5.blade-nxd1-10.4/build/unit_test/Products/ERP5Type/tests/Sequence.py", line 96, in play
method(sequence=sequence)
File "/home/buildbot/slave/full.ERP5.blade-nxd1-10.4/build/unit_test/Products/ERP5/tests/testProductionOrder.py", line 862, in stepCheckSourcingSimulation
self.assertEquals(1, len(related_simulation_movement_list))
AssertionError: 1 != 0
FAIL: test_05_testSourcingSimulationBuild (testProductionOrder.TestProductionOrder)
----------------------------------------------------------------------
Traceback (most recent call last):
File "/home/buildbot/slave/full.ERP5.blade-nxd1-10.4/build/products/ERP5Type/tests/backportUnittest.py", line 145, in run
testMethod()
File "/home/buildbot/slave/full.ERP5.blade-nxd1-10.4/build/unit_test/Products/ERP5/tests/testProductionOrder.py", line 1451, in test_05_testSourcingSimulationBuild
sequence_list.play(self)
File "/home/buildbot/slave/full.ERP5.blade-nxd1-10.4/build/unit_test/Products/ERP5Type/tests/Sequence.py", line 192, in play
sequence.play(context, sequence_number=i, quiet=quiet)
File "/home/buildbot/slave/full.ERP5.blade-nxd1-10.4/build/unit_test/Products/ERP5Type/tests/Sequence.py", line 113, in play
self._step_list[self._played_index] \
Current Sequence:
ClearActivities
CreateProductionOrganisation1
CreateSupplyOrganisation1
CreateSourcingSC
CreateNotVariatedResource
CreateComponent1
CreateTransformation
CreateOrganisation
CreateOrder
CreateOrderLine
Tic
OrderOrder
Tic
> CheckSourcingSimulation
ConfirmOrder
Tic
CheckSourcingSimulation
File "/home/buildbot/slave/full.ERP5.blade-nxd1-10.4/build/unit_test/Products/ERP5Type/tests/Sequence.py", line 96, in play
method(sequence=sequence)
File "/home/buildbot/slave/full.ERP5.blade-nxd1-10.4/build/unit_test/Products/ERP5/tests/testProductionOrder.py", line 862, in stepCheckSourcingSimulation
self.assertEquals(1, len(related_simulation_movement_list))
AssertionError: 1 != 0
FAIL: test_03_testIndustrialPhase (testProductionOrderApparel.TestProductionOrderApparel)
----------------------------------------------------------------------
Traceback (most recent call last):
File "/home/buildbot/slave/full.ERP5.blade-nxd1-10.6/build/products/ERP5Type/tests/backportUnittest.py", line 145, in run
testMethod()
File "/home/buildbot/slave/full.ERP5.blade-nxd1-10.6/build/unit_test/Products/ERP5/tests/testProductionOrderApparel.py", line 1024, in test_03_testIndustrialPhase
sequence_list.play(self)
File "/home/buildbot/slave/full.ERP5.blade-nxd1-10.6/build/unit_test/Products/ERP5Type/tests/Sequence.py", line 192, in play
sequence.play(context, sequence_number=i, quiet=quiet)
File "/home/buildbot/slave/full.ERP5.blade-nxd1-10.6/build/unit_test/Products/ERP5Type/tests/Sequence.py", line 113, in play
self._step_list[self._played_index] \
Current Sequence:
ClearActivities
CreateProductionOrganisation1
CreateProductionOrganisation2
CreateSupplyOrganisation1
CreateSupplyOrganisation2
CreateTwoPhasesSC
CreateVariatedResource
CreateComponent1
CreateComponent2
CreateTransformation
CreateOrganisation
CreateOrder
CreateOrderLine
Tic
OrderOrder
Tic
> CheckTwoPhasesSimulation
File "/home/buildbot/slave/full.ERP5.blade-nxd1-10.6/build/unit_test/Products/ERP5Type/tests/Sequence.py", line 96, in play
method(sequence=sequence)
File "/home/buildbot/slave/full.ERP5.blade-nxd1-10.6/build/unit_test/Products/ERP5/tests/testProductionOrderApparel.py", line 675, in stepCheckTwoPhasesSimulation
self.assertEquals(1, len(related_simulation_movement_list))
AssertionError: 1 != 0
FAIL: test_01_sourcingDelivery (testProductionPackingList.TestProductionDelivery)
----------------------------------------------------------------------
Traceback (most recent call last):
File "/home/buildbot/slave/full.ERP5.blade-nxd1-10.6/build/products/ERP5Type/tests/backportUnittest.py", line 145, in run
testMethod()
File "/home/buildbot/slave/full.ERP5.blade-nxd1-10.6/build/unit_test/Products/ERP5/tests/testProductionPackingList.py", line 776, in test_01_sourcingDelivery
sequence_list.play(self)
File "/home/buildbot/slave/full.ERP5.blade-nxd1-10.6/build/unit_test/Products/ERP5Type/tests/Sequence.py", line 192, in play
sequence.play(context, sequence_number=i, quiet=quiet)
File "/home/buildbot/slave/full.ERP5.blade-nxd1-10.6/build/unit_test/Products/ERP5Type/tests/Sequence.py", line 113, in play
self._step_list[self._played_index] \
Current Sequence:
ClearActivities
CreateProductionOrganisation1
CreateSupplyOrganisation1
CreateSourcingSC
CreateNotVariatedResource
CreateComponent1
CreateTransformation
CreateOrganisation
CreateOrder
CreateOrderLine
Tic
OrderOrder
Tic
> CheckSourcingSimulation
ConfirmOrder
Tic
CheckSourcingSimulation
CheckSourcingDeliverySimulation
CheckProducedDeliveryPackingListIsConfirmed
CheckProducedDeliveryPackingListIsSolved
CheckSupplyDeliveryPackingListIsConfirmed
CheckSupplyDeliveryPackingListIsSolved
CheckProducedReportIsConfirmed
CheckProducedReportIsSolved
CheckConsumedReportIsConfirmed
CheckConsumedReportIsSolved
DecreaseProducedDeliveryPackingListQuantity
CheckProducedDeliveryPackingListIsCalculating
Tic
CheckProducedDeliveryPackingListIsDiverged
AcceptDecisionProducedDeliveryPackingList
Tic
CheckProducedDeliveryPackingListIsSolved
CheckSourcingDeliverySimulationDecreasedQuantity
CheckSupplyDeliveryPackingListIsConfirmed
CheckSupplyDeliveryPackingListIsDiverged
CheckProducedReportIsConfirmed
CheckProducedReportIsDiverged
CheckConsumedReportIsConfirmed
CheckConsumedReportIsDiverged
SetReadyProducedDeliveryPackingList
StartProducedDeliveryPackingList
StopProducedDeliveryPackingList
DeliverProducedDeliveryPackingList
Tic
CheckSourcingDeliverySimulationDecreasedQuantity
CheckProducedDeliveryPackingListIsDelivered
CheckProducedDeliveryPackingListIsSolved
CheckSupplyDeliveryPackingListIsConfirmed
CheckSupplyDeliveryPackingListIsDiverged
CheckProducedReportIsConfirmed
CheckProducedReportIsDiverged
CheckConsumedReportIsConfirmed
CheckConsumedReportIsDiverged
AdoptPrevisionSupplyDeliveryPackingList
Tic
CheckSupplyDeliveryPackingListIsSolved
CheckProducedReportIsConfirmed
CheckProducedReportIsDiverged
CheckConsumedReportIsConfirmed
CheckConsumedReportIsDiverged
SetReadySupplyDeliveryPackingList
StartSupplyDeliveryPackingList
StopSupplyDeliveryPackingList
DeliverSupplyDeliveryPackingList
Tic
CheckSourcingDeliverySimulationDecreasedQuantity
CheckProducedDeliveryPackingListIsDelivered
CheckProducedDeliveryPackingListIsSolved
CheckSupplyDeliveryPackingListIsDelivered
CheckSupplyDeliveryPackingListIsSolved
CheckProducedReportIsConfirmed
CheckProducedReportIsDiverged
CheckConsumedReportIsConfirmed
CheckConsumedReportIsDiverged
AdoptPrevisionProducedReport
Tic
CheckProducedReportIsSolved
CheckConsumedReportIsConfirmed
CheckConsumedReportIsDiverged
SetReadyProducedReport
StartProducedReport
StopProducedReport
DeliverProducedReport
Tic
CheckSourcingDeliverySimulationDecreasedQuantity
CheckProducedDeliveryPackingListIsDelivered
CheckProducedDeliveryPackingListIsSolved
CheckSupplyDeliveryPackingListIsDelivered
CheckSupplyDeliveryPackingListIsSolved
CheckProducedReportIsDelivered
CheckProducedReportIsSolved
CheckConsumedReportIsConfirmed
CheckConsumedReportIsDiverged
AdoptPrevisionConsumedReport
Tic
CheckProducedReportIsSolved
SetReadyConsumedReport
StartConsumedReport
StopConsumedReport
DeliverConsumedReport
Tic
CheckSourcingDeliverySimulationDecreasedQuantity
CheckProducedDeliveryPackingListIsDelivered
CheckProducedDeliveryPackingListIsSolved
CheckSupplyDeliveryPackingListIsDelivered
CheckSupplyDeliveryPackingListIsSolved
CheckProducedReportIsDelivered
CheckProducedReportIsSolved
CheckConsumedReportIsDelivered
CheckConsumedReportIsSolved
File "/home/buildbot/slave/full.ERP5.blade-nxd1-10.6/build/unit_test/Products/ERP5Type/tests/Sequence.py", line 96, in play
method(sequence=sequence)
File "/home/buildbot/slave/full.ERP5.blade-nxd1-10.6/build/unit_test/Products/ERP5/tests/testProductionOrder.py", line 862, in stepCheckSourcingSimulation
self.assertEquals(1, len(related_simulation_movement_list))
AssertionError: 1 != 0
FAIL: test_01_sourcingDelivery (testProductionPackingListApparel.TestProductionDeliveryApparel)
----------------------------------------------------------------------
Traceback (most recent call last):
File "/home/buildbot/slave/full.ERP5.blade-nxd1-10.5/build/products/ERP5Type/tests/backportUnittest.py", line 145, in run
testMethod()
File "/home/buildbot/slave/full.ERP5.blade-nxd1-10.5/build/unit_test/Products/ERP5/tests/testProductionPackingList.py", line 776, in test_01_sourcingDelivery
sequence_list.play(self)
File "/home/buildbot/slave/full.ERP5.blade-nxd1-10.5/build/unit_test/Products/ERP5Type/tests/Sequence.py", line 192, in play
sequence.play(context, sequence_number=i, quiet=quiet)
File "/home/buildbot/slave/full.ERP5.blade-nxd1-10.5/build/unit_test/Products/ERP5Type/tests/Sequence.py", line 113, in play
self._step_list[self._played_index] \
Current Sequence:
ClearActivities
CreateProductionOrganisation1
CreateSupplyOrganisation1
CreateSourcingSC
CreateVariatedResource
CreateComponent1
CreateTransformation
CreateOrganisation
CreateOrder
CreateOrderLine
Tic
OrderOrder
Tic
> CheckSourcingSimulation
ConfirmOrder
Tic
CheckSourcingSimulation
CheckSourcingDeliverySimulation
CheckProducedDeliveryPackingListIsConfirmed
CheckProducedDeliveryPackingListIsSolved
CheckSupplyDeliveryPackingListIsConfirmed
CheckSupplyDeliveryPackingListIsSolved
CheckProducedReportIsConfirmed
CheckProducedReportIsSolved
CheckConsumedReportIsConfirmed
CheckConsumedReportIsSolved
File "/home/buildbot/slave/full.ERP5.blade-nxd1-10.5/build/unit_test/Products/ERP5Type/tests/Sequence.py", line 96, in play
method(sequence=sequence)
File "/home/buildbot/slave/full.ERP5.blade-nxd1-10.5/build/unit_test/Products/ERP5/tests/testProductionOrderApparel.py", line 477, in stepCheckSourcingSimulation
self.assertEquals(1, len(related_simulation_movement_list))
AssertionError: 1 != 0
FAIL: testSkinSelectionTemplateField (testProxyField.TestProxyField)
----------------------------------------------------------------------
Traceback (most recent call last):
File "/home/buildbot/slave/full.ERP5.blade-nxd1-10.5/build/products/ERP5Type/tests/backportUnittest.py", line 145, in run
testMethod()
File "/home/buildbot/slave/full.ERP5.blade-nxd1-10.5/build/unit_test/Products/ERP5Form/tests/testProxyField.py", line 189, in testSkinSelectionTemplateField
self.assertEquals('Customized Title', field.get_value('title'))
AssertionError: 'Customized Title' != 'Generic Title'
FAIL: test_order_payment_condition_not_copied (testPurchaseOrder.TestPurchaseOrder)
----------------------------------------------------------------------
Traceback (most recent call last):
File "/home/buildbot/slave/full.ERP5.blade-nxd1-10.6/build/products/ERP5Type/tests/backportUnittest.py", line 145, in run
testMethod()
File "/home/buildbot/slave/full.ERP5.blade-nxd1-10.6/build/unit_test/Products/ERP5/tests/testOrder.py", line 2578, in test_order_payment_condition_not_copied
self.assertEquals(0, len(related_packing_list.contentValues(
AssertionError: 0 != 1
ERROR: test_sourceDestinationReferenceOnSupplyLineOnDefaultSupplyLine (testResource.TestResource), Check that it's possible to set and get a source/destination_reference
----------------------------------------------------------------------
Traceback (most recent call last):
File "/home/buildbot/slave/full.ERP5.blade-nxd1-10.6/build/products/ERP5Type/tests/backportUnittest.py", line 145, in run
testMethod()
File "/home/buildbot/slave/full.ERP5.blade-nxd1-10.6/build/unit_test/Products/ERP5/tests/testResource.py", line 1115, in test_sourceDestinationReferenceOnSupplyLineOnDefaultSupplyLine
self.assertEquals(resource.getPurchaseSupplyLineDestinationReference(),
AttributeError: getPurchaseSupplyLineDestinationReference
FAIL: test checking if the field values are of the proper type.
----------------------------------------------------------------------
Traceback (most recent call last):
File "/home/buildbot/slave/full.ERP5.blade-nxd1-10.5/build/unit_test/Products/Formulator/tests/testSerializeForm.py", line 358, in test_fieldValueTypes
self.assertEquals(field.values, field2.values)
AssertionError: {'alternate_name': '', 'title': 'Test Title', 'date_separator': '', 'editable': 0, 'input_order': 'mdy', 'start_datetime': None, 'description': '', 'default_now': 0, 'allow_empty_time': 0, 'ampm_time_style': 0, 'hide_day': 0, 'date_only': 0, 'time_separator': '$', 'hidden': 0, 'default': None, 'css_class': 'test_css', 'required': 1, 'enabled': 1, 'input_style': 'list', 'external_validator': '', 'hidden_day_is_last_day': 0, 'end_datetime': None, 'timezone_style': 0} != {'alternate_name': '', 'title': 'Test Title', 'date_separator': '', 'editable': 0, 'input_order': 'mdy', 'start_datetime': '', 'description': '', 'default_now': 0, 'allow_empty_time': 0, 'ampm_time_style': 0, 'hide_day': 0, 'date_only': 0, 'time_separator': '$', 'hidden': 0, 'default': '', 'css_class': 'test_css', 'required': 1, 'enabled': 1, 'input_style': 'list', 'external_validator': '', 'hidden_day_is_last_day': 0, 'end_datetime': '', 'timezone_style': 0}
FAIL: test_tax_line_build_accounting (testTaxLineTradeCondition.TestTaxLineOrderSimulationSaleOrder)
----------------------------------------------------------------------
Traceback (most recent call last):
File "/home/buildbot/slave/full.ERP5.blade-nxd1-10.1/build/products/ERP5Type/tests/backportUnittest.py", line 145, in run
testMethod()
File "/home/buildbot/slave/full.ERP5.blade-nxd1-10.1/build/unit_test/Products/ERP5/tests/testTaxLineTradeCondition.py", line 947, in test_tax_line_build_accounting
self.assertEquals(3, len(accounting_line_list))
AssertionError: 3 != 0
FAIL: test_tax_line_simulation (testTaxLineTradeCondition.TestTaxLineOrderSimulationSaleOrder)
----------------------------------------------------------------------
Traceback (most recent call last):
File "/home/buildbot/slave/full.ERP5.blade-nxd1-10.1/build/products/ERP5Type/tests/backportUnittest.py", line 145, in run
testMethod()
File "/home/buildbot/slave/full.ERP5.blade-nxd1-10.1/build/unit_test/Products/ERP5/tests/testTaxLineTradeCondition.py", line 699, in test_tax_line_simulation
self.assertEquals(1, len(invoice_rule_list))
AssertionError: 1 != 0
FAIL: test_tax_line_build_accounting (testTaxLineTradeCondition.TestTaxLineOrderSimulationPurchaseOrder)
----------------------------------------------------------------------
Traceback (most recent call last):
File "/home/buildbot/slave/full.ERP5.blade-nxd1-10.1/build/products/ERP5Type/tests/backportUnittest.py", line 145, in run
testMethod()
File "/home/buildbot/slave/full.ERP5.blade-nxd1-10.1/build/unit_test/Products/ERP5/tests/testTaxLineTradeCondition.py", line 947, in test_tax_line_build_accounting
self.assertEquals(3, len(accounting_line_list))
AssertionError: 3 != 0
FAIL: test_tax_line_simulation (testTaxLineTradeCondition.TestTaxLineOrderSimulationPurchaseOrder)
----------------------------------------------------------------------
Traceback (most recent call last):
File "/home/buildbot/slave/full.ERP5.blade-nxd1-10.1/build/products/ERP5Type/tests/backportUnittest.py", line 145, in run
testMethod()
File "/home/buildbot/slave/full.ERP5.blade-nxd1-10.1/build/unit_test/Products/ERP5/tests/testTaxLineTradeCondition.py", line 699, in test_tax_line_simulation
self.assertEquals(1, len(invoice_rule_list))
AssertionError: 1 != 0
FAIL: test_tax_line_simulation (testTaxLineTradeCondition.TestTaxLineInvoiceSimulationPurchaseInvoice)
----------------------------------------------------------------------
Traceback (most recent call last):
File "/home/buildbot/slave/full.ERP5.blade-nxd1-10.1/build/products/ERP5Type/tests/backportUnittest.py", line 145, in run
testMethod()
File "/home/buildbot/slave/full.ERP5.blade-nxd1-10.1/build/unit_test/Products/ERP5/tests/testTaxLineTradeCondition.py", line 1202, in test_tax_line_simulation
self.assertEquals(3, len(accounting_line_list))
AssertionError: 3 != 0
FAIL: test_tax_line_simulation (testTaxLineTradeCondition.TestTaxLineInvoiceSimulationSaleInvoice)
----------------------------------------------------------------------
Traceback (most recent call last):
File "/home/buildbot/slave/full.ERP5.blade-nxd1-10.1/build/products/ERP5Type/tests/backportUnittest.py", line 145, in run
testMethod()
File "/home/buildbot/slave/full.ERP5.blade-nxd1-10.1/build/unit_test/Products/ERP5/tests/testTaxLineTradeCondition.py", line 1202, in test_tax_line_simulation
self.assertEquals(3, len(accounting_line_list))
AssertionError: 3 != 0
FAIL: test_NonDeliveryTemplateNotIndexable (testTemplate.TestTemplate)
----------------------------------------------------------------------
Traceback (most recent call last):
File "/home/buildbot/slave/full.ERP5.blade-nxd1-10.1/build/products/ERP5Type/tests/backportUnittest.py", line 145, in run
testMethod()
File "/home/buildbot/slave/full.ERP5.blade-nxd1-10.1/build/unit_test/Products/ERP5/tests/testTemplate.py", line 345, in test_NonDeliveryTemplateNotIndexable
self._testTemplateNotIndexable(document)
File "/home/buildbot/slave/full.ERP5.blade-nxd1-10.1/build/unit_test/Products/ERP5/tests/testTemplate.py", line 315, in _testTemplateNotIndexable
self.assertEquals(0, len(self.portal.portal_catalog(uid=template.getUid())))
AssertionError: 0 != 1
FAIL: test_manyTemplatesWithoutReindexation (testTemplate.TestTemplate), Check what happen when templates are created one by one without reindexation
----------------------------------------------------------------------
Traceback (most recent call last):
File "/home/buildbot/slave/full.ERP5.blade-nxd1-10.1/build/products/ERP5Type/tests/backportUnittest.py", line 145, in run
testMethod()
File "/home/buildbot/slave/full.ERP5.blade-nxd1-10.1/build/unit_test/Products/ERP5/tests/testTemplate.py", line 279, in test_manyTemplatesWithoutReindexation
self.assertEqual(len(preference_id_list) + 1, len(new_preference_id_list))
AssertionError: 1 != 2
FAIL: test_BuildTradeModelLineAndAccountingFromInvoice (testTradeModelLine.TestTradeModelLineSale)
----------------------------------------------------------------------
Traceback (most recent call last):
File "/home/buildbot/slave/full.ERP5.blade-nxd1-10.6/build/products/ERP5Type/tests/backportUnittest.py", line 145, in run
testMethod()
File "/home/buildbot/slave/full.ERP5.blade-nxd1-10.6/build/unit_test/Products/ERP5/tests/testTradeModelLine.py", line 2482, in test_BuildTradeModelLineAndAccountingFromInvoice
self.assertEquals(3, len(accounting_line_list))
AssertionError: 3 != 0
FAIL: test_BuildTradeModelLineAndAccountingFromOrder (testTradeModelLine.TestTradeModelLineSale)
----------------------------------------------------------------------
Traceback (most recent call last):
File "/home/buildbot/slave/full.ERP5.blade-nxd1-10.6/build/products/ERP5Type/tests/backportUnittest.py", line 145, in run
testMethod()
File "/home/buildbot/slave/full.ERP5.blade-nxd1-10.6/build/unit_test/Products/ERP5/tests/testTradeModelLine.py", line 2395, in test_BuildTradeModelLineAndAccountingFromOrder
self.assertEquals(3, len(accounting_line_list))
AssertionError: 3 != 0
FAIL: test_TradeModelRuleSimulationBuildInvoiceBuildInvoiceTransactionLines (testTradeModelLine.TestTradeModelLineSale), Check that having properly configured invoice transaction rule it invoice transaction lines are nicely generated and have proper amounts
----------------------------------------------------------------------
Traceback (most recent call last):
File "/home/buildbot/slave/full.ERP5.blade-nxd1-10.6/build/products/ERP5Type/tests/backportUnittest.py", line 145, in run
testMethod()
File "/home/buildbot/slave/full.ERP5.blade-nxd1-10.6/build/unit_test/Products/ERP5/tests/testTradeModelLine.py", line 2137, in test_TradeModelRuleSimulationBuildInvoiceBuildInvoiceTransactionLines
sequence_list.play(self, quiet=True)
File "/home/buildbot/slave/full.ERP5.blade-nxd1-10.6/build/unit_test/Products/ERP5Type/tests/Sequence.py", line 192, in play
sequence.play(context, sequence_number=i, quiet=quiet)
File "/home/buildbot/slave/full.ERP5.blade-nxd1-10.6/build/unit_test/Products/ERP5Type/tests/Sequence.py", line 113, in play
self._step_list[self._played_index] \
Current Sequence:
CreateServiceTax
CreateServiceDiscount
CreatePriceCurrency
CreateProductDiscounted
CreateProductTaxed
CreateProductDiscountedTaxed
CreateSource
CreateSourceSection
CreateDestination
CreateDestinationSection
Tic
CreateBusinessProcess
CreateBusinessState
ModifyBusinessStateTaxed
CreateBusinessState
ModifyBusinessStateInvoiced
CreateBusinessPath
ModifyBusinessPathTaxing
CreateBusinessPath
ModifyBusinessPathDiscounting
CreateTradeCondition
SpecialiseTradeConditionWithBusinessProcess
CreateTradeModelLine
ModifyTradeModelLineTax
CreateTradeModelLine
ModifyTradeModelLineDiscount
Tic
CreateOrder
SpecialiseOrderTradeCondition
FillOrder
Tic
CreateOrderLine
ModifyOrderLineTaxed
CreateOrderLine
ModifyOrderLineDiscounted
CreateOrderLine
ModifyOrderLineDiscountedTaxed
Tic
CheckOrderComplexTradeConditionAggregatedAmountList
CheckOrderLineTaxedAggregatedAmountList
CheckOrderLineDiscountedTaxedAggregatedAmountList
CheckOrderLineDiscountedAggregatedAmountList
Tic
PlanOrder
Tic
CheckOrderLineTaxedSimulation
CheckOrderLineDiscountedSimulation
CheckOrderLineDiscountedTaxedSimulation
ConfirmOrder
Tic
CheckOrderLineTaxedSimulation
CheckOrderLineDiscountedSimulation
CheckOrderLineDiscountedTaxedSimulation
GetPackingList
PackPackingList
Tic
CheckOrderLineTaxedSimulation
CheckOrderLineDiscountedSimulation
CheckOrderLineDiscountedTaxedSimulation
StartPackingList
StopPackingList
DeliverPackingList
Tic
CheckOrderLineTaxedSimulation
CheckOrderLineDiscountedSimulation
CheckOrderLineDiscountedTaxedSimulation
GetInvoice
CheckInvoiceCausalityStateSolved
CheckInvoiceNormalMovements
StartInvoice
Tic
CheckInvoiceCausalityStateSolved
CheckInvoiceNormalMovements
> CheckInvoiceAccountingMovements
StopInvoice
DeliverInvoice
Tic
File "/home/buildbot/slave/full.ERP5.blade-nxd1-10.6/build/unit_test/Products/ERP5Type/tests/Sequence.py", line 96, in play
method(sequence=sequence)
File "/home/buildbot/slave/full.ERP5.blade-nxd1-10.6/build/unit_test/Products/ERP5/tests/testTradeModelLine.py", line 382, in stepCheckInvoiceAccountingMovements
self.assertEqual(3, len(movement_list))
AssertionError: 3 != 0
FAIL: test_TradeModelRuleSimulationBuildInvoiceInvoiceLineModifyDivergencyAndSolving (testTradeModelLine.TestTradeModelLineSale), Check that after changing invoice line invoice is properly diverged and it is possible to solve
----------------------------------------------------------------------
Traceback (most recent call last):
File "/home/buildbot/slave/full.ERP5.blade-nxd1-10.6/build/products/ERP5Type/tests/backportUnittest.py", line 145, in run
testMethod()
File "/home/buildbot/slave/full.ERP5.blade-nxd1-10.6/build/unit_test/Products/ERP5/tests/testTradeModelLine.py", line 2104, in test_TradeModelRuleSimulationBuildInvoiceInvoiceLineModifyDivergencyAndSolving
sequence_list.play(self, quiet=True)
File "/home/buildbot/slave/full.ERP5.blade-nxd1-10.6/build/unit_test/Products/ERP5Type/tests/Sequence.py", line 192, in play
sequence.play(context, sequence_number=i, quiet=quiet)
File "/home/buildbot/slave/full.ERP5.blade-nxd1-10.6/build/unit_test/Products/ERP5Type/tests/Sequence.py", line 113, in play
self._step_list[self._played_index] \
Current Sequence:
CreateServiceTax
CreateServiceDiscount
CreatePriceCurrency
CreateProductDiscounted
CreateProductTaxed
CreateProductDiscountedTaxed
CreateSource
CreateSourceSection
CreateDestination
CreateDestinationSection
Tic
CreateBusinessProcess
CreateBusinessState
ModifyBusinessStateTaxed
CreateBusinessState
ModifyBusinessStateInvoiced
CreateBusinessPath
ModifyBusinessPathTaxing
CreateBusinessPath
ModifyBusinessPathDiscounting
CreateTradeCondition
SpecialiseTradeConditionWithBusinessProcess
CreateTradeModelLine
ModifyTradeModelLineTax
CreateTradeModelLine
ModifyTradeModelLineDiscount
Tic
CreateOrder
SpecialiseOrderTradeCondition
FillOrder
Tic
CreateOrderLine
ModifyOrderLineTaxed
CreateOrderLine
ModifyOrderLineDiscounted
CreateOrderLine
ModifyOrderLineDiscountedTaxed
Tic
CheckOrderComplexTradeConditionAggregatedAmountList
CheckOrderLineTaxedAggregatedAmountList
CheckOrderLineDiscountedTaxedAggregatedAmountList
CheckOrderLineDiscountedAggregatedAmountList
Tic
PlanOrder
Tic
CheckOrderLineTaxedSimulation
CheckOrderLineDiscountedSimulation
CheckOrderLineDiscountedTaxedSimulation
ConfirmOrder
Tic
CheckOrderLineTaxedSimulation
CheckOrderLineDiscountedSimulation
CheckOrderLineDiscountedTaxedSimulation
GetPackingList
PackPackingList
Tic
CheckOrderLineTaxedSimulation
CheckOrderLineDiscountedSimulation
CheckOrderLineDiscountedTaxedSimulation
StartPackingList
StopPackingList
DeliverPackingList
Tic
CheckOrderLineTaxedSimulation
CheckOrderLineDiscountedSimulation
CheckOrderLineDiscountedTaxedSimulation
GetInvoice
CheckInvoiceCausalityStateSolved
CheckInvoiceNormalMovements
GetInvoiceLineDiscounted
GetInvoiceLineDiscountedTaxed
GetInvoiceLineTaxed
ModifyQuantityInvoiceLineDiscounted
ModifyQuantityInvoiceLineDiscountedTaxed
ModifyQuantityInvoiceLineTaxed
Tic
CheckInvoiceCausalityStateDiverged
AcceptDecisionQuantityInvoice
Tic
> CheckInvoiceCausalityStateSolved
CheckInvoiceNormalMovements
File "/home/buildbot/slave/full.ERP5.blade-nxd1-10.6/build/unit_test/Products/ERP5Type/tests/Sequence.py", line 96, in play
method(sequence=sequence)
File "/home/buildbot/slave/full.ERP5.blade-nxd1-10.6/build/unit_test/Products/ERP5/tests/testTradeModelLine.py", line 459, in stepCheckInvoiceCausalityStateSolved
invoice.getDivergenceList())
AssertionError: [<DivergenceMessage object at 0x9f553f8
'decision_value': 1.9999999999999998
'divergence_scope': 'quantity'
'prevision_value': 5.0
'mapping': {}
'object_relative_url': 'accounting_module/5/5'
'simulation_movement': <SimulationMovement at /erp5_portal_ad634f4ece1810b728855e61e26535eb/portal_simulation/8/3/1/1/1/1/1/1>
'tested_property': 'quantity'
'decision_title': '1.9999999999999998'
'message': 'Quantity'>, <DivergenceMessage object at 0x858eef0
'decision_value': -0.60000000000000009
'divergence_scope': 'quantity'
'prevision_value': -1.5
'mapping': {}
'object_relative_url': 'accounting_module/5/5'
'simulation_movement': <SimulationMovement at /erp5_portal_ad634f4ece1810b728855e61e26535eb/portal_simulation/8/2/1/1/1/1/1/2>
'tested_property': 'quantity'
'decision_title': '-0.60000000000000009'
'message': 'Quantity'>, <DivergenceMessage object at 0x7e73f38
'decision_value': 28.5
'divergence_scope': 'quantity'
'prevision_value': 71.25
'mapping': {}
'object_relative_url': 'accounting_module/5/5'
'simulation_movement': <SimulationMovement at /erp5_portal_ad634f4ece1810b728855e61e26535eb/portal_simulation/8/1/1/1/1/1/1/2>
'tested_property': 'quantity'
'decision_title': '28.5'
'message': 'Quantity'>, <DivergenceMessage object at 0x71ad248
'decision_value': 12.0
'divergence_scope': 'quantity'
'prevision_value': 30.0
'mapping': {}
'object_relative_url': 'accounting_module/5/4'
'simulation_movement': <SimulationMovement at /erp5_portal_ad634f4ece1810b728855e61e26535eb/portal_simulation/8/2/1/1/1/1/1/1>
'tested_property': 'quantity'
'decision_title': '12.0'
'message': 'Quantity'>, <DivergenceMessage object at 0x96d7488
'decision_value': 30.0
'divergence_scope': 'quantity'
'prevision_value': 75.0
'mapping': {}
'object_relative_url': 'accounting_module/5/4'
'simulation_movement': <SimulationMovement at /erp5_portal_ad634f4ece1810b728855e61e26535eb/portal_simulation/8/1/1/1/1/1/1/1>
'tested_property': 'quantity'
'decision_title': '30.0'
'message': 'Quantity'>]
FAIL: test_TradeModelRuleSimulationBuildInvoiceNewInvoiceLineSupport (testTradeModelLine.TestTradeModelLineSale), Check how is supported addition of invoice line to invoice build from order
----------------------------------------------------------------------
Traceback (most recent call last):
File "/home/buildbot/slave/full.ERP5.blade-nxd1-10.6/build/products/ERP5Type/tests/backportUnittest.py", line 145, in run
testMethod()
File "/home/buildbot/slave/full.ERP5.blade-nxd1-10.6/build/unit_test/Products/ERP5/tests/testTradeModelLine.py", line 2066, in test_TradeModelRuleSimulationBuildInvoiceNewInvoiceLineSupport
sequence_list.play(self, quiet=True)
File "/home/buildbot/slave/full.ERP5.blade-nxd1-10.6/build/unit_test/Products/ERP5Type/tests/Sequence.py", line 192, in play
sequence.play(context, sequence_number=i, quiet=quiet)
File "/home/buildbot/slave/full.ERP5.blade-nxd1-10.6/build/unit_test/Products/ERP5Type/tests/Sequence.py", line 113, in play
self._step_list[self._played_index] \
Current Sequence:
CreateServiceTax
CreateServiceDiscount
CreatePriceCurrency
CreateProductDiscounted
CreateProductTaxed
CreateProductDiscountedTaxed
CreateSource
CreateSourceSection
CreateDestination
CreateDestinationSection
Tic
CreateBusinessProcess
CreateBusinessState
ModifyBusinessStateTaxed
CreateBusinessState
ModifyBusinessStateInvoiced
CreateBusinessPath
ModifyBusinessPathTaxing
CreateBusinessPath
ModifyBusinessPathDiscounting
CreateTradeCondition
SpecialiseTradeConditionWithBusinessProcess
CreateTradeModelLine
ModifyTradeModelLineTax
CreateTradeModelLine
ModifyTradeModelLineDiscount
Tic
CreateOrder
SpecialiseOrderTradeCondition
FillOrder
Tic
CreateOrderLine
ModifyOrderLineTaxed
CreateOrderLine
ModifyOrderLineDiscounted
CreateOrderLine
ModifyOrderLineDiscountedTaxed
Tic
CheckOrderComplexTradeConditionAggregatedAmountList
CheckOrderLineTaxedAggregatedAmountList
CheckOrderLineDiscountedTaxedAggregatedAmountList
CheckOrderLineDiscountedAggregatedAmountList
Tic
PlanOrder
Tic
CheckOrderLineTaxedSimulation
CheckOrderLineDiscountedSimulation
CheckOrderLineDiscountedTaxedSimulation
ConfirmOrder
Tic
CheckOrderLineTaxedSimulation
CheckOrderLineDiscountedSimulation
CheckOrderLineDiscountedTaxedSimulation
GetPackingList
PackPackingList
Tic
CheckOrderLineTaxedSimulation
CheckOrderLineDiscountedSimulation
CheckOrderLineDiscountedTaxedSimulation
StartPackingList
StopPackingList
DeliverPackingList
Tic
CheckOrderLineTaxedSimulation
CheckOrderLineDiscountedSimulation
CheckOrderLineDiscountedTaxedSimulation
GetInvoice
CheckInvoiceCausalityStateSolved
CheckInvoiceNormalMovements
CreateInvoiceLine
ModifyInvoiceLineDiscounted
CreateInvoiceLine
ModifyInvoiceLineDiscountedTaxed
CreateInvoiceLine
ModifyInvoiceLineTaxed
Tic
CheckInvoiceCausalityStateSolved
StartInvoice
Tic
CheckInvoiceCausalityStateSolved
CheckInvoiceNormalMovements
> CheckInvoiceAccountingMovements
StopInvoice
DeliverInvoice
Tic
File "/home/buildbot/slave/full.ERP5.blade-nxd1-10.6/build/unit_test/Products/ERP5Type/tests/Sequence.py", line 96, in play
method(sequence=sequence)
File "/home/buildbot/slave/full.ERP5.blade-nxd1-10.6/build/unit_test/Products/ERP5/tests/testTradeModelLine.py", line 382, in stepCheckInvoiceAccountingMovements
self.assertEqual(3, len(movement_list))
AssertionError: 3 != 0
FAIL: test_TradeModelRuleSimulationPackingListSplitBuildInvoiceBuildDifferentRatio (testTradeModelLine.TestTradeModelLineSale), Check building invoice after splitting packing list using different ratio
----------------------------------------------------------------------
Traceback (most recent call last):
File "/home/buildbot/slave/full.ERP5.blade-nxd1-10.6/build/products/ERP5Type/tests/backportUnittest.py", line 145, in run
testMethod()
File "/home/buildbot/slave/full.ERP5.blade-nxd1-10.6/build/unit_test/Products/ERP5/tests/testTradeModelLine.py", line 2185, in test_TradeModelRuleSimulationPackingListSplitBuildInvoiceBuildDifferentRatio
sequence_list.play(self, quiet=True)
File "/home/buildbot/slave/full.ERP5.blade-nxd1-10.6/build/unit_test/Products/ERP5Type/tests/Sequence.py", line 192, in play
sequence.play(context, sequence_number=i, quiet=quiet)
File "/home/buildbot/slave/full.ERP5.blade-nxd1-10.6/build/unit_test/Products/ERP5Type/tests/Sequence.py", line 113, in play
self._step_list[self._played_index] \
Current Sequence:
CreateServiceTax
CreateServiceDiscount
CreatePriceCurrency
CreateProductDiscounted
CreateProductTaxed
CreateProductDiscountedTaxed
CreateSource
CreateSourceSection
CreateDestination
CreateDestinationSection
Tic
CreateBusinessProcess
CreateBusinessState
ModifyBusinessStateTaxed
CreateBusinessState
ModifyBusinessStateInvoiced
CreateBusinessPath
ModifyBusinessPathTaxing
CreateBusinessPath
ModifyBusinessPathDiscounting
CreateTradeCondition
SpecialiseTradeConditionWithBusinessProcess
CreateTradeModelLine
ModifyTradeModelLineTax
CreateTradeModelLine
ModifyTradeModelLineDiscount
Tic
CreateOrder
SpecialiseOrderTradeCondition
FillOrder
Tic
CreateOrderLine
ModifyOrderLineTaxed
CreateOrderLine
ModifyOrderLineDiscounted
CreateOrderLine
ModifyOrderLineDiscountedTaxed
Tic
CheckOrderComplexTradeConditionAggregatedAmountList
CheckOrderLineTaxedAggregatedAmountList
CheckOrderLineDiscountedTaxedAggregatedAmountList
CheckOrderLineDiscountedAggregatedAmountList
Tic
PlanOrder
Tic
CheckOrderLineTaxedSimulation
CheckOrderLineDiscountedSimulation
CheckOrderLineDiscountedTaxedSimulation
ConfirmOrder
Tic
CheckOrderLineTaxedSimulation
CheckOrderLineDiscountedSimulation
CheckOrderLineDiscountedTaxedSimulation
GetPackingList
DecreasePackingListLineListQuantity
Tic
CheckOrderLineTaxedSimulation
CheckOrderLineDiscountedSimulation
CheckOrderLineDiscountedTaxedSimulation
CheckPackingListDiverged
SplitAndDeferPackingList
Tic
CheckOrderLineTaxedSimulation
CheckOrderLineDiscountedSimulation
CheckOrderLineDiscountedTaxedSimulation
GetNewPackingList
PackPackingList
Tic
CheckOrderLineTaxedSimulation
CheckOrderLineDiscountedSimulation
CheckOrderLineDiscountedTaxedSimulation
StartPackingList
StopPackingList
DeliverPackingList
Tic
CheckOrderLineTaxedSimulation
CheckOrderLineDiscountedSimulation
CheckOrderLineDiscountedTaxedSimulation
GetInvoice
> CheckInvoiceCausalityStateSolved
CheckInvoiceNormalMovements
SetNewPackingListAsPackingList
PackPackingList
Tic
StartPackingList
CheckOrderLineTaxedSimulation
CheckOrderLineDiscountedSimulation
CheckOrderLineDiscountedTaxedSimulation
StopPackingList
DeliverPackingList
Tic
CheckOrderLineTaxedSimulation
CheckOrderLineDiscountedSimulation
CheckOrderLineDiscountedTaxedSimulation
GetInvoice
CheckInvoiceCausalityStateSolved
CheckInvoiceNormalMovements
File "/home/buildbot/slave/full.ERP5.blade-nxd1-10.6/build/unit_test/Products/ERP5Type/tests/Sequence.py", line 96, in play
method(sequence=sequence)
File "/home/buildbot/slave/full.ERP5.blade-nxd1-10.6/build/unit_test/Products/ERP5/tests/testTradeModelLine.py", line 459, in stepCheckInvoiceCausalityStateSolved
invoice.getDivergenceList())
AssertionError: [<DivergenceMessage object at 0x75236c8
'decision_value': -0.049999999999999989
'divergence_scope': 'property'
'prevision_value': -0.050000000000000003
'mapping': {}
'object_relative_url': 'accounting_module/12/5'
'simulation_movement': <SimulationMovement at /erp5_portal_ad634f4ece1810b728855e61e26535eb/portal_simulation/21/2/1/1/1/1/1/1>
'tested_property': 'price'
'message': 'Price'>, <DivergenceMessage object at 0x7834488
'decision_value': -0.049999999999999989
'divergence_scope': 'property'
'prevision_value': -0.050000000000000003
'mapping': {}
'object_relative_url': 'accounting_module/12/5'
'simulation_movement': <SimulationMovement at /erp5_portal_ad634f4ece1810b728855e61e26535eb/portal_simulation/21/1/1/1/1/1/1/1>
'tested_property': 'price'
'message': 'Price'>]
FAIL: test_BuildTradeModelLineAndAccountingFromInvoice (testTradeModelLinePurchase.TestTradeModelLinePurchase)
----------------------------------------------------------------------
Traceback (most recent call last):
File "/home/buildbot/slave/full.ERP5.blade-nxd1-10.1/build/products/ERP5Type/tests/backportUnittest.py", line 145, in run
testMethod()
File "/home/buildbot/slave/full.ERP5.blade-nxd1-10.1/build/unit_test/Products/ERP5/tests/testTradeModelLine.py", line 2482, in test_BuildTradeModelLineAndAccountingFromInvoice
self.assertEquals(3, len(accounting_line_list))
AssertionError: 3 != 0
FAIL: test_BuildTradeModelLineAndAccountingFromOrder (testTradeModelLinePurchase.TestTradeModelLinePurchase)
----------------------------------------------------------------------
Traceback (most recent call last):
File "/home/buildbot/slave/full.ERP5.blade-nxd1-10.1/build/products/ERP5Type/tests/backportUnittest.py", line 145, in run
testMethod()
File "/home/buildbot/slave/full.ERP5.blade-nxd1-10.1/build/unit_test/Products/ERP5/tests/testTradeModelLine.py", line 2395, in test_BuildTradeModelLineAndAccountingFromOrder
self.assertEquals(3, len(accounting_line_list))
AssertionError: 3 != 0
FAIL: test_TradeModelRuleSimulationBuildInvoiceBuildInvoiceTransactionLines (testTradeModelLinePurchase.TestTradeModelLinePurchase), Check that having properly configured invoice transaction rule it invoice transaction lines are nicely generated and have proper amounts
----------------------------------------------------------------------
Traceback (most recent call last):
File "/home/buildbot/slave/full.ERP5.blade-nxd1-10.1/build/products/ERP5Type/tests/backportUnittest.py", line 145, in run
testMethod()
File "/home/buildbot/slave/full.ERP5.blade-nxd1-10.1/build/unit_test/Products/ERP5/tests/testTradeModelLine.py", line 2137, in test_TradeModelRuleSimulationBuildInvoiceBuildInvoiceTransactionLines
sequence_list.play(self, quiet=True)
File "/home/buildbot/slave/full.ERP5.blade-nxd1-10.1/build/unit_test/Products/ERP5Type/tests/Sequence.py", line 192, in play
sequence.play(context, sequence_number=i, quiet=quiet)
File "/home/buildbot/slave/full.ERP5.blade-nxd1-10.1/build/unit_test/Products/ERP5Type/tests/Sequence.py", line 113, in play
self._step_list[self._played_index] \
Current Sequence:
CreateServiceTax
CreateServiceDiscount
CreatePriceCurrency
CreateProductDiscounted
CreateProductTaxed
CreateProductDiscountedTaxed
CreateSource
CreateSourceSection
CreateDestination
CreateDestinationSection
Tic
CreateBusinessProcess
CreateBusinessState
ModifyBusinessStateTaxed
CreateBusinessState
ModifyBusinessStateInvoiced
CreateBusinessPath
ModifyBusinessPathTaxing
CreateBusinessPath
ModifyBusinessPathDiscounting
CreateTradeCondition
SpecialiseTradeConditionWithBusinessProcess
CreateTradeModelLine
ModifyTradeModelLineTax
CreateTradeModelLine
ModifyTradeModelLineDiscount
Tic
CreateOrder
SpecialiseOrderTradeCondition
FillOrder
Tic
CreateOrderLine
ModifyOrderLineTaxed
CreateOrderLine
ModifyOrderLineDiscounted
CreateOrderLine
ModifyOrderLineDiscountedTaxed
Tic
CheckOrderComplexTradeConditionAggregatedAmountList
CheckOrderLineTaxedAggregatedAmountList
CheckOrderLineDiscountedTaxedAggregatedAmountList
CheckOrderLineDiscountedAggregatedAmountList
Tic
PlanOrder
Tic
CheckOrderLineTaxedSimulation
CheckOrderLineDiscountedSimulation
CheckOrderLineDiscountedTaxedSimulation
ConfirmOrder
Tic
CheckOrderLineTaxedSimulation
CheckOrderLineDiscountedSimulation
CheckOrderLineDiscountedTaxedSimulation
GetPackingList
PackPackingList
Tic
CheckOrderLineTaxedSimulation
CheckOrderLineDiscountedSimulation
CheckOrderLineDiscountedTaxedSimulation
StartPackingList
StopPackingList
DeliverPackingList
Tic
CheckOrderLineTaxedSimulation
CheckOrderLineDiscountedSimulation
CheckOrderLineDiscountedTaxedSimulation
GetInvoice
CheckInvoiceCausalityStateSolved
CheckInvoiceNormalMovements
StartInvoice
Tic
CheckInvoiceCausalityStateSolved
CheckInvoiceNormalMovements
> CheckInvoiceAccountingMovements
StopInvoice
DeliverInvoice
Tic
File "/home/buildbot/slave/full.ERP5.blade-nxd1-10.1/build/unit_test/Products/ERP5Type/tests/Sequence.py", line 96, in play
method(sequence=sequence)
File "/home/buildbot/slave/full.ERP5.blade-nxd1-10.1/build/unit_test/Products/ERP5/tests/testTradeModelLine.py", line 382, in stepCheckInvoiceAccountingMovements
self.assertEqual(3, len(movement_list))
AssertionError: 3 != 0
FAIL: test_TradeModelRuleSimulationBuildInvoiceInvoiceLineModifyDivergencyAndSolving (testTradeModelLinePurchase.TestTradeModelLinePurchase), Check that after changing invoice line invoice is properly diverged and it is possible to solve
----------------------------------------------------------------------
Traceback (most recent call last):
File "/home/buildbot/slave/full.ERP5.blade-nxd1-10.1/build/products/ERP5Type/tests/backportUnittest.py", line 145, in run
testMethod()
File "/home/buildbot/slave/full.ERP5.blade-nxd1-10.1/build/unit_test/Products/ERP5/tests/testTradeModelLine.py", line 2104, in test_TradeModelRuleSimulationBuildInvoiceInvoiceLineModifyDivergencyAndSolving
sequence_list.play(self, quiet=True)
File "/home/buildbot/slave/full.ERP5.blade-nxd1-10.1/build/unit_test/Products/ERP5Type/tests/Sequence.py", line 192, in play
sequence.play(context, sequence_number=i, quiet=quiet)
File "/home/buildbot/slave/full.ERP5.blade-nxd1-10.1/build/unit_test/Products/ERP5Type/tests/Sequence.py", line 113, in play
self._step_list[self._played_index] \
Current Sequence:
CreateServiceTax
CreateServiceDiscount
CreatePriceCurrency
CreateProductDiscounted
CreateProductTaxed
CreateProductDiscountedTaxed
CreateSource
CreateSourceSection
CreateDestination
CreateDestinationSection
Tic
CreateBusinessProcess
CreateBusinessState
ModifyBusinessStateTaxed
CreateBusinessState
ModifyBusinessStateInvoiced
CreateBusinessPath
ModifyBusinessPathTaxing
CreateBusinessPath
ModifyBusinessPathDiscounting
CreateTradeCondition
SpecialiseTradeConditionWithBusinessProcess
CreateTradeModelLine
ModifyTradeModelLineTax
CreateTradeModelLine
ModifyTradeModelLineDiscount
Tic
CreateOrder
SpecialiseOrderTradeCondition
FillOrder
Tic
CreateOrderLine
ModifyOrderLineTaxed
CreateOrderLine
ModifyOrderLineDiscounted
CreateOrderLine
ModifyOrderLineDiscountedTaxed
Tic
CheckOrderComplexTradeConditionAggregatedAmountList
CheckOrderLineTaxedAggregatedAmountList
CheckOrderLineDiscountedTaxedAggregatedAmountList
CheckOrderLineDiscountedAggregatedAmountList
Tic
PlanOrder
Tic
CheckOrderLineTaxedSimulation
CheckOrderLineDiscountedSimulation
CheckOrderLineDiscountedTaxedSimulation
ConfirmOrder
Tic
CheckOrderLineTaxedSimulation
CheckOrderLineDiscountedSimulation
CheckOrderLineDiscountedTaxedSimulation
GetPackingList
PackPackingList
Tic
CheckOrderLineTaxedSimulation
CheckOrderLineDiscountedSimulation
CheckOrderLineDiscountedTaxedSimulation
StartPackingList
StopPackingList
DeliverPackingList
Tic
CheckOrderLineTaxedSimulation
CheckOrderLineDiscountedSimulation
CheckOrderLineDiscountedTaxedSimulation
GetInvoice
CheckInvoiceCausalityStateSolved
CheckInvoiceNormalMovements
GetInvoiceLineDiscounted
GetInvoiceLineDiscountedTaxed
GetInvoiceLineTaxed
ModifyQuantityInvoiceLineDiscounted
ModifyQuantityInvoiceLineDiscountedTaxed
ModifyQuantityInvoiceLineTaxed
Tic
CheckInvoiceCausalityStateDiverged
AcceptDecisionQuantityInvoice
Tic
> CheckInvoiceCausalityStateSolved
CheckInvoiceNormalMovements
File "/home/buildbot/slave/full.ERP5.blade-nxd1-10.1/build/unit_test/Products/ERP5Type/tests/Sequence.py", line 96, in play
method(sequence=sequence)
File "/home/buildbot/slave/full.ERP5.blade-nxd1-10.1/build/unit_test/Products/ERP5/tests/testTradeModelLine.py", line 459, in stepCheckInvoiceCausalityStateSolved
invoice.getDivergenceList())
AssertionError: [<DivergenceMessage object at 0x88ea5a8
'decision_value': 1.9999999999999998
'divergence_scope': 'quantity'
'prevision_value': 5.0
'mapping': {}
'object_relative_url': 'accounting_module/5/5'
'simulation_movement': <SimulationMovement at /erp5_portal_f961ca546667fb6832d17eeef19b90b9/portal_simulation/8/3/1/1/1/1/1/1>
'tested_property': 'quantity'
'decision_title': '1.9999999999999998'
'message': 'Quantity'>, <DivergenceMessage object at 0x557cd40
'decision_value': -0.60000000000000009
'divergence_scope': 'quantity'
'prevision_value': -1.5
'mapping': {}
'object_relative_url': 'accounting_module/5/5'
'simulation_movement': <SimulationMovement at /erp5_portal_f961ca546667fb6832d17eeef19b90b9/portal_simulation/8/2/1/1/1/1/1/2>
'tested_property': 'quantity'
'decision_title': '-0.60000000000000009'
'message': 'Quantity'>, <DivergenceMessage object at 0x8e57758
'decision_value': 28.5
'divergence_scope': 'quantity'
'prevision_value': 71.25
'mapping': {}
'object_relative_url': 'accounting_module/5/5'
'simulation_movement': <SimulationMovement at /erp5_portal_f961ca546667fb6832d17eeef19b90b9/portal_simulation/8/1/1/1/1/1/1/2>
'tested_property': 'quantity'
'decision_title': '28.5'
'message': 'Quantity'>, <DivergenceMessage object at 0x7378290
'decision_value': 12.0
'divergence_scope': 'quantity'
'prevision_value': 30.0
'mapping': {}
'object_relative_url': 'accounting_module/5/4'
'simulation_movement': <SimulationMovement at /erp5_portal_f961ca546667fb6832d17eeef19b90b9/portal_simulation/8/2/1/1/1/1/1/1>
'tested_property': 'quantity'
'decision_title': '12.0'
'message': 'Quantity'>, <DivergenceMessage object at 0x7eb79e0
'decision_value': 30.0
'divergence_scope': 'quantity'
'prevision_value': 75.0
'mapping': {}
'object_relative_url': 'accounting_module/5/4'
'simulation_movement': <SimulationMovement at /erp5_portal_f961ca546667fb6832d17eeef19b90b9/portal_simulation/8/1/1/1/1/1/1/1>
'tested_property': 'quantity'
'decision_title': '30.0'
'message': 'Quantity'>]
FAIL: test_TradeModelRuleSimulationBuildInvoiceNewInvoiceLineSupport (testTradeModelLinePurchase.TestTradeModelLinePurchase), Check how is supported addition of invoice line to invoice build from order
----------------------------------------------------------------------
Traceback (most recent call last):
File "/home/buildbot/slave/full.ERP5.blade-nxd1-10.1/build/products/ERP5Type/tests/backportUnittest.py", line 145, in run
testMethod()
File "/home/buildbot/slave/full.ERP5.blade-nxd1-10.1/build/unit_test/Products/ERP5/tests/testTradeModelLine.py", line 2066, in test_TradeModelRuleSimulationBuildInvoiceNewInvoiceLineSupport
sequence_list.play(self, quiet=True)
File "/home/buildbot/slave/full.ERP5.blade-nxd1-10.1/build/unit_test/Products/ERP5Type/tests/Sequence.py", line 192, in play
sequence.play(context, sequence_number=i, quiet=quiet)
File "/home/buildbot/slave/full.ERP5.blade-nxd1-10.1/build/unit_test/Products/ERP5Type/tests/Sequence.py", line 113, in play
self._step_list[self._played_index] \
Current Sequence:
CreateServiceTax
CreateServiceDiscount
CreatePriceCurrency
CreateProductDiscounted
CreateProductTaxed
CreateProductDiscountedTaxed
CreateSource
CreateSourceSection
CreateDestination
CreateDestinationSection
Tic
CreateBusinessProcess
CreateBusinessState
ModifyBusinessStateTaxed
CreateBusinessState
ModifyBusinessStateInvoiced
CreateBusinessPath
ModifyBusinessPathTaxing
CreateBusinessPath
ModifyBusinessPathDiscounting
CreateTradeCondition
SpecialiseTradeConditionWithBusinessProcess
CreateTradeModelLine
ModifyTradeModelLineTax
CreateTradeModelLine
ModifyTradeModelLineDiscount
Tic
CreateOrder
SpecialiseOrderTradeCondition
FillOrder
Tic
CreateOrderLine
ModifyOrderLineTaxed
CreateOrderLine
ModifyOrderLineDiscounted
CreateOrderLine
ModifyOrderLineDiscountedTaxed
Tic
CheckOrderComplexTradeConditionAggregatedAmountList
CheckOrderLineTaxedAggregatedAmountList
CheckOrderLineDiscountedTaxedAggregatedAmountList
CheckOrderLineDiscountedAggregatedAmountList
Tic
PlanOrder
Tic
CheckOrderLineTaxedSimulation
CheckOrderLineDiscountedSimulation
CheckOrderLineDiscountedTaxedSimulation
ConfirmOrder
Tic
CheckOrderLineTaxedSimulation
CheckOrderLineDiscountedSimulation
CheckOrderLineDiscountedTaxedSimulation
GetPackingList
PackPackingList
Tic
CheckOrderLineTaxedSimulation
CheckOrderLineDiscountedSimulation
CheckOrderLineDiscountedTaxedSimulation
StartPackingList
StopPackingList
DeliverPackingList
Tic
CheckOrderLineTaxedSimulation
CheckOrderLineDiscountedSimulation
CheckOrderLineDiscountedTaxedSimulation
GetInvoice
CheckInvoiceCausalityStateSolved
CheckInvoiceNormalMovements
CreateInvoiceLine
ModifyInvoiceLineDiscounted
CreateInvoiceLine
ModifyInvoiceLineDiscountedTaxed
CreateInvoiceLine
ModifyInvoiceLineTaxed
Tic
CheckInvoiceCausalityStateSolved
StartInvoice
Tic
CheckInvoiceCausalityStateSolved
CheckInvoiceNormalMovements
> CheckInvoiceAccountingMovements
StopInvoice
DeliverInvoice
Tic
File "/home/buildbot/slave/full.ERP5.blade-nxd1-10.1/build/unit_test/Products/ERP5Type/tests/Sequence.py", line 96, in play
method(sequence=sequence)
File "/home/buildbot/slave/full.ERP5.blade-nxd1-10.1/build/unit_test/Products/ERP5/tests/testTradeModelLine.py", line 382, in stepCheckInvoiceAccountingMovements
self.assertEqual(3, len(movement_list))
AssertionError: 3 != 0
FAIL: test_TradeModelRuleSimulationPackingListSplitBuildInvoiceBuildDifferentRatio (testTradeModelLinePurchase.TestTradeModelLinePurchase), Check building invoice after splitting packing list using different ratio
----------------------------------------------------------------------
Traceback (most recent call last):
File "/home/buildbot/slave/full.ERP5.blade-nxd1-10.1/build/products/ERP5Type/tests/backportUnittest.py", line 145, in run
testMethod()
File "/home/buildbot/slave/full.ERP5.blade-nxd1-10.1/build/unit_test/Products/ERP5/tests/testTradeModelLine.py", line 2185, in test_TradeModelRuleSimulationPackingListSplitBuildInvoiceBuildDifferentRatio
sequence_list.play(self, quiet=True)
File "/home/buildbot/slave/full.ERP5.blade-nxd1-10.1/build/unit_test/Products/ERP5Type/tests/Sequence.py", line 192, in play
sequence.play(context, sequence_number=i, quiet=quiet)
File "/home/buildbot/slave/full.ERP5.blade-nxd1-10.1/build/unit_test/Products/ERP5Type/tests/Sequence.py", line 113, in play
self._step_list[self._played_index] \
Current Sequence:
CreateServiceTax
CreateServiceDiscount
CreatePriceCurrency
CreateProductDiscounted
CreateProductTaxed
CreateProductDiscountedTaxed
CreateSource
CreateSourceSection
CreateDestination
CreateDestinationSection
Tic
CreateBusinessProcess
CreateBusinessState
ModifyBusinessStateTaxed
CreateBusinessState
ModifyBusinessStateInvoiced
CreateBusinessPath
ModifyBusinessPathTaxing
CreateBusinessPath
ModifyBusinessPathDiscounting
CreateTradeCondition
SpecialiseTradeConditionWithBusinessProcess
CreateTradeModelLine
ModifyTradeModelLineTax
CreateTradeModelLine
ModifyTradeModelLineDiscount
Tic
CreateOrder
SpecialiseOrderTradeCondition
FillOrder
Tic
CreateOrderLine
ModifyOrderLineTaxed
CreateOrderLine
ModifyOrderLineDiscounted
CreateOrderLine
ModifyOrderLineDiscountedTaxed
Tic
CheckOrderComplexTradeConditionAggregatedAmountList
CheckOrderLineTaxedAggregatedAmountList
CheckOrderLineDiscountedTaxedAggregatedAmountList
CheckOrderLineDiscountedAggregatedAmountList
Tic
PlanOrder
Tic
CheckOrderLineTaxedSimulation
CheckOrderLineDiscountedSimulation
CheckOrderLineDiscountedTaxedSimulation
ConfirmOrder
Tic
CheckOrderLineTaxedSimulation
CheckOrderLineDiscountedSimulation
CheckOrderLineDiscountedTaxedSimulation
GetPackingList
DecreasePackingListLineListQuantity
Tic
CheckOrderLineTaxedSimulation
CheckOrderLineDiscountedSimulation
CheckOrderLineDiscountedTaxedSimulation
CheckPackingListDiverged
SplitAndDeferPackingList
Tic
CheckOrderLineTaxedSimulation
CheckOrderLineDiscountedSimulation
CheckOrderLineDiscountedTaxedSimulation
GetNewPackingList
PackPackingList
Tic
CheckOrderLineTaxedSimulation
CheckOrderLineDiscountedSimulation
CheckOrderLineDiscountedTaxedSimulation
StartPackingList
StopPackingList
DeliverPackingList
Tic
CheckOrderLineTaxedSimulation
CheckOrderLineDiscountedSimulation
CheckOrderLineDiscountedTaxedSimulation
GetInvoice
> CheckInvoiceCausalityStateSolved
CheckInvoiceNormalMovements
SetNewPackingListAsPackingList
PackPackingList
Tic
StartPackingList
CheckOrderLineTaxedSimulation
CheckOrderLineDiscountedSimulation
CheckOrderLineDiscountedTaxedSimulation
StopPackingList
DeliverPackingList
Tic
CheckOrderLineTaxedSimulation
CheckOrderLineDiscountedSimulation
CheckOrderLineDiscountedTaxedSimulation
GetInvoice
CheckInvoiceCausalityStateSolved
CheckInvoiceNormalMovements
File "/home/buildbot/slave/full.ERP5.blade-nxd1-10.1/build/unit_test/Products/ERP5Type/tests/Sequence.py", line 96, in play
method(sequence=sequence)
File "/home/buildbot/slave/full.ERP5.blade-nxd1-10.1/build/unit_test/Products/ERP5/tests/testTradeModelLine.py", line 459, in stepCheckInvoiceCausalityStateSolved
invoice.getDivergenceList())
AssertionError: [<DivergenceMessage object at 0x5be4518
'decision_value': -0.049999999999999989
'divergence_scope': 'property'
'prevision_value': -0.050000000000000003
'mapping': {}
'object_relative_url': 'accounting_module/12/5'
'simulation_movement': <SimulationMovement at /erp5_portal_f961ca546667fb6832d17eeef19b90b9/portal_simulation/21/2/1/1/1/1/1/1>
'tested_property': 'price'
'message': 'Price'>, <DivergenceMessage object at 0x7007128
'decision_value': -0.049999999999999989
'divergence_scope': 'property'
'prevision_value': -0.050000000000000003
'mapping': {}
'object_relative_url': 'accounting_module/12/5'
'simulation_movement': <SimulationMovement at /erp5_portal_f961ca546667fb6832d17eeef19b90b9/portal_simulation/21/1/1/1/1/1/1/1>
'tested_property': 'price'
'message': 'Price'>]
FAIL: test_configurationOfFieldLibrary (testXHTML.TestXHTML)
----------------------------------------------------------------------
Traceback (most recent call last):
File "/home/buildbot/slave/full.ERP5.blade-nxd1-10.5/build/products/ERP5Type/tests/backportUnittest.py", line 145, in run
testMethod()
File "/home/buildbot/slave/full.ERP5.blade-nxd1-10.5/build/unit_test/Products/ERP5/tests/testXHTML.py", line 186, in test_configurationOfFieldLibrary
self.fail(message) # uncomment above for details on each field
AssertionError: 5414 fields to modify
FAIL: test_deadProxyFields (testXHTML.TestXHTML)
----------------------------------------------------------------------
Traceback (most recent call last):
File "/home/buildbot/slave/full.ERP5.blade-nxd1-10.5/build/products/ERP5Type/tests/backportUnittest.py", line 145, in run
testMethod()
File "/home/buildbot/slave/full.ERP5.blade-nxd1-10.5/build/unit_test/Products/ERP5/tests/testXHTML.py", line 172, in test_deadProxyFields
self.fail(message)
AssertionError:
Dead proxy field list('Print', 'Base_viewTradeFieldLibrary/my_report_mode_at_date', 'Base_viewFieldLibrary', 'my_report_mode_at_date')
('View', 'Base_viewTradeFieldLibrary/my_report_mode_at_date', 'Base_viewFieldLibrary', 'my_report_mode_at_date')
FAIL: test_erp5_dms_Drawing_OOoDocument_viewAsWeb (testXHTML.TestXHTML)
----------------------------------------------------------------------
Traceback (most recent call last):
File "/home/buildbot/slave/full.ERP5.blade-nxd1-10.5/build/products/ERP5Type/tests/backportUnittest.py", line 145, in run
testMethod()
File "/home/buildbot/slave/full.ERP5.blade-nxd1-10.5/build/unit_test/Products/ERP5/tests/testXHTML.py", line 425, in testMethod
bt_name=bt_name))
AssertionError: Using w3c validator to parse the view "OOoDocument_viewAsWeb" (from erp5_dms bt) with warnings displayed :
Error: line 520 column 43 : there is no attribute "class"
Error: line 520 column 63 : there is no attribute "style"
Error: line 520 column 105 : there is no attribute "src"
Error: line 520 column 222 : there is no attribute "onload"
Error: line 520 column 244 : element "iframe" undefined
FAIL: test_erp5_dms_Presentation_OOoDocument_viewAsWeb (testXHTML.TestXHTML)
----------------------------------------------------------------------
Traceback (most recent call last):
File "/home/buildbot/slave/full.ERP5.blade-nxd1-10.5/build/products/ERP5Type/tests/backportUnittest.py", line 145, in run
testMethod()
File "/home/buildbot/slave/full.ERP5.blade-nxd1-10.5/build/unit_test/Products/ERP5/tests/testXHTML.py", line 425, in testMethod
bt_name=bt_name))
AssertionError: Using w3c validator to parse the view "OOoDocument_viewAsWeb" (from erp5_dms bt) with warnings displayed :
Error: line 520 column 43 : there is no attribute "class"
Error: line 520 column 63 : there is no attribute "style"
Error: line 520 column 105 : there is no attribute "src"
Error: line 520 column 222 : there is no attribute "onload"
Error: line 520 column 244 : element "iframe" undefined
FAIL: test_listActionInListbox (testXHTML.TestXHTML)
----------------------------------------------------------------------
Traceback (most recent call last):
File "/home/buildbot/slave/full.ERP5.blade-nxd1-10.5/build/products/ERP5Type/tests/backportUnittest.py", line 145, in run
testMethod()
File "/home/buildbot/slave/full.ERP5.blade-nxd1-10.5/build/unit_test/Products/ERP5/tests/testXHTML.py", line 254, in test_listActionInListbox
self.assertEquals(error_list, [])
AssertionError: [('erp5_core/Documentation_view/my_dynamic_accessor_list', 'bla'), ('erp5_core/Documentation_view/my_dynamic_category_list', 'bla'), ('erp5_core/Documentation_view/my_static_property_list', 'bla'), ('erp5_core/Documentation_view/my_static_method_list', 'bla'), ('erp5_core/Documentation_view/my_dynamic_property_list', 'bla'), ('erp5_core/Documentation_view/my_dynamic_method_list', 'bla'), ('erp5_web_widget_library/WebSection_viewLatestDocumentListGadget/listbox', 'WebSite_viewLatestAdditionList'), ('erp5_project/Project_viewQuantityReport/listbox', 'Folder_viewContent')] != []
More information about the Erp5-report
mailing list