[Erp5-report] ERP5 r18218: 1362 Tests, 28 Errors, 2 Failures
nobody at svn.erp5.org
nobody at svn.erp5.org
Tue Dec 11 05:29:02 CET 2007
Test Suite: ERP5
Revision: 18218
Result: FAIL
All tests: 1362
Failures: 2
Errors: 28
The following tests failed:
testAccounting (9 errors)
test_AccountingTransactionValidationStartDate (testAccounting.TestTransactionValidation)
test_DestinationPaymentTransactionValidationDate (testAccounting.TestTransactionValidation)
test_NonBalancedAccountingTransaction (testAccounting.TestTransactionValidation)
test_NonBalancedDestinationAccountingTransaction (testAccounting.TestTransactionValidation)
test_PaymentTransactionValidationDate (testAccounting.TestTransactionValidation)
test_PaymentTransactionWithEmployee (testAccounting.TestTransactionValidation)
test_PurchaseInvoiceTransactionValidationDate (testAccounting.TestTransactionValidation)
test_SaleInvoiceTransactionValidationDate (testAccounting.TestTransactionValidation)
test_UnusedSectionTransactionValidationDate (testAccounting.TestTransactionValidation)
testXHTML (1 errors)
testCurrencyCurrency_view (testXHTML.TestXHTML)
testInvoice (17 errors)
test_01_SimpleInvoice (testInvoice.TestInvoice)
test_02_TwoInvoicesFromTwoPackingList (testInvoice.TestInvoice)
test_03_InvoiceEditAndInvoiceRule (testInvoice.TestInvoice)
test_04_PackingListEditAndInvoiceRule (testInvoice.TestInvoice)
test_05_InvoiceEditPackingListLine (testInvoice.TestInvoice)
test_06_InvoiceDeletePackingListLine (testInvoice.TestInvoice)
test_07_InvoiceAddPackingListLine (testInvoice.TestInvoice)
test_08_InvoiceDecreaseQuantity (testInvoice.TestInvoice)
test_09_InvoiceChangeStartDateFail (testInvoice.TestInvoice)
test_09b_InvoiceChangeStartDateSucceed (testInvoice.TestInvoice)
test_10_AcceptDecisionOnPackingList (testInvoice.TestInvoice)
test_11_AcceptDecisionOnPackingListAndInvoice (testInvoice.TestInvoice)
test_12_SplitPackingListAndAcceptInvoice (testInvoice.TestInvoice)
test_13_SplitAndDeferInvoice (testInvoice.TestInvoice)
test_14_AcceptDecisionOnInvoice (testInvoice.TestInvoice)
test_16_ManuallyAddedMovements (testInvoice.TestInvoice)
test_17_ManuallyAddedWrongMovements (testInvoice.TestInvoice)
testERP5Web (1 failures)
test_04_WebPageTranslation (testERP5Web.TestERP5Web)
testSQLCachedWorklist (1 failures)
test_01_worklist (testSQLCachedWorklist.TestSQLCachedWorklist)
testERP5Catalog (1 errors)
test_53_DateFormat (testERP5Catalog.TestERP5Catalog)
-------------- next part --------------
ERROR: test_AccountingTransactionValidationStartDate (testAccounting.TestTransactionValidation)
----------------------------------------------------------------------
Traceback (most recent call last):
File "/usr/lib/zope/lib/python/Testing/ZopeTestCase/profiler.py", line 68, in __call__
self.setUp()
File "/mnt/erp5_cd/buildbot_slave/slave/full.bot_livecd/build/unit_test/Products/ERP5/tests/testAccounting.py", line 157, in setUp
ERP5TypeTestCase.setUp(self)
File "/mnt/erp5_cd/buildbot_slave/slave/full.bot_livecd/build/unit_test/Products/ERP5Type/tests/ERP5TypeTestCase.py", line 334, in setUp
erp5_catalog_storage=erp5_catalog_storage)
File "/mnt/erp5_cd/buildbot_slave/slave/full.bot_livecd/build/unit_test/Products/ERP5Type/tests/ERP5TypeTestCase.py", line 579, in setupERP5Site
create_activities=create_activities,
File "/mnt/erp5_cd/buildbot_slave/slave/full.bot_livecd/build/unit_test/Products/ERP5/ERP5Site.py", line 93, in manage_addERP5Site
reindex=reindex)
File "/mnt/erp5_cd/buildbot_slave/slave/full.bot_livecd/build/unit_test/Products/ERP5/ERP5Site.py", line 1136, in create
reindex=reindex, **kw)
File "/mnt/erp5_cd/buildbot_slave/slave/full.bot_livecd/build/unit_test/Products/ERP5/ERP5Site.py", line 1573, in setup
self.setupIndex(p, **kw)
File "/mnt/erp5_cd/buildbot_slave/slave/full.bot_livecd/build/unit_test/Products/ERP5/ERP5Site.py", line 1432, in setupIndex
portal_catalog.manage_catalogClear()
File "/mnt/erp5_cd/buildbot_slave/slave/full.bot_livecd/build/unit_test/Products/ZSQLCatalog/ZSQLCatalog.py", line 605, in manage_catalogClear
catalog.manage_catalogClear(REQUEST=REQUEST, RESPONSE=RESPONSE, URL1=URL1)
File "/mnt/erp5_cd/buildbot_slave/slave/full.bot_livecd/build/unit_test/Products/ZSQLCatalog/SQLCatalog.py", line 1507, in manage_catalogClear
self.clear()
File "/mnt/erp5_cd/buildbot_slave/slave/full.bot_livecd/build/unit_test/Products/ZSQLCatalog/SQLCatalog.py", line 1123, in clear
self.clearReserved()
File "/mnt/erp5_cd/buildbot_slave/slave/full.bot_livecd/build/unit_test/Products/ZSQLCatalog/SQLCatalog.py", line 1151, in clearReserved
method()
File "/mnt/erp5_cd/buildbot_slave/slave/full.bot_livecd/build/unit_test/Products/ERP5Type/patches/DA.py", line 186, in DA__call__
except: raise DatabaseError, (
DatabaseError: z_clear_reserved is not connected to a database
ERROR: test_DestinationPaymentTransactionValidationDate (testAccounting.TestTransactionValidation)
----------------------------------------------------------------------
Traceback (most recent call last):
File "/usr/lib/zope/lib/python/Testing/ZopeTestCase/profiler.py", line 68, in __call__
self.setUp()
File "/mnt/erp5_cd/buildbot_slave/slave/full.bot_livecd/build/unit_test/Products/ERP5/tests/testAccounting.py", line 157, in setUp
ERP5TypeTestCase.setUp(self)
File "/mnt/erp5_cd/buildbot_slave/slave/full.bot_livecd/build/unit_test/Products/ERP5Type/tests/ERP5TypeTestCase.py", line 334, in setUp
erp5_catalog_storage=erp5_catalog_storage)
File "/mnt/erp5_cd/buildbot_slave/slave/full.bot_livecd/build/unit_test/Products/ERP5Type/tests/ERP5TypeTestCase.py", line 534, in setupERP5Site
raise RuntimeError, 'Installation of %s already failed, giving up'\
RuntimeError: Installation of erp5_portal_85635a825c405354927e044c693859cc already failed, giving up
ERROR: test_NonBalancedAccountingTransaction (testAccounting.TestTransactionValidation)
----------------------------------------------------------------------
Traceback (most recent call last):
File "/usr/lib/zope/lib/python/Testing/ZopeTestCase/profiler.py", line 68, in __call__
self.setUp()
File "/mnt/erp5_cd/buildbot_slave/slave/full.bot_livecd/build/unit_test/Products/ERP5/tests/testAccounting.py", line 157, in setUp
ERP5TypeTestCase.setUp(self)
File "/mnt/erp5_cd/buildbot_slave/slave/full.bot_livecd/build/unit_test/Products/ERP5Type/tests/ERP5TypeTestCase.py", line 334, in setUp
erp5_catalog_storage=erp5_catalog_storage)
File "/mnt/erp5_cd/buildbot_slave/slave/full.bot_livecd/build/unit_test/Products/ERP5Type/tests/ERP5TypeTestCase.py", line 534, in setupERP5Site
raise RuntimeError, 'Installation of %s already failed, giving up'\
RuntimeError: Installation of erp5_portal_85635a825c405354927e044c693859cc already failed, giving up
ERROR: test_NonBalancedDestinationAccountingTransaction (testAccounting.TestTransactionValidation)
----------------------------------------------------------------------
Traceback (most recent call last):
File "/usr/lib/zope/lib/python/Testing/ZopeTestCase/profiler.py", line 68, in __call__
self.setUp()
File "/mnt/erp5_cd/buildbot_slave/slave/full.bot_livecd/build/unit_test/Products/ERP5/tests/testAccounting.py", line 157, in setUp
ERP5TypeTestCase.setUp(self)
File "/mnt/erp5_cd/buildbot_slave/slave/full.bot_livecd/build/unit_test/Products/ERP5Type/tests/ERP5TypeTestCase.py", line 334, in setUp
erp5_catalog_storage=erp5_catalog_storage)
File "/mnt/erp5_cd/buildbot_slave/slave/full.bot_livecd/build/unit_test/Products/ERP5Type/tests/ERP5TypeTestCase.py", line 534, in setupERP5Site
raise RuntimeError, 'Installation of %s already failed, giving up'\
RuntimeError: Installation of erp5_portal_85635a825c405354927e044c693859cc already failed, giving up
ERROR: test_PaymentTransactionValidationDate (testAccounting.TestTransactionValidation)
----------------------------------------------------------------------
Traceback (most recent call last):
File "/usr/lib/zope/lib/python/Testing/ZopeTestCase/profiler.py", line 68, in __call__
self.setUp()
File "/mnt/erp5_cd/buildbot_slave/slave/full.bot_livecd/build/unit_test/Products/ERP5/tests/testAccounting.py", line 157, in setUp
ERP5TypeTestCase.setUp(self)
File "/mnt/erp5_cd/buildbot_slave/slave/full.bot_livecd/build/unit_test/Products/ERP5Type/tests/ERP5TypeTestCase.py", line 334, in setUp
erp5_catalog_storage=erp5_catalog_storage)
File "/mnt/erp5_cd/buildbot_slave/slave/full.bot_livecd/build/unit_test/Products/ERP5Type/tests/ERP5TypeTestCase.py", line 534, in setupERP5Site
raise RuntimeError, 'Installation of %s already failed, giving up'\
RuntimeError: Installation of erp5_portal_85635a825c405354927e044c693859cc already failed, giving up
ERROR: test_PaymentTransactionWithEmployee (testAccounting.TestTransactionValidation)
----------------------------------------------------------------------
Traceback (most recent call last):
File "/usr/lib/zope/lib/python/Testing/ZopeTestCase/profiler.py", line 68, in __call__
self.setUp()
File "/mnt/erp5_cd/buildbot_slave/slave/full.bot_livecd/build/unit_test/Products/ERP5/tests/testAccounting.py", line 157, in setUp
ERP5TypeTestCase.setUp(self)
File "/mnt/erp5_cd/buildbot_slave/slave/full.bot_livecd/build/unit_test/Products/ERP5Type/tests/ERP5TypeTestCase.py", line 334, in setUp
erp5_catalog_storage=erp5_catalog_storage)
File "/mnt/erp5_cd/buildbot_slave/slave/full.bot_livecd/build/unit_test/Products/ERP5Type/tests/ERP5TypeTestCase.py", line 534, in setupERP5Site
raise RuntimeError, 'Installation of %s already failed, giving up'\
RuntimeError: Installation of erp5_portal_85635a825c405354927e044c693859cc already failed, giving up
ERROR: test_PurchaseInvoiceTransactionValidationDate (testAccounting.TestTransactionValidation)
----------------------------------------------------------------------
Traceback (most recent call last):
File "/usr/lib/zope/lib/python/Testing/ZopeTestCase/profiler.py", line 68, in __call__
self.setUp()
File "/mnt/erp5_cd/buildbot_slave/slave/full.bot_livecd/build/unit_test/Products/ERP5/tests/testAccounting.py", line 157, in setUp
ERP5TypeTestCase.setUp(self)
File "/mnt/erp5_cd/buildbot_slave/slave/full.bot_livecd/build/unit_test/Products/ERP5Type/tests/ERP5TypeTestCase.py", line 334, in setUp
erp5_catalog_storage=erp5_catalog_storage)
File "/mnt/erp5_cd/buildbot_slave/slave/full.bot_livecd/build/unit_test/Products/ERP5Type/tests/ERP5TypeTestCase.py", line 534, in setupERP5Site
raise RuntimeError, 'Installation of %s already failed, giving up'\
RuntimeError: Installation of erp5_portal_85635a825c405354927e044c693859cc already failed, giving up
ERROR: test_SaleInvoiceTransactionValidationDate (testAccounting.TestTransactionValidation)
----------------------------------------------------------------------
Traceback (most recent call last):
File "/usr/lib/zope/lib/python/Testing/ZopeTestCase/profiler.py", line 68, in __call__
self.setUp()
File "/mnt/erp5_cd/buildbot_slave/slave/full.bot_livecd/build/unit_test/Products/ERP5/tests/testAccounting.py", line 157, in setUp
ERP5TypeTestCase.setUp(self)
File "/mnt/erp5_cd/buildbot_slave/slave/full.bot_livecd/build/unit_test/Products/ERP5Type/tests/ERP5TypeTestCase.py", line 334, in setUp
erp5_catalog_storage=erp5_catalog_storage)
File "/mnt/erp5_cd/buildbot_slave/slave/full.bot_livecd/build/unit_test/Products/ERP5Type/tests/ERP5TypeTestCase.py", line 534, in setupERP5Site
raise RuntimeError, 'Installation of %s already failed, giving up'\
RuntimeError: Installation of erp5_portal_85635a825c405354927e044c693859cc already failed, giving up
ERROR: test_UnusedSectionTransactionValidationDate (testAccounting.TestTransactionValidation)
----------------------------------------------------------------------
Traceback (most recent call last):
File "/usr/lib/zope/lib/python/Testing/ZopeTestCase/profiler.py", line 68, in __call__
self.setUp()
File "/mnt/erp5_cd/buildbot_slave/slave/full.bot_livecd/build/unit_test/Products/ERP5/tests/testAccounting.py", line 157, in setUp
ERP5TypeTestCase.setUp(self)
File "/mnt/erp5_cd/buildbot_slave/slave/full.bot_livecd/build/unit_test/Products/ERP5Type/tests/ERP5TypeTestCase.py", line 334, in setUp
erp5_catalog_storage=erp5_catalog_storage)
File "/mnt/erp5_cd/buildbot_slave/slave/full.bot_livecd/build/unit_test/Products/ERP5Type/tests/ERP5TypeTestCase.py", line 534, in setupERP5Site
raise RuntimeError, 'Installation of %s already failed, giving up'\
RuntimeError: Installation of erp5_portal_85635a825c405354927e044c693859cc already failed, giving up
ERROR: testCurrencyCurrency_view (testXHTML.TestXHTML)
----------------------------------------------------------------------
Traceback (most recent call last):
File "/usr/lib/zope/lib/python/Testing/ZopeTestCase/profiler.py", line 80, in __call__
testMethod()
File "/mnt/erp5_cd/buildbot_slave/slave/full.bot_livecd/build/unit_test/Products/ERP5/tests/testXHTML.py", line 153, in testMethod
self.assert_(validate_xhtml(view()))
File "/mnt/erp5_cd/buildbot_slave/slave/full.bot_livecd/build/unit_test/Products/ERP5Form/Form.py", line 512, in __call__
def __call__(self, *args, **kwargs):
File "/mnt/erp5_cd/buildbot_slave/slave/full.bot_livecd/build/unit_test/Products/ERP5Form/Form.py", line 550, in __call__
return pt.pt_render(extra_context=extra_context)
File "/usr/lib/zope/./build/build-base/python-2.4/build-lib/Products/PageTemplates/PageTemplate.py", line 97, in pt_render
File "/usr/lib/python2.4/StringIO.py", line 271, in getvalue
self.buf += ''.join(self.buflist)
UnicodeDecodeError: 'ascii' codec can't decode byte 0xc2 in position 102: ordinal not in range(128)
ERROR: test_01_SimpleInvoice (testInvoice.TestInvoice)
----------------------------------------------------------------------
Traceback (most recent call last):
File "/usr/lib/zope/lib/python/Testing/ZopeTestCase/profiler.py", line 80, in __call__
testMethod()
File "/mnt/erp5_cd/buildbot_slave/slave/full.bot_livecd/build/unit_test/Products/ERP5/tests/testInvoice.py", line 1160, in test_01_SimpleInvoice
sequence_list.play(self, quiet=quiet)
File "/mnt/erp5_cd/buildbot_slave/slave/full.bot_livecd/build/unit_test/Products/ERP5Type/tests/Sequence.py", line 163, in play
sequence.play(context, sequence_number=i, quiet=quiet)
File "/mnt/erp5_cd/buildbot_slave/slave/full.bot_livecd/build/unit_test/Products/ERP5Type/tests/Sequence.py", line 113, in play
step.play(context, sequence=self, quiet=quiet)
Current Sequence:
CreateEntities
CreateCurrency
> CreateSaleInvoiceTransactionRule
CreateOrder
SetOrderProfile
SetOrderPriceCurrency
CreateNotVariatedResource
Tic
CreateOrderLine
SetOrderLineResource
SetOrderLineDefaultValues
OrderOrder
Tic
CheckDeliveryBuilding
ConfirmOrder
Tic
CheckOrderRule
CheckOrderSimulation
CheckDeliveryBuilding
AddPackingListContainer
AddPackingListContainerLine
SetContainerLineFullQuantity
Tic
CheckPackingListIsPacked
SetReadyPackingList
Tic
StartPackingList
CheckInvoicingRule
Tic
CheckInvoiceBuilding
RebuildAndCheckNothingIsCreated
CheckInvoicesConsistency
File "/mnt/erp5_cd/buildbot_slave/slave/full.bot_livecd/build/unit_test/Products/ERP5Type/tests/Sequence.py", line 99, in play
method(sequence=sequence)
File "/mnt/erp5_cd/buildbot_slave/slave/full.bot_livecd/build/unit_test/Products/ERP5/tests/testInvoice.py", line 176, in stepCreateSaleInvoiceTransactionRule
'validate_action', wf_id='account_workflow')
File "/usr/lib/zope/lib/python/Products/CMFCore/WorkflowTool.py", line 301, in doActionFor
return self._invokeWithNotification(
File "/usr/lib/zope/lib/python/Products/CMFCore/WorkflowTool.py", line 616, in _invokeWithNotification
res = func(*args, **kw)
File "/usr/lib/zope/lib/python/Products/DCWorkflow/DCWorkflow.py", line 287, in doActionFor
self._changeStateOf(ob, tdef, kw)
File "/usr/lib/zope/lib/python/Products/DCWorkflow/DCWorkflow.py", line 472, in _changeStateOf
sdef = self._executeTransition(ob, tdef, kwargs)
File "/mnt/erp5_cd/buildbot_slave/slave/full.bot_livecd/build/unit_test/Products/ERP5Type/patches/DCWorkflow.py", line 315, in DCWorkflowDefinition_executeTransition
script(sci) # May throw an exception.
File "/usr/lib/zope/./build/build-base/python-2.4/build-lib/Shared/DC/Scripts/Bindings.py", line 306, in __call__
File "/usr/lib/zope/./build/build-base/python-2.4/build-lib/Shared/DC/Scripts/Bindings.py", line 343, in _bindAndExec
File "/mnt/erp5_cd/buildbot_slave/slave/full.bot_livecd/build/unit_test/Products/ERP5Type/tests/ERP5TypeTestCase.py", line 754, in _exec
return PythonScript_exec(self, *args)
File "/usr/lib/zope/./build/build-base/python-2.4/build-lib/Products/PythonScripts/PythonScript.py", line 323, in _exec
File "Script (Python)", line 1, in Account_Validate
File "/usr/lib/zope/./build/build-base/python-2.4/build-lib/Shared/DC/Scripts/Bindings.py", line 306, in __call__
File "/usr/lib/zope/./build/build-base/python-2.4/build-lib/Shared/DC/Scripts/Bindings.py", line 343, in _bindAndExec
File "/mnt/erp5_cd/buildbot_slave/slave/full.bot_livecd/build/unit_test/Products/ERP5Type/tests/ERP5TypeTestCase.py", line 754, in _exec
return PythonScript_exec(self, *args)
File "/usr/lib/zope/./build/build-base/python-2.4/build-lib/Products/PythonScripts/PythonScript.py", line 323, in _exec
File "Script (Python)", line 8, in Base_checkConsistency
ValidationFailed: Arity error for relation 'account_type' and portal_type: '('Category',)', arity is equal to 0 but should be between 1 and 1
ERROR: test_02_TwoInvoicesFromTwoPackingList (testInvoice.TestInvoice)
----------------------------------------------------------------------
Traceback (most recent call last):
File "/usr/lib/zope/lib/python/Testing/ZopeTestCase/profiler.py", line 80, in __call__
testMethod()
File "/mnt/erp5_cd/buildbot_slave/slave/full.bot_livecd/build/unit_test/Products/ERP5/tests/testInvoice.py", line 1194, in test_02_TwoInvoicesFromTwoPackingList
sequence_list.play(self, quiet=quiet)
File "/mnt/erp5_cd/buildbot_slave/slave/full.bot_livecd/build/unit_test/Products/ERP5Type/tests/Sequence.py", line 163, in play
sequence.play(context, sequence_number=i, quiet=quiet)
File "/mnt/erp5_cd/buildbot_slave/slave/full.bot_livecd/build/unit_test/Products/ERP5Type/tests/Sequence.py", line 113, in play
step.play(context, sequence=self, quiet=quiet)
Current Sequence:
CreateEntities
CreateCurrency
> CreateSaleInvoiceTransactionRule
CreateOrder
SetOrderProfile
SetOrderPriceCurrency
CreateNotVariatedResource
Tic
CreateOrderLine
SetOrderLineResource
SetOrderLineDefaultValues
OrderOrder
Tic
CheckDeliveryBuilding
ConfirmOrder
Tic
CheckOrderRule
CheckOrderSimulation
CheckDeliveryBuilding
DecreasePackingListLineQuantity
CheckPackingListIsCalculating
SplitAndDeferPackingList
Tic
CheckPackingListIsSolved
CheckPackingListSplitted
AddPackingListContainer
AddPackingListContainerLine
SetContainerLineFullQuantity
Tic
CheckPackingListIsPacked
DefineNewPackingListContainer
Tic
CheckNewPackingListIsPacked
SetReadyPackingList
SetReadyNewPackingList
Tic
StartPackingList
StartNewPackingList
Tic
CheckTwoInvoices
RemoveDateMovementGroupForTransactionBuilder
ConfirmTwoInvoices
Tic
CheckTwoInvoicesTransactionLines
CheckInvoicesConsistency
File "/mnt/erp5_cd/buildbot_slave/slave/full.bot_livecd/build/unit_test/Products/ERP5Type/tests/Sequence.py", line 99, in play
method(sequence=sequence)
File "/mnt/erp5_cd/buildbot_slave/slave/full.bot_livecd/build/unit_test/Products/ERP5/tests/testInvoice.py", line 176, in stepCreateSaleInvoiceTransactionRule
'validate_action', wf_id='account_workflow')
File "/usr/lib/zope/lib/python/Products/CMFCore/WorkflowTool.py", line 301, in doActionFor
return self._invokeWithNotification(
File "/usr/lib/zope/lib/python/Products/CMFCore/WorkflowTool.py", line 616, in _invokeWithNotification
res = func(*args, **kw)
File "/usr/lib/zope/lib/python/Products/DCWorkflow/DCWorkflow.py", line 287, in doActionFor
self._changeStateOf(ob, tdef, kw)
File "/usr/lib/zope/lib/python/Products/DCWorkflow/DCWorkflow.py", line 472, in _changeStateOf
sdef = self._executeTransition(ob, tdef, kwargs)
File "/mnt/erp5_cd/buildbot_slave/slave/full.bot_livecd/build/unit_test/Products/ERP5Type/patches/DCWorkflow.py", line 315, in DCWorkflowDefinition_executeTransition
script(sci) # May throw an exception.
File "/usr/lib/zope/./build/build-base/python-2.4/build-lib/Shared/DC/Scripts/Bindings.py", line 306, in __call__
File "/usr/lib/zope/./build/build-base/python-2.4/build-lib/Shared/DC/Scripts/Bindings.py", line 343, in _bindAndExec
File "/mnt/erp5_cd/buildbot_slave/slave/full.bot_livecd/build/unit_test/Products/ERP5Type/tests/ERP5TypeTestCase.py", line 754, in _exec
return PythonScript_exec(self, *args)
File "/usr/lib/zope/./build/build-base/python-2.4/build-lib/Products/PythonScripts/PythonScript.py", line 323, in _exec
File "Script (Python)", line 1, in Account_Validate
File "/usr/lib/zope/./build/build-base/python-2.4/build-lib/Shared/DC/Scripts/Bindings.py", line 306, in __call__
File "/usr/lib/zope/./build/build-base/python-2.4/build-lib/Shared/DC/Scripts/Bindings.py", line 343, in _bindAndExec
File "/mnt/erp5_cd/buildbot_slave/slave/full.bot_livecd/build/unit_test/Products/ERP5Type/tests/ERP5TypeTestCase.py", line 754, in _exec
return PythonScript_exec(self, *args)
File "/usr/lib/zope/./build/build-base/python-2.4/build-lib/Products/PythonScripts/PythonScript.py", line 323, in _exec
File "Script (Python)", line 8, in Base_checkConsistency
ValidationFailed: Arity error for relation 'account_type' and portal_type: '('Category',)', arity is equal to 0 but should be between 1 and 1
ERROR: test_03_InvoiceEditAndInvoiceRule (testInvoice.TestInvoice)
----------------------------------------------------------------------
Traceback (most recent call last):
File "/usr/lib/zope/lib/python/Testing/ZopeTestCase/profiler.py", line 80, in __call__
testMethod()
File "/mnt/erp5_cd/buildbot_slave/slave/full.bot_livecd/build/unit_test/Products/ERP5/tests/testInvoice.py", line 1226, in test_03_InvoiceEditAndInvoiceRule
sequence_list.play(self, quiet=quiet)
File "/mnt/erp5_cd/buildbot_slave/slave/full.bot_livecd/build/unit_test/Products/ERP5Type/tests/Sequence.py", line 163, in play
sequence.play(context, sequence_number=i, quiet=quiet)
File "/mnt/erp5_cd/buildbot_slave/slave/full.bot_livecd/build/unit_test/Products/ERP5Type/tests/Sequence.py", line 113, in play
step.play(context, sequence=self, quiet=quiet)
Current Sequence:
CreateEntities
CreateCurrency
> CreateSaleInvoiceTransactionRule
CreateOrder
SetOrderProfile
SetOrderPriceCurrency
CreateNotVariatedResource
Tic
CreateOrderLine
SetOrderLineResource
SetOrderLineDefaultValues
OrderOrder
Tic
CheckDeliveryBuilding
ConfirmOrder
Tic
CheckOrderRule
CheckOrderSimulation
CheckDeliveryBuilding
AddPackingListContainer
AddPackingListContainerLine
SetContainerLineFullQuantity
Tic
CheckPackingListIsPacked
SetReadyPackingList
Tic
StartPackingList
CheckInvoicingRule
Tic
CheckInvoiceBuilding
EditInvoice
CheckInvoiceRuleNotAppliedOnInvoiceEdit
CheckInvoicesConsistency
File "/mnt/erp5_cd/buildbot_slave/slave/full.bot_livecd/build/unit_test/Products/ERP5Type/tests/Sequence.py", line 99, in play
method(sequence=sequence)
File "/mnt/erp5_cd/buildbot_slave/slave/full.bot_livecd/build/unit_test/Products/ERP5/tests/testInvoice.py", line 176, in stepCreateSaleInvoiceTransactionRule
'validate_action', wf_id='account_workflow')
File "/usr/lib/zope/lib/python/Products/CMFCore/WorkflowTool.py", line 301, in doActionFor
return self._invokeWithNotification(
File "/usr/lib/zope/lib/python/Products/CMFCore/WorkflowTool.py", line 616, in _invokeWithNotification
res = func(*args, **kw)
File "/usr/lib/zope/lib/python/Products/DCWorkflow/DCWorkflow.py", line 287, in doActionFor
self._changeStateOf(ob, tdef, kw)
File "/usr/lib/zope/lib/python/Products/DCWorkflow/DCWorkflow.py", line 472, in _changeStateOf
sdef = self._executeTransition(ob, tdef, kwargs)
File "/mnt/erp5_cd/buildbot_slave/slave/full.bot_livecd/build/unit_test/Products/ERP5Type/patches/DCWorkflow.py", line 315, in DCWorkflowDefinition_executeTransition
script(sci) # May throw an exception.
File "/usr/lib/zope/./build/build-base/python-2.4/build-lib/Shared/DC/Scripts/Bindings.py", line 306, in __call__
File "/usr/lib/zope/./build/build-base/python-2.4/build-lib/Shared/DC/Scripts/Bindings.py", line 343, in _bindAndExec
File "/mnt/erp5_cd/buildbot_slave/slave/full.bot_livecd/build/unit_test/Products/ERP5Type/tests/ERP5TypeTestCase.py", line 754, in _exec
return PythonScript_exec(self, *args)
File "/usr/lib/zope/./build/build-base/python-2.4/build-lib/Products/PythonScripts/PythonScript.py", line 323, in _exec
File "Script (Python)", line 1, in Account_Validate
File "/usr/lib/zope/./build/build-base/python-2.4/build-lib/Shared/DC/Scripts/Bindings.py", line 306, in __call__
File "/usr/lib/zope/./build/build-base/python-2.4/build-lib/Shared/DC/Scripts/Bindings.py", line 343, in _bindAndExec
File "/mnt/erp5_cd/buildbot_slave/slave/full.bot_livecd/build/unit_test/Products/ERP5Type/tests/ERP5TypeTestCase.py", line 754, in _exec
return PythonScript_exec(self, *args)
File "/usr/lib/zope/./build/build-base/python-2.4/build-lib/Products/PythonScripts/PythonScript.py", line 323, in _exec
File "Script (Python)", line 8, in Base_checkConsistency
ValidationFailed: Arity error for relation 'account_type' and portal_type: '('Category',)', arity is equal to 0 but should be between 1 and 1
ERROR: test_04_PackingListEditAndInvoiceRule (testInvoice.TestInvoice)
----------------------------------------------------------------------
Traceback (most recent call last):
File "/usr/lib/zope/lib/python/Testing/ZopeTestCase/profiler.py", line 80, in __call__
testMethod()
File "/mnt/erp5_cd/buildbot_slave/slave/full.bot_livecd/build/unit_test/Products/ERP5/tests/testInvoice.py", line 1246, in test_04_PackingListEditAndInvoiceRule
sequence_list.play(self, quiet=quiet)
File "/mnt/erp5_cd/buildbot_slave/slave/full.bot_livecd/build/unit_test/Products/ERP5Type/tests/Sequence.py", line 163, in play
sequence.play(context, sequence_number=i, quiet=quiet)
File "/mnt/erp5_cd/buildbot_slave/slave/full.bot_livecd/build/unit_test/Products/ERP5Type/tests/Sequence.py", line 113, in play
step.play(context, sequence=self, quiet=quiet)
Current Sequence:
CreateEntities
CreateCurrency
> CreateSaleInvoiceTransactionRule
CreateOrder
SetOrderProfile
SetOrderPriceCurrency
CreateNotVariatedResource
Tic
CreateOrderLine
SetOrderLineResource
SetOrderLineDefaultValues
OrderOrder
Tic
CheckDeliveryBuilding
ConfirmOrder
Tic
CheckOrderRule
CheckOrderSimulation
CheckDeliveryBuilding
AddPackingListContainer
AddPackingListContainerLine
SetContainerLineFullQuantity
Tic
CheckPackingListIsPacked
EditPackingList
CheckDeliveryRuleNotAppliedOnPackingListEdit
CheckInvoicesConsistency
File "/mnt/erp5_cd/buildbot_slave/slave/full.bot_livecd/build/unit_test/Products/ERP5Type/tests/Sequence.py", line 99, in play
method(sequence=sequence)
File "/mnt/erp5_cd/buildbot_slave/slave/full.bot_livecd/build/unit_test/Products/ERP5/tests/testInvoice.py", line 176, in stepCreateSaleInvoiceTransactionRule
'validate_action', wf_id='account_workflow')
File "/usr/lib/zope/lib/python/Products/CMFCore/WorkflowTool.py", line 301, in doActionFor
return self._invokeWithNotification(
File "/usr/lib/zope/lib/python/Products/CMFCore/WorkflowTool.py", line 616, in _invokeWithNotification
res = func(*args, **kw)
File "/usr/lib/zope/lib/python/Products/DCWorkflow/DCWorkflow.py", line 287, in doActionFor
self._changeStateOf(ob, tdef, kw)
File "/usr/lib/zope/lib/python/Products/DCWorkflow/DCWorkflow.py", line 472, in _changeStateOf
sdef = self._executeTransition(ob, tdef, kwargs)
File "/mnt/erp5_cd/buildbot_slave/slave/full.bot_livecd/build/unit_test/Products/ERP5Type/patches/DCWorkflow.py", line 315, in DCWorkflowDefinition_executeTransition
script(sci) # May throw an exception.
File "/usr/lib/zope/./build/build-base/python-2.4/build-lib/Shared/DC/Scripts/Bindings.py", line 306, in __call__
File "/usr/lib/zope/./build/build-base/python-2.4/build-lib/Shared/DC/Scripts/Bindings.py", line 343, in _bindAndExec
File "/mnt/erp5_cd/buildbot_slave/slave/full.bot_livecd/build/unit_test/Products/ERP5Type/tests/ERP5TypeTestCase.py", line 754, in _exec
return PythonScript_exec(self, *args)
File "/usr/lib/zope/./build/build-base/python-2.4/build-lib/Products/PythonScripts/PythonScript.py", line 323, in _exec
File "Script (Python)", line 1, in Account_Validate
File "/usr/lib/zope/./build/build-base/python-2.4/build-lib/Shared/DC/Scripts/Bindings.py", line 306, in __call__
File "/usr/lib/zope/./build/build-base/python-2.4/build-lib/Shared/DC/Scripts/Bindings.py", line 343, in _bindAndExec
File "/mnt/erp5_cd/buildbot_slave/slave/full.bot_livecd/build/unit_test/Products/ERP5Type/tests/ERP5TypeTestCase.py", line 754, in _exec
return PythonScript_exec(self, *args)
File "/usr/lib/zope/./build/build-base/python-2.4/build-lib/Products/PythonScripts/PythonScript.py", line 323, in _exec
File "Script (Python)", line 8, in Base_checkConsistency
ValidationFailed: Arity error for relation 'account_type' and portal_type: '('Category',)', arity is equal to 0 but should be between 1 and 1
ERROR: test_05_InvoiceEditPackingListLine (testInvoice.TestInvoice)
----------------------------------------------------------------------
Traceback (most recent call last):
File "/usr/lib/zope/lib/python/Testing/ZopeTestCase/profiler.py", line 80, in __call__
testMethod()
File "/mnt/erp5_cd/buildbot_slave/slave/full.bot_livecd/build/unit_test/Products/ERP5/tests/testInvoice.py", line 1271, in test_05_InvoiceEditPackingListLine
sequence_list.play(self, quiet=quiet)
File "/mnt/erp5_cd/buildbot_slave/slave/full.bot_livecd/build/unit_test/Products/ERP5Type/tests/Sequence.py", line 163, in play
sequence.play(context, sequence_number=i, quiet=quiet)
File "/mnt/erp5_cd/buildbot_slave/slave/full.bot_livecd/build/unit_test/Products/ERP5Type/tests/Sequence.py", line 113, in play
step.play(context, sequence=self, quiet=quiet)
Current Sequence:
CreateEntities
CreateCurrency
> CreateSaleInvoiceTransactionRule
CreateOrder
SetOrderProfile
SetOrderPriceCurrency
CreateNotVariatedResource
Tic
CreateOrderLine
SetOrderLineResource
SetOrderLineDefaultValues
OrderOrder
Tic
CheckDeliveryBuilding
ConfirmOrder
Tic
CheckOrderRule
CheckOrderSimulation
CheckDeliveryBuilding
AddPackingListContainer
AddPackingListContainerLine
SetContainerLineFullQuantity
Tic
CheckPackingListIsPacked
EditPackingListLine
SetReadyPackingList
Tic
StartPackingList
CheckInvoicingRule
Tic
CheckInvoiceBuilding
RebuildAndCheckNothingIsCreated
CheckInvoicesConsistency
File "/mnt/erp5_cd/buildbot_slave/slave/full.bot_livecd/build/unit_test/Products/ERP5Type/tests/Sequence.py", line 99, in play
method(sequence=sequence)
File "/mnt/erp5_cd/buildbot_slave/slave/full.bot_livecd/build/unit_test/Products/ERP5/tests/testInvoice.py", line 176, in stepCreateSaleInvoiceTransactionRule
'validate_action', wf_id='account_workflow')
File "/usr/lib/zope/lib/python/Products/CMFCore/WorkflowTool.py", line 301, in doActionFor
return self._invokeWithNotification(
File "/usr/lib/zope/lib/python/Products/CMFCore/WorkflowTool.py", line 616, in _invokeWithNotification
res = func(*args, **kw)
File "/usr/lib/zope/lib/python/Products/DCWorkflow/DCWorkflow.py", line 287, in doActionFor
self._changeStateOf(ob, tdef, kw)
File "/usr/lib/zope/lib/python/Products/DCWorkflow/DCWorkflow.py", line 472, in _changeStateOf
sdef = self._executeTransition(ob, tdef, kwargs)
File "/mnt/erp5_cd/buildbot_slave/slave/full.bot_livecd/build/unit_test/Products/ERP5Type/patches/DCWorkflow.py", line 315, in DCWorkflowDefinition_executeTransition
script(sci) # May throw an exception.
File "/usr/lib/zope/./build/build-base/python-2.4/build-lib/Shared/DC/Scripts/Bindings.py", line 306, in __call__
File "/usr/lib/zope/./build/build-base/python-2.4/build-lib/Shared/DC/Scripts/Bindings.py", line 343, in _bindAndExec
File "/mnt/erp5_cd/buildbot_slave/slave/full.bot_livecd/build/unit_test/Products/ERP5Type/tests/ERP5TypeTestCase.py", line 754, in _exec
return PythonScript_exec(self, *args)
File "/usr/lib/zope/./build/build-base/python-2.4/build-lib/Products/PythonScripts/PythonScript.py", line 323, in _exec
File "Script (Python)", line 1, in Account_Validate
File "/usr/lib/zope/./build/build-base/python-2.4/build-lib/Shared/DC/Scripts/Bindings.py", line 306, in __call__
File "/usr/lib/zope/./build/build-base/python-2.4/build-lib/Shared/DC/Scripts/Bindings.py", line 343, in _bindAndExec
File "/mnt/erp5_cd/buildbot_slave/slave/full.bot_livecd/build/unit_test/Products/ERP5Type/tests/ERP5TypeTestCase.py", line 754, in _exec
return PythonScript_exec(self, *args)
File "/usr/lib/zope/./build/build-base/python-2.4/build-lib/Products/PythonScripts/PythonScript.py", line 323, in _exec
File "Script (Python)", line 8, in Base_checkConsistency
ValidationFailed: Arity error for relation 'account_type' and portal_type: '('Category',)', arity is equal to 0 but should be between 1 and 1
ERROR: test_06_InvoiceDeletePackingListLine (testInvoice.TestInvoice)
----------------------------------------------------------------------
Traceback (most recent call last):
File "/usr/lib/zope/lib/python/Testing/ZopeTestCase/profiler.py", line 80, in __call__
testMethod()
File "/mnt/erp5_cd/buildbot_slave/slave/full.bot_livecd/build/unit_test/Products/ERP5/tests/testInvoice.py", line 1297, in test_06_InvoiceDeletePackingListLine
sequence_list.play(self, quiet=quiet)
File "/mnt/erp5_cd/buildbot_slave/slave/full.bot_livecd/build/unit_test/Products/ERP5Type/tests/Sequence.py", line 163, in play
sequence.play(context, sequence_number=i, quiet=quiet)
File "/mnt/erp5_cd/buildbot_slave/slave/full.bot_livecd/build/unit_test/Products/ERP5Type/tests/Sequence.py", line 113, in play
step.play(context, sequence=self, quiet=quiet)
Current Sequence:
CreateEntities
CreateCurrency
> CreateSaleInvoiceTransactionRule
CreateOrder
SetOrderProfile
SetOrderPriceCurrency
CreateNotVariatedResource
Tic
CreateOrderLine
SetOrderLineResource
SetOrderLineDefaultValues
CreateNotVariatedResource
Tic
CreateOrderLine
SetOrderLineResource
SetOrderLineDefaultValues
OrderOrder
Tic
CheckDeliveryBuilding
ConfirmOrder
Tic
CheckOrderRule
CheckOrderSimulation
CheckDeliveryBuilding
AddPackingListContainer
AddPackingListContainerLine
Tic
SetContainerFullQuantity
Tic
CheckPackingListIsPacked
DeletePackingListLine
SetReadyPackingList
Tic
StartPackingList
CheckInvoicingRule
Tic
CheckInvoiceBuilding
RebuildAndCheckNothingIsCreated
CheckInvoicesConsistency
File "/mnt/erp5_cd/buildbot_slave/slave/full.bot_livecd/build/unit_test/Products/ERP5Type/tests/Sequence.py", line 99, in play
method(sequence=sequence)
File "/mnt/erp5_cd/buildbot_slave/slave/full.bot_livecd/build/unit_test/Products/ERP5/tests/testInvoice.py", line 176, in stepCreateSaleInvoiceTransactionRule
'validate_action', wf_id='account_workflow')
File "/usr/lib/zope/lib/python/Products/CMFCore/WorkflowTool.py", line 301, in doActionFor
return self._invokeWithNotification(
File "/usr/lib/zope/lib/python/Products/CMFCore/WorkflowTool.py", line 616, in _invokeWithNotification
res = func(*args, **kw)
File "/usr/lib/zope/lib/python/Products/DCWorkflow/DCWorkflow.py", line 287, in doActionFor
self._changeStateOf(ob, tdef, kw)
File "/usr/lib/zope/lib/python/Products/DCWorkflow/DCWorkflow.py", line 472, in _changeStateOf
sdef = self._executeTransition(ob, tdef, kwargs)
File "/mnt/erp5_cd/buildbot_slave/slave/full.bot_livecd/build/unit_test/Products/ERP5Type/patches/DCWorkflow.py", line 315, in DCWorkflowDefinition_executeTransition
script(sci) # May throw an exception.
File "/usr/lib/zope/./build/build-base/python-2.4/build-lib/Shared/DC/Scripts/Bindings.py", line 306, in __call__
File "/usr/lib/zope/./build/build-base/python-2.4/build-lib/Shared/DC/Scripts/Bindings.py", line 343, in _bindAndExec
File "/mnt/erp5_cd/buildbot_slave/slave/full.bot_livecd/build/unit_test/Products/ERP5Type/tests/ERP5TypeTestCase.py", line 754, in _exec
return PythonScript_exec(self, *args)
File "/usr/lib/zope/./build/build-base/python-2.4/build-lib/Products/PythonScripts/PythonScript.py", line 323, in _exec
File "Script (Python)", line 1, in Account_Validate
File "/usr/lib/zope/./build/build-base/python-2.4/build-lib/Shared/DC/Scripts/Bindings.py", line 306, in __call__
File "/usr/lib/zope/./build/build-base/python-2.4/build-lib/Shared/DC/Scripts/Bindings.py", line 343, in _bindAndExec
File "/mnt/erp5_cd/buildbot_slave/slave/full.bot_livecd/build/unit_test/Products/ERP5Type/tests/ERP5TypeTestCase.py", line 754, in _exec
return PythonScript_exec(self, *args)
File "/usr/lib/zope/./build/build-base/python-2.4/build-lib/Products/PythonScripts/PythonScript.py", line 323, in _exec
File "Script (Python)", line 8, in Base_checkConsistency
ValidationFailed: Arity error for relation 'account_type' and portal_type: '('Category',)', arity is equal to 0 but should be between 1 and 1
ERROR: test_07_InvoiceAddPackingListLine (testInvoice.TestInvoice)
----------------------------------------------------------------------
Traceback (most recent call last):
File "/usr/lib/zope/lib/python/Testing/ZopeTestCase/profiler.py", line 80, in __call__
testMethod()
File "/mnt/erp5_cd/buildbot_slave/slave/full.bot_livecd/build/unit_test/Products/ERP5/tests/testInvoice.py", line 1325, in test_07_InvoiceAddPackingListLine
sequence_list.play(self, quiet=quiet)
File "/mnt/erp5_cd/buildbot_slave/slave/full.bot_livecd/build/unit_test/Products/ERP5Type/tests/Sequence.py", line 163, in play
sequence.play(context, sequence_number=i, quiet=quiet)
File "/mnt/erp5_cd/buildbot_slave/slave/full.bot_livecd/build/unit_test/Products/ERP5Type/tests/Sequence.py", line 113, in play
step.play(context, sequence=self, quiet=quiet)
Current Sequence:
CreateEntities
CreateCurrency
> CreateSaleInvoiceTransactionRule
CreateOrder
SetOrderProfile
SetOrderPriceCurrency
CreateNotVariatedResource
Tic
CreateOrderLine
SetOrderLineResource
SetOrderLineDefaultValues
OrderOrder
Tic
CheckDeliveryBuilding
ConfirmOrder
Tic
CheckOrderRule
CheckOrderSimulation
CheckDeliveryBuilding
AddPackingListContainer
AddPackingListContainerLine
SetContainerLineFullQuantity
Tic
CheckPackingListIsPacked
AddPackingListLine
SetContainerFullQuantity
Tic
SetReadyPackingList
Tic
StartPackingList
CheckInvoicingRule
Tic
CheckInvoiceBuilding
RebuildAndCheckNothingIsCreated
CheckInvoicesConsistency
File "/mnt/erp5_cd/buildbot_slave/slave/full.bot_livecd/build/unit_test/Products/ERP5Type/tests/Sequence.py", line 99, in play
method(sequence=sequence)
File "/mnt/erp5_cd/buildbot_slave/slave/full.bot_livecd/build/unit_test/Products/ERP5/tests/testInvoice.py", line 176, in stepCreateSaleInvoiceTransactionRule
'validate_action', wf_id='account_workflow')
File "/usr/lib/zope/lib/python/Products/CMFCore/WorkflowTool.py", line 301, in doActionFor
return self._invokeWithNotification(
File "/usr/lib/zope/lib/python/Products/CMFCore/WorkflowTool.py", line 616, in _invokeWithNotification
res = func(*args, **kw)
File "/usr/lib/zope/lib/python/Products/DCWorkflow/DCWorkflow.py", line 287, in doActionFor
self._changeStateOf(ob, tdef, kw)
File "/usr/lib/zope/lib/python/Products/DCWorkflow/DCWorkflow.py", line 472, in _changeStateOf
sdef = self._executeTransition(ob, tdef, kwargs)
File "/mnt/erp5_cd/buildbot_slave/slave/full.bot_livecd/build/unit_test/Products/ERP5Type/patches/DCWorkflow.py", line 315, in DCWorkflowDefinition_executeTransition
script(sci) # May throw an exception.
File "/usr/lib/zope/./build/build-base/python-2.4/build-lib/Shared/DC/Scripts/Bindings.py", line 306, in __call__
File "/usr/lib/zope/./build/build-base/python-2.4/build-lib/Shared/DC/Scripts/Bindings.py", line 343, in _bindAndExec
File "/mnt/erp5_cd/buildbot_slave/slave/full.bot_livecd/build/unit_test/Products/ERP5Type/tests/ERP5TypeTestCase.py", line 754, in _exec
return PythonScript_exec(self, *args)
File "/usr/lib/zope/./build/build-base/python-2.4/build-lib/Products/PythonScripts/PythonScript.py", line 323, in _exec
File "Script (Python)", line 1, in Account_Validate
File "/usr/lib/zope/./build/build-base/python-2.4/build-lib/Shared/DC/Scripts/Bindings.py", line 306, in __call__
File "/usr/lib/zope/./build/build-base/python-2.4/build-lib/Shared/DC/Scripts/Bindings.py", line 343, in _bindAndExec
File "/mnt/erp5_cd/buildbot_slave/slave/full.bot_livecd/build/unit_test/Products/ERP5Type/tests/ERP5TypeTestCase.py", line 754, in _exec
return PythonScript_exec(self, *args)
File "/usr/lib/zope/./build/build-base/python-2.4/build-lib/Products/PythonScripts/PythonScript.py", line 323, in _exec
File "Script (Python)", line 8, in Base_checkConsistency
ValidationFailed: Arity error for relation 'account_type' and portal_type: '('Category',)', arity is equal to 0 but should be between 1 and 1
ERROR: test_08_InvoiceDecreaseQuantity (testInvoice.TestInvoice)
----------------------------------------------------------------------
Traceback (most recent call last):
File "/usr/lib/zope/lib/python/Testing/ZopeTestCase/profiler.py", line 80, in __call__
testMethod()
File "/mnt/erp5_cd/buildbot_slave/slave/full.bot_livecd/build/unit_test/Products/ERP5/tests/testInvoice.py", line 1363, in test_08_InvoiceDecreaseQuantity
self.playSequence(sequence, quiet=quiet)
File "/mnt/erp5_cd/buildbot_slave/slave/full.bot_livecd/build/unit_test/Products/ERP5/tests/testAccountingRules.py", line 102, in playSequence
sequence_list.play(self, quiet=quiet)
File "/mnt/erp5_cd/buildbot_slave/slave/full.bot_livecd/build/unit_test/Products/ERP5Type/tests/Sequence.py", line 163, in play
sequence.play(context, sequence_number=i, quiet=quiet)
File "/mnt/erp5_cd/buildbot_slave/slave/full.bot_livecd/build/unit_test/Products/ERP5Type/tests/Sequence.py", line 113, in play
step.play(context, sequence=self, quiet=quiet)
Current Sequence:
CreateEntities
CreateCurrency
> CreateSaleInvoiceTransactionRule
CreateOrder
SetOrderProfile
SetOrderPriceCurrency
CreateNotVariatedResource
Tic
CreateOrderLine
SetOrderLineResource
SetOrderLineDefaultValues
OrderOrder
Tic
CheckDeliveryBuilding
ConfirmOrder
Tic
CheckOrderRule
CheckOrderSimulation
CheckDeliveryBuilding
AddPackingListContainer
AddPackingListContainerLine
SetContainerLineFullQuantity
Tic
CheckPackingListIsPacked
SetReadyPackingList
Tic
StartPackingList
CheckInvoicingRule
CheckInvoiceTransactionRule
Tic
CheckInvoiceBuilding
DecreaseInvoiceLineQuantity
CheckInvoiceIsDivergent
CheckInvoiceIsCalculating
SplitAndDeferInvoice
Tic
CheckInvoiceIsNotDivergent
CheckInvoiceIsSolved
CheckInvoiceSplitted
CheckPackingListIsNotDivergent
CheckPackingListIsSolved
CheckInvoiceTransactionRule
RebuildAndCheckNothingIsCreated
CheckInvoicesConsistency
File "/mnt/erp5_cd/buildbot_slave/slave/full.bot_livecd/build/unit_test/Products/ERP5Type/tests/Sequence.py", line 99, in play
method(sequence=sequence)
File "/mnt/erp5_cd/buildbot_slave/slave/full.bot_livecd/build/unit_test/Products/ERP5/tests/testInvoice.py", line 176, in stepCreateSaleInvoiceTransactionRule
'validate_action', wf_id='account_workflow')
File "/usr/lib/zope/lib/python/Products/CMFCore/WorkflowTool.py", line 301, in doActionFor
return self._invokeWithNotification(
File "/usr/lib/zope/lib/python/Products/CMFCore/WorkflowTool.py", line 616, in _invokeWithNotification
res = func(*args, **kw)
File "/usr/lib/zope/lib/python/Products/DCWorkflow/DCWorkflow.py", line 287, in doActionFor
self._changeStateOf(ob, tdef, kw)
File "/usr/lib/zope/lib/python/Products/DCWorkflow/DCWorkflow.py", line 472, in _changeStateOf
sdef = self._executeTransition(ob, tdef, kwargs)
File "/mnt/erp5_cd/buildbot_slave/slave/full.bot_livecd/build/unit_test/Products/ERP5Type/patches/DCWorkflow.py", line 315, in DCWorkflowDefinition_executeTransition
script(sci) # May throw an exception.
File "/usr/lib/zope/./build/build-base/python-2.4/build-lib/Shared/DC/Scripts/Bindings.py", line 306, in __call__
File "/usr/lib/zope/./build/build-base/python-2.4/build-lib/Shared/DC/Scripts/Bindings.py", line 343, in _bindAndExec
File "/mnt/erp5_cd/buildbot_slave/slave/full.bot_livecd/build/unit_test/Products/ERP5Type/tests/ERP5TypeTestCase.py", line 754, in _exec
return PythonScript_exec(self, *args)
File "/usr/lib/zope/./build/build-base/python-2.4/build-lib/Products/PythonScripts/PythonScript.py", line 323, in _exec
File "Script (Python)", line 1, in Account_Validate
File "/usr/lib/zope/./build/build-base/python-2.4/build-lib/Shared/DC/Scripts/Bindings.py", line 306, in __call__
File "/usr/lib/zope/./build/build-base/python-2.4/build-lib/Shared/DC/Scripts/Bindings.py", line 343, in _bindAndExec
File "/mnt/erp5_cd/buildbot_slave/slave/full.bot_livecd/build/unit_test/Products/ERP5Type/tests/ERP5TypeTestCase.py", line 754, in _exec
return PythonScript_exec(self, *args)
File "/usr/lib/zope/./build/build-base/python-2.4/build-lib/Products/PythonScripts/PythonScript.py", line 323, in _exec
File "Script (Python)", line 8, in Base_checkConsistency
ValidationFailed: Arity error for relation 'account_type' and portal_type: '('Category',)', arity is equal to 0 but should be between 1 and 1
ERROR: test_09_InvoiceChangeStartDateFail (testInvoice.TestInvoice)
----------------------------------------------------------------------
Traceback (most recent call last):
File "/usr/lib/zope/lib/python/Testing/ZopeTestCase/profiler.py", line 80, in __call__
testMethod()
File "/mnt/erp5_cd/buildbot_slave/slave/full.bot_livecd/build/unit_test/Products/ERP5/tests/testInvoice.py", line 1397, in test_09_InvoiceChangeStartDateFail
self.playSequence(sequence, quiet=quiet)
File "/mnt/erp5_cd/buildbot_slave/slave/full.bot_livecd/build/unit_test/Products/ERP5/tests/testAccountingRules.py", line 102, in playSequence
sequence_list.play(self, quiet=quiet)
File "/mnt/erp5_cd/buildbot_slave/slave/full.bot_livecd/build/unit_test/Products/ERP5Type/tests/Sequence.py", line 163, in play
sequence.play(context, sequence_number=i, quiet=quiet)
File "/mnt/erp5_cd/buildbot_slave/slave/full.bot_livecd/build/unit_test/Products/ERP5Type/tests/Sequence.py", line 113, in play
step.play(context, sequence=self, quiet=quiet)
Current Sequence:
CreateEntities
CreateCurrency
> CreateSaleInvoiceTransactionRule
CreateOrder
SetOrderProfile
SetOrderPriceCurrency
CreateNotVariatedResource
Tic
CreateOrderLine
SetOrderLineResource
SetOrderLineDefaultValues
OrderOrder
Tic
CheckDeliveryBuilding
ConfirmOrder
Tic
CheckOrderRule
CheckOrderSimulation
CheckDeliveryBuilding
AddPackingListContainer
AddPackingListContainerLine
SetContainerLineFullQuantity
Tic
CheckPackingListIsPacked
SetReadyPackingList
Tic
StartPackingList
CheckInvoicingRule
CheckInvoiceTransactionRule
Tic
CheckInvoiceBuilding
ChangeInvoiceStartDate
CheckInvoiceIsDivergent
CheckInvoiceIsCalculating
AcceptDecisionInvoice
Tic
CheckInvoiceNotSplitted
CheckInvoiceIsNotDivergent
CheckInvoiceIsSolved
CheckPackingListIsDivergent
File "/mnt/erp5_cd/buildbot_slave/slave/full.bot_livecd/build/unit_test/Products/ERP5Type/tests/Sequence.py", line 99, in play
method(sequence=sequence)
File "/mnt/erp5_cd/buildbot_slave/slave/full.bot_livecd/build/unit_test/Products/ERP5/tests/testInvoice.py", line 176, in stepCreateSaleInvoiceTransactionRule
'validate_action', wf_id='account_workflow')
File "/usr/lib/zope/lib/python/Products/CMFCore/WorkflowTool.py", line 301, in doActionFor
return self._invokeWithNotification(
File "/usr/lib/zope/lib/python/Products/CMFCore/WorkflowTool.py", line 616, in _invokeWithNotification
res = func(*args, **kw)
File "/usr/lib/zope/lib/python/Products/DCWorkflow/DCWorkflow.py", line 287, in doActionFor
self._changeStateOf(ob, tdef, kw)
File "/usr/lib/zope/lib/python/Products/DCWorkflow/DCWorkflow.py", line 472, in _changeStateOf
sdef = self._executeTransition(ob, tdef, kwargs)
File "/mnt/erp5_cd/buildbot_slave/slave/full.bot_livecd/build/unit_test/Products/ERP5Type/patches/DCWorkflow.py", line 315, in DCWorkflowDefinition_executeTransition
script(sci) # May throw an exception.
File "/usr/lib/zope/./build/build-base/python-2.4/build-lib/Shared/DC/Scripts/Bindings.py", line 306, in __call__
File "/usr/lib/zope/./build/build-base/python-2.4/build-lib/Shared/DC/Scripts/Bindings.py", line 343, in _bindAndExec
File "/mnt/erp5_cd/buildbot_slave/slave/full.bot_livecd/build/unit_test/Products/ERP5Type/tests/ERP5TypeTestCase.py", line 754, in _exec
return PythonScript_exec(self, *args)
File "/usr/lib/zope/./build/build-base/python-2.4/build-lib/Products/PythonScripts/PythonScript.py", line 323, in _exec
File "Script (Python)", line 1, in Account_Validate
File "/usr/lib/zope/./build/build-base/python-2.4/build-lib/Shared/DC/Scripts/Bindings.py", line 306, in __call__
File "/usr/lib/zope/./build/build-base/python-2.4/build-lib/Shared/DC/Scripts/Bindings.py", line 343, in _bindAndExec
File "/mnt/erp5_cd/buildbot_slave/slave/full.bot_livecd/build/unit_test/Products/ERP5Type/tests/ERP5TypeTestCase.py", line 754, in _exec
return PythonScript_exec(self, *args)
File "/usr/lib/zope/./build/build-base/python-2.4/build-lib/Products/PythonScripts/PythonScript.py", line 323, in _exec
File "Script (Python)", line 8, in Base_checkConsistency
ValidationFailed: Arity error for relation 'account_type' and portal_type: '('Category',)', arity is equal to 0 but should be between 1 and 1
ERROR: test_09b_InvoiceChangeStartDateSucceed (testInvoice.TestInvoice)
----------------------------------------------------------------------
Traceback (most recent call last):
File "/usr/lib/zope/lib/python/Testing/ZopeTestCase/profiler.py", line 80, in __call__
testMethod()
File "/mnt/erp5_cd/buildbot_slave/slave/full.bot_livecd/build/unit_test/Products/ERP5/tests/testInvoice.py", line 1441, in test_09b_InvoiceChangeStartDateSucceed
self.playSequence(sequence, quiet=quiet)
File "/mnt/erp5_cd/buildbot_slave/slave/full.bot_livecd/build/unit_test/Products/ERP5/tests/testAccountingRules.py", line 102, in playSequence
sequence_list.play(self, quiet=quiet)
File "/mnt/erp5_cd/buildbot_slave/slave/full.bot_livecd/build/unit_test/Products/ERP5Type/tests/Sequence.py", line 163, in play
sequence.play(context, sequence_number=i, quiet=quiet)
File "/mnt/erp5_cd/buildbot_slave/slave/full.bot_livecd/build/unit_test/Products/ERP5Type/tests/Sequence.py", line 113, in play
step.play(context, sequence=self, quiet=quiet)
Current Sequence:
CreateEntities
CreateCurrency
> CreateSaleInvoiceTransactionRule
CreateOrder
SetOrderProfile
SetOrderPriceCurrency
CreateNotVariatedResource
Tic
CreateOrderLine
SetOrderLineResource
SetOrderLineDefaultValues
OrderOrder
Tic
CheckDeliveryBuilding
ConfirmOrder
Tic
CheckOrderRule
CheckOrderSimulation
CheckDeliveryBuilding
AddPackingListContainer
AddPackingListContainerLine
SetContainerLineFullQuantity
Tic
CheckPackingListIsPacked
SetReadyPackingList
Tic
StartPackingList
CheckInvoicingRule
CheckInvoiceTransactionRule
Tic
CheckInvoiceBuilding
StopPackingList
Tic
DeliverPackingList
Tic
ChangeInvoiceStartDate
CheckInvoiceIsDivergent
CheckInvoiceIsCalculating
AcceptDecisionInvoice
Tic
CheckInvoiceNotSplitted
CheckInvoiceIsNotDivergent
CheckInvoiceIsSolved
CheckPackingListIsNotDivergent
CheckPackingListIsSolved
CheckInvoiceTransactionRule
RebuildAndCheckNothingIsCreated
CheckInvoicesConsistency
File "/mnt/erp5_cd/buildbot_slave/slave/full.bot_livecd/build/unit_test/Products/ERP5Type/tests/Sequence.py", line 99, in play
method(sequence=sequence)
File "/mnt/erp5_cd/buildbot_slave/slave/full.bot_livecd/build/unit_test/Products/ERP5/tests/testInvoice.py", line 176, in stepCreateSaleInvoiceTransactionRule
'validate_action', wf_id='account_workflow')
File "/usr/lib/zope/lib/python/Products/CMFCore/WorkflowTool.py", line 301, in doActionFor
return self._invokeWithNotification(
File "/usr/lib/zope/lib/python/Products/CMFCore/WorkflowTool.py", line 616, in _invokeWithNotification
res = func(*args, **kw)
File "/usr/lib/zope/lib/python/Products/DCWorkflow/DCWorkflow.py", line 287, in doActionFor
self._changeStateOf(ob, tdef, kw)
File "/usr/lib/zope/lib/python/Products/DCWorkflow/DCWorkflow.py", line 472, in _changeStateOf
sdef = self._executeTransition(ob, tdef, kwargs)
File "/mnt/erp5_cd/buildbot_slave/slave/full.bot_livecd/build/unit_test/Products/ERP5Type/patches/DCWorkflow.py", line 315, in DCWorkflowDefinition_executeTransition
script(sci) # May throw an exception.
File "/usr/lib/zope/./build/build-base/python-2.4/build-lib/Shared/DC/Scripts/Bindings.py", line 306, in __call__
File "/usr/lib/zope/./build/build-base/python-2.4/build-lib/Shared/DC/Scripts/Bindings.py", line 343, in _bindAndExec
File "/mnt/erp5_cd/buildbot_slave/slave/full.bot_livecd/build/unit_test/Products/ERP5Type/tests/ERP5TypeTestCase.py", line 754, in _exec
return PythonScript_exec(self, *args)
File "/usr/lib/zope/./build/build-base/python-2.4/build-lib/Products/PythonScripts/PythonScript.py", line 323, in _exec
File "Script (Python)", line 1, in Account_Validate
File "/usr/lib/zope/./build/build-base/python-2.4/build-lib/Shared/DC/Scripts/Bindings.py", line 306, in __call__
File "/usr/lib/zope/./build/build-base/python-2.4/build-lib/Shared/DC/Scripts/Bindings.py", line 343, in _bindAndExec
File "/mnt/erp5_cd/buildbot_slave/slave/full.bot_livecd/build/unit_test/Products/ERP5Type/tests/ERP5TypeTestCase.py", line 754, in _exec
return PythonScript_exec(self, *args)
File "/usr/lib/zope/./build/build-base/python-2.4/build-lib/Products/PythonScripts/PythonScript.py", line 323, in _exec
File "Script (Python)", line 8, in Base_checkConsistency
ValidationFailed: Arity error for relation 'account_type' and portal_type: '('Category',)', arity is equal to 0 but should be between 1 and 1
ERROR: test_10_AcceptDecisionOnPackingList (testInvoice.TestInvoice)
----------------------------------------------------------------------
Traceback (most recent call last):
File "/usr/lib/zope/lib/python/Testing/ZopeTestCase/profiler.py", line 80, in __call__
testMethod()
File "/mnt/erp5_cd/buildbot_slave/slave/full.bot_livecd/build/unit_test/Products/ERP5/tests/testInvoice.py", line 1505, in test_10_AcceptDecisionOnPackingList
sequence_list.play(self, quiet=quiet)
File "/mnt/erp5_cd/buildbot_slave/slave/full.bot_livecd/build/unit_test/Products/ERP5Type/tests/Sequence.py", line 163, in play
sequence.play(context, sequence_number=i, quiet=quiet)
File "/mnt/erp5_cd/buildbot_slave/slave/full.bot_livecd/build/unit_test/Products/ERP5Type/tests/Sequence.py", line 113, in play
step.play(context, sequence=self, quiet=quiet)
Current Sequence:
CreateEntities
CreateCurrency
> CreateSaleInvoiceTransactionRule
CreateOrder
SetOrderProfile
SetOrderPriceCurrency
CreateNotVariatedResource
Tic
CreateOrderLine
SetOrderLineResource
SetOrderLineDefaultValues
OrderOrder
Tic
CheckDeliveryBuilding
ConfirmOrder
Tic
CheckOrderRule
CheckOrderSimulation
CheckDeliveryBuilding
AddPackingListContainer
AddPackingListContainerLine
SetContainerLineFullQuantity
Tic
CheckPackingListIsPacked
CheckInvoicingRule
DecreasePackingListLineQuantity
SetContainerFullQuantity
CheckPackingListIsCalculating
AcceptDecisionPackingList
Tic
CheckPackingListIsSolved
CheckPackingListNotSplitted
SetReadyPackingList
Tic
StartPackingList
CheckInvoicingRule
CheckInvoiceTransactionRule
Tic
CheckInvoiceBuilding
StopPackingList
Tic
DeliverPackingList
Tic
CheckPackingListIsNotDivergent
CheckPackingListIsSolved
CheckInvoiceTransactionRule
ConfirmInvoice
Tic
StopInvoice
Tic
DeliverInvoice
Tic
CheckInvoiceNotSplitted
CheckInvoiceIsNotDivergent
CheckInvoiceIsSolved
RebuildAndCheckNothingIsCreated
CheckInvoicesConsistency
File "/mnt/erp5_cd/buildbot_slave/slave/full.bot_livecd/build/unit_test/Products/ERP5Type/tests/Sequence.py", line 99, in play
method(sequence=sequence)
File "/mnt/erp5_cd/buildbot_slave/slave/full.bot_livecd/build/unit_test/Products/ERP5/tests/testInvoice.py", line 176, in stepCreateSaleInvoiceTransactionRule
'validate_action', wf_id='account_workflow')
File "/usr/lib/zope/lib/python/Products/CMFCore/WorkflowTool.py", line 301, in doActionFor
return self._invokeWithNotification(
File "/usr/lib/zope/lib/python/Products/CMFCore/WorkflowTool.py", line 616, in _invokeWithNotification
res = func(*args, **kw)
File "/usr/lib/zope/lib/python/Products/DCWorkflow/DCWorkflow.py", line 287, in doActionFor
self._changeStateOf(ob, tdef, kw)
File "/usr/lib/zope/lib/python/Products/DCWorkflow/DCWorkflow.py", line 472, in _changeStateOf
sdef = self._executeTransition(ob, tdef, kwargs)
File "/mnt/erp5_cd/buildbot_slave/slave/full.bot_livecd/build/unit_test/Products/ERP5Type/patches/DCWorkflow.py", line 315, in DCWorkflowDefinition_executeTransition
script(sci) # May throw an exception.
File "/usr/lib/zope/./build/build-base/python-2.4/build-lib/Shared/DC/Scripts/Bindings.py", line 306, in __call__
File "/usr/lib/zope/./build/build-base/python-2.4/build-lib/Shared/DC/Scripts/Bindings.py", line 343, in _bindAndExec
File "/mnt/erp5_cd/buildbot_slave/slave/full.bot_livecd/build/unit_test/Products/ERP5Type/tests/ERP5TypeTestCase.py", line 754, in _exec
return PythonScript_exec(self, *args)
File "/usr/lib/zope/./build/build-base/python-2.4/build-lib/Products/PythonScripts/PythonScript.py", line 323, in _exec
File "Script (Python)", line 1, in Account_Validate
File "/usr/lib/zope/./build/build-base/python-2.4/build-lib/Shared/DC/Scripts/Bindings.py", line 306, in __call__
File "/usr/lib/zope/./build/build-base/python-2.4/build-lib/Shared/DC/Scripts/Bindings.py", line 343, in _bindAndExec
File "/mnt/erp5_cd/buildbot_slave/slave/full.bot_livecd/build/unit_test/Products/ERP5Type/tests/ERP5TypeTestCase.py", line 754, in _exec
return PythonScript_exec(self, *args)
File "/usr/lib/zope/./build/build-base/python-2.4/build-lib/Products/PythonScripts/PythonScript.py", line 323, in _exec
File "Script (Python)", line 8, in Base_checkConsistency
ValidationFailed: Arity error for relation 'account_type' and portal_type: '('Category',)', arity is equal to 0 but should be between 1 and 1
ERROR: test_11_AcceptDecisionOnPackingListAndInvoice (testInvoice.TestInvoice)
----------------------------------------------------------------------
Traceback (most recent call last):
File "/usr/lib/zope/lib/python/Testing/ZopeTestCase/profiler.py", line 80, in __call__
testMethod()
File "/mnt/erp5_cd/buildbot_slave/slave/full.bot_livecd/build/unit_test/Products/ERP5/tests/testInvoice.py", line 1587, in test_11_AcceptDecisionOnPackingListAndInvoice
sequence_list.play(self, quiet=quiet)
File "/mnt/erp5_cd/buildbot_slave/slave/full.bot_livecd/build/unit_test/Products/ERP5Type/tests/Sequence.py", line 163, in play
sequence.play(context, sequence_number=i, quiet=quiet)
File "/mnt/erp5_cd/buildbot_slave/slave/full.bot_livecd/build/unit_test/Products/ERP5Type/tests/Sequence.py", line 113, in play
step.play(context, sequence=self, quiet=quiet)
Current Sequence:
CreateEntities
CreateCurrency
> CreateSaleInvoiceTransactionRule
CreateOrder
SetOrderProfile
SetOrderPriceCurrency
CreateNotVariatedResource
Tic
CreateOrderLine
SetOrderLineResource
SetOrderLineDefaultValues
OrderOrder
Tic
CheckDeliveryBuilding
ConfirmOrder
Tic
CheckOrderRule
CheckOrderSimulation
CheckDeliveryBuilding
AddPackingListContainer
AddPackingListContainerLine
SetContainerLineFullQuantity
Tic
CheckPackingListIsPacked
CheckInvoicingRule
DecreasePackingListLineQuantity
SetContainerFullQuantity
CheckPackingListIsCalculating
AcceptDecisionPackingList
Tic
CheckPackingListIsSolved
CheckPackingListNotSplitted
SetReadyPackingList
Tic
StartPackingList
CheckInvoicingRule
CheckInvoiceTransactionRule
Tic
CheckInvoiceBuilding
StopPackingList
Tic
DeliverPackingList
Tic
CheckPackingListIsNotDivergent
CheckPackingListIsSolved
CheckInvoiceTransactionRule
IncreaseInvoiceLineQuantity
Tic
CheckInvoiceIsDiverged
AcceptDecisionInvoice
Tic
ConfirmInvoice
Tic
StopInvoice
Tic
DeliverInvoice
Tic
CheckPackingListIsNotDivergent
CheckPackingListIsSolved
CheckInvoiceTransactionRule
CheckInvoiceNotSplitted
CheckInvoiceIsNotDivergent
CheckInvoiceIsSolved
RebuildAndCheckNothingIsCreated
CheckInvoicesConsistency
File "/mnt/erp5_cd/buildbot_slave/slave/full.bot_livecd/build/unit_test/Products/ERP5Type/tests/Sequence.py", line 99, in play
method(sequence=sequence)
File "/mnt/erp5_cd/buildbot_slave/slave/full.bot_livecd/build/unit_test/Products/ERP5/tests/testInvoice.py", line 176, in stepCreateSaleInvoiceTransactionRule
'validate_action', wf_id='account_workflow')
File "/usr/lib/zope/lib/python/Products/CMFCore/WorkflowTool.py", line 301, in doActionFor
return self._invokeWithNotification(
File "/usr/lib/zope/lib/python/Products/CMFCore/WorkflowTool.py", line 616, in _invokeWithNotification
res = func(*args, **kw)
File "/usr/lib/zope/lib/python/Products/DCWorkflow/DCWorkflow.py", line 287, in doActionFor
self._changeStateOf(ob, tdef, kw)
File "/usr/lib/zope/lib/python/Products/DCWorkflow/DCWorkflow.py", line 472, in _changeStateOf
sdef = self._executeTransition(ob, tdef, kwargs)
File "/mnt/erp5_cd/buildbot_slave/slave/full.bot_livecd/build/unit_test/Products/ERP5Type/patches/DCWorkflow.py", line 315, in DCWorkflowDefinition_executeTransition
script(sci) # May throw an exception.
File "/usr/lib/zope/./build/build-base/python-2.4/build-lib/Shared/DC/Scripts/Bindings.py", line 306, in __call__
File "/usr/lib/zope/./build/build-base/python-2.4/build-lib/Shared/DC/Scripts/Bindings.py", line 343, in _bindAndExec
File "/mnt/erp5_cd/buildbot_slave/slave/full.bot_livecd/build/unit_test/Products/ERP5Type/tests/ERP5TypeTestCase.py", line 754, in _exec
return PythonScript_exec(self, *args)
File "/usr/lib/zope/./build/build-base/python-2.4/build-lib/Products/PythonScripts/PythonScript.py", line 323, in _exec
File "Script (Python)", line 1, in Account_Validate
File "/usr/lib/zope/./build/build-base/python-2.4/build-lib/Shared/DC/Scripts/Bindings.py", line 306, in __call__
File "/usr/lib/zope/./build/build-base/python-2.4/build-lib/Shared/DC/Scripts/Bindings.py", line 343, in _bindAndExec
File "/mnt/erp5_cd/buildbot_slave/slave/full.bot_livecd/build/unit_test/Products/ERP5Type/tests/ERP5TypeTestCase.py", line 754, in _exec
return PythonScript_exec(self, *args)
File "/usr/lib/zope/./build/build-base/python-2.4/build-lib/Products/PythonScripts/PythonScript.py", line 323, in _exec
File "Script (Python)", line 8, in Base_checkConsistency
ValidationFailed: Arity error for relation 'account_type' and portal_type: '('Category',)', arity is equal to 0 but should be between 1 and 1
ERROR: test_12_SplitPackingListAndAcceptInvoice (testInvoice.TestInvoice)
----------------------------------------------------------------------
Traceback (most recent call last):
File "/usr/lib/zope/lib/python/Testing/ZopeTestCase/profiler.py", line 80, in __call__
testMethod()
File "/mnt/erp5_cd/buildbot_slave/slave/full.bot_livecd/build/unit_test/Products/ERP5/tests/testInvoice.py", line 1695, in test_12_SplitPackingListAndAcceptInvoice
self.playSequence(sequence, quiet=quiet)
File "/mnt/erp5_cd/buildbot_slave/slave/full.bot_livecd/build/unit_test/Products/ERP5/tests/testAccountingRules.py", line 102, in playSequence
sequence_list.play(self, quiet=quiet)
File "/mnt/erp5_cd/buildbot_slave/slave/full.bot_livecd/build/unit_test/Products/ERP5Type/tests/Sequence.py", line 163, in play
sequence.play(context, sequence_number=i, quiet=quiet)
File "/mnt/erp5_cd/buildbot_slave/slave/full.bot_livecd/build/unit_test/Products/ERP5Type/tests/Sequence.py", line 113, in play
step.play(context, sequence=self, quiet=quiet)
Current Sequence:
CreateEntities
CreateCurrency
> CreateSaleInvoiceTransactionRule
CreateOrder
SetOrderProfile
SetOrderPriceCurrency
CreateNotVariatedResource
Tic
CreateOrderLine
SetOrderLineResource
SetOrderLineDefaultValues
OrderOrder
Tic
CheckDeliveryBuilding
ConfirmOrder
Tic
CheckOrderRule
CheckOrderSimulation
CheckDeliveryBuilding
AddPackingListContainer
AddPackingListContainerLine
SetContainerLineFullQuantity
Tic
CheckPackingListIsPacked
CheckInvoicingRule
DecreasePackingListLineQuantity
SetContainerFullQuantity
CheckPackingListIsCalculating
SplitAndDeferPackingList
Tic
CheckPackingListIsSolved
CheckPackingListSplitted
SetReadyPackingList
Tic
StartPackingList
CheckInvoicingRule
CheckInvoiceTransactionRule
Tic
CheckInvoiceBuilding
StopPackingList
Tic
DeliverPackingList
Tic
CheckPackingListIsSolved
CheckPackingListSplitted
IncreaseInvoiceLineQuantity
CheckInvoiceIsCalculating
AcceptDecisionInvoice
Tic
ConfirmInvoice
Tic
StopInvoice
Tic
DeliverInvoice
Tic
CheckInvoiceIsSolved
CheckInvoiceNotSplitted
CheckPackingListIsNotDivergent
CheckPackingListIsSolved
CheckInvoiceTransactionRule
RebuildAndCheckNothingIsCreated
CheckInvoicesConsistency
SwitchPackingLists
AddPackingListContainer
SetContainerFullQuantity
Tic
CheckPackingListIsSolved
SetReadyPackingList
Tic
StartPackingList
CheckInvoicingRule
CheckInvoiceTransactionRule
Tic
CheckInvoiceBuilding
StopPackingList
Tic
DeliverPackingList
Tic
CheckPackingListIsSolved
SetInvoiceLineQuantityToZero
CheckInvoiceIsCalculating
AcceptDecisionInvoice
Tic
ConfirmInvoice
Tic
StopInvoice
Tic
DeliverInvoice
Tic
CheckInvoiceIsSolved
CheckInvoiceNotSplitted
CheckPackingListIsNotDivergent
CheckPackingListIsSolved
CheckInvoiceTransactionRule
RebuildAndCheckNothingIsCreated
CheckInvoicesConsistency
File "/mnt/erp5_cd/buildbot_slave/slave/full.bot_livecd/build/unit_test/Products/ERP5Type/tests/Sequence.py", line 99, in play
method(sequence=sequence)
File "/mnt/erp5_cd/buildbot_slave/slave/full.bot_livecd/build/unit_test/Products/ERP5/tests/testInvoice.py", line 176, in stepCreateSaleInvoiceTransactionRule
'validate_action', wf_id='account_workflow')
File "/usr/lib/zope/lib/python/Products/CMFCore/WorkflowTool.py", line 301, in doActionFor
return self._invokeWithNotification(
File "/usr/lib/zope/lib/python/Products/CMFCore/WorkflowTool.py", line 616, in _invokeWithNotification
res = func(*args, **kw)
File "/usr/lib/zope/lib/python/Products/DCWorkflow/DCWorkflow.py", line 287, in doActionFor
self._changeStateOf(ob, tdef, kw)
File "/usr/lib/zope/lib/python/Products/DCWorkflow/DCWorkflow.py", line 472, in _changeStateOf
sdef = self._executeTransition(ob, tdef, kwargs)
File "/mnt/erp5_cd/buildbot_slave/slave/full.bot_livecd/build/unit_test/Products/ERP5Type/patches/DCWorkflow.py", line 315, in DCWorkflowDefinition_executeTransition
script(sci) # May throw an exception.
File "/usr/lib/zope/./build/build-base/python-2.4/build-lib/Shared/DC/Scripts/Bindings.py", line 306, in __call__
File "/usr/lib/zope/./build/build-base/python-2.4/build-lib/Shared/DC/Scripts/Bindings.py", line 343, in _bindAndExec
File "/mnt/erp5_cd/buildbot_slave/slave/full.bot_livecd/build/unit_test/Products/ERP5Type/tests/ERP5TypeTestCase.py", line 754, in _exec
return PythonScript_exec(self, *args)
File "/usr/lib/zope/./build/build-base/python-2.4/build-lib/Products/PythonScripts/PythonScript.py", line 323, in _exec
File "Script (Python)", line 1, in Account_Validate
File "/usr/lib/zope/./build/build-base/python-2.4/build-lib/Shared/DC/Scripts/Bindings.py", line 306, in __call__
File "/usr/lib/zope/./build/build-base/python-2.4/build-lib/Shared/DC/Scripts/Bindings.py", line 343, in _bindAndExec
File "/mnt/erp5_cd/buildbot_slave/slave/full.bot_livecd/build/unit_test/Products/ERP5Type/tests/ERP5TypeTestCase.py", line 754, in _exec
return PythonScript_exec(self, *args)
File "/usr/lib/zope/./build/build-base/python-2.4/build-lib/Products/PythonScripts/PythonScript.py", line 323, in _exec
File "Script (Python)", line 8, in Base_checkConsistency
ValidationFailed: Arity error for relation 'account_type' and portal_type: '('Category',)', arity is equal to 0 but should be between 1 and 1
ERROR: test_13_SplitAndDeferInvoice (testInvoice.TestInvoice)
----------------------------------------------------------------------
Traceback (most recent call last):
File "/usr/lib/zope/lib/python/Testing/ZopeTestCase/profiler.py", line 80, in __call__
testMethod()
File "/mnt/erp5_cd/buildbot_slave/slave/full.bot_livecd/build/unit_test/Products/ERP5/tests/testInvoice.py", line 1764, in test_13_SplitAndDeferInvoice
self.playSequence(sequence, quiet=quiet)
File "/mnt/erp5_cd/buildbot_slave/slave/full.bot_livecd/build/unit_test/Products/ERP5/tests/testAccountingRules.py", line 102, in playSequence
sequence_list.play(self, quiet=quiet)
File "/mnt/erp5_cd/buildbot_slave/slave/full.bot_livecd/build/unit_test/Products/ERP5Type/tests/Sequence.py", line 163, in play
sequence.play(context, sequence_number=i, quiet=quiet)
File "/mnt/erp5_cd/buildbot_slave/slave/full.bot_livecd/build/unit_test/Products/ERP5Type/tests/Sequence.py", line 113, in play
step.play(context, sequence=self, quiet=quiet)
Current Sequence:
CreateEntities
CreateCurrency
> CreateSaleInvoiceTransactionRule
CreateOrder
SetOrderProfile
SetOrderPriceCurrency
CreateNotVariatedResource
Tic
CreateOrderLine
SetOrderLineResource
SetOrderLineDefaultValues
OrderOrder
Tic
CheckDeliveryBuilding
ConfirmOrder
Tic
CheckOrderRule
CheckOrderSimulation
CheckDeliveryBuilding
AddPackingListContainer
AddPackingListContainerLine
SetContainerLineFullQuantity
Tic
CheckPackingListIsPacked
SetReadyPackingList
Tic
StartPackingList
CheckInvoicingRule
CheckInvoiceTransactionRule
Tic
CheckInvoiceBuilding
StopPackingList
Tic
DeliverPackingList
Tic
CheckPackingListIsSolved
CheckPackingListNotSplitted
DecreaseInvoiceLineQuantity
CheckInvoiceIsDivergent
CheckInvoiceIsCalculating
SplitAndDeferInvoice
Tic
ConfirmInvoice
Tic
StopInvoice
Tic
DeliverInvoice
Tic
CheckInvoiceIsNotDivergent
CheckInvoiceIsSolved
CheckInvoiceSplitted
RebuildAndCheckNothingIsCreated
CheckInvoicesConsistency
CheckPackingListIsNotDivergent
CheckPackingListIsSolved
CheckInvoiceTransactionRule
SwitchInvoices
ConfirmInvoice
Tic
StopInvoice
Tic
DeliverInvoice
Tic
CheckInvoiceIsNotDivergent
CheckInvoiceIsSolved
RebuildAndCheckNothingIsCreated
CheckInvoicesConsistency
File "/mnt/erp5_cd/buildbot_slave/slave/full.bot_livecd/build/unit_test/Products/ERP5Type/tests/Sequence.py", line 99, in play
method(sequence=sequence)
File "/mnt/erp5_cd/buildbot_slave/slave/full.bot_livecd/build/unit_test/Products/ERP5/tests/testInvoice.py", line 176, in stepCreateSaleInvoiceTransactionRule
'validate_action', wf_id='account_workflow')
File "/usr/lib/zope/lib/python/Products/CMFCore/WorkflowTool.py", line 301, in doActionFor
return self._invokeWithNotification(
File "/usr/lib/zope/lib/python/Products/CMFCore/WorkflowTool.py", line 616, in _invokeWithNotification
res = func(*args, **kw)
File "/usr/lib/zope/lib/python/Products/DCWorkflow/DCWorkflow.py", line 287, in doActionFor
self._changeStateOf(ob, tdef, kw)
File "/usr/lib/zope/lib/python/Products/DCWorkflow/DCWorkflow.py", line 472, in _changeStateOf
sdef = self._executeTransition(ob, tdef, kwargs)
File "/mnt/erp5_cd/buildbot_slave/slave/full.bot_livecd/build/unit_test/Products/ERP5Type/patches/DCWorkflow.py", line 315, in DCWorkflowDefinition_executeTransition
script(sci) # May throw an exception.
File "/usr/lib/zope/./build/build-base/python-2.4/build-lib/Shared/DC/Scripts/Bindings.py", line 306, in __call__
File "/usr/lib/zope/./build/build-base/python-2.4/build-lib/Shared/DC/Scripts/Bindings.py", line 343, in _bindAndExec
File "/mnt/erp5_cd/buildbot_slave/slave/full.bot_livecd/build/unit_test/Products/ERP5Type/tests/ERP5TypeTestCase.py", line 754, in _exec
return PythonScript_exec(self, *args)
File "/usr/lib/zope/./build/build-base/python-2.4/build-lib/Products/PythonScripts/PythonScript.py", line 323, in _exec
File "Script (Python)", line 1, in Account_Validate
File "/usr/lib/zope/./build/build-base/python-2.4/build-lib/Shared/DC/Scripts/Bindings.py", line 306, in __call__
File "/usr/lib/zope/./build/build-base/python-2.4/build-lib/Shared/DC/Scripts/Bindings.py", line 343, in _bindAndExec
File "/mnt/erp5_cd/buildbot_slave/slave/full.bot_livecd/build/unit_test/Products/ERP5Type/tests/ERP5TypeTestCase.py", line 754, in _exec
return PythonScript_exec(self, *args)
File "/usr/lib/zope/./build/build-base/python-2.4/build-lib/Products/PythonScripts/PythonScript.py", line 323, in _exec
File "Script (Python)", line 8, in Base_checkConsistency
ValidationFailed: Arity error for relation 'account_type' and portal_type: '('Category',)', arity is equal to 0 but should be between 1 and 1
ERROR: test_14_AcceptDecisionOnInvoice (testInvoice.TestInvoice)
----------------------------------------------------------------------
Traceback (most recent call last):
File "/usr/lib/zope/lib/python/Testing/ZopeTestCase/profiler.py", line 80, in __call__
testMethod()
File "/mnt/erp5_cd/buildbot_slave/slave/full.bot_livecd/build/unit_test/Products/ERP5/tests/testInvoice.py", line 1830, in test_14_AcceptDecisionOnInvoice
sequence_list.play(self, quiet=quiet)
File "/mnt/erp5_cd/buildbot_slave/slave/full.bot_livecd/build/unit_test/Products/ERP5Type/tests/Sequence.py", line 163, in play
sequence.play(context, sequence_number=i, quiet=quiet)
File "/mnt/erp5_cd/buildbot_slave/slave/full.bot_livecd/build/unit_test/Products/ERP5Type/tests/Sequence.py", line 113, in play
step.play(context, sequence=self, quiet=quiet)
Current Sequence:
CreateEntities
CreateCurrency
> CreateSaleInvoiceTransactionRule
CreateOrder
SetOrderProfile
SetOrderPriceCurrency
CreateNotVariatedResource
Tic
CreateOrderLine
SetOrderLineResource
SetOrderLineDefaultValues
OrderOrder
Tic
CheckDeliveryBuilding
ConfirmOrder
Tic
CheckOrderRule
CheckOrderSimulation
CheckDeliveryBuilding
AddPackingListContainer
AddPackingListContainerLine
SetContainerLineFullQuantity
Tic
CheckPackingListIsPacked
SetReadyPackingList
Tic
StartPackingList
CheckInvoicingRule
CheckInvoiceTransactionRule
Tic
CheckInvoiceBuilding
StopPackingList
Tic
DeliverPackingList
Tic
CheckPackingListIsSolved
CheckPackingListNotSplitted
DecreaseInvoiceLineQuantity
CheckInvoiceIsDivergent
CheckInvoiceIsCalculating
AcceptDecisionInvoice
Tic
ConfirmInvoice
Tic
StopInvoice
Tic
DeliverInvoice
Tic
CheckPackingListIsNotDivergent
CheckPackingListIsSolved
CheckInvoiceTransactionRule
CheckInvoiceNotSplitted
CheckInvoiceIsNotDivergent
CheckInvoiceIsSolved
RebuildAndCheckNothingIsCreated
CheckInvoicesConsistency
File "/mnt/erp5_cd/buildbot_slave/slave/full.bot_livecd/build/unit_test/Products/ERP5Type/tests/Sequence.py", line 99, in play
method(sequence=sequence)
File "/mnt/erp5_cd/buildbot_slave/slave/full.bot_livecd/build/unit_test/Products/ERP5/tests/testInvoice.py", line 176, in stepCreateSaleInvoiceTransactionRule
'validate_action', wf_id='account_workflow')
File "/usr/lib/zope/lib/python/Products/CMFCore/WorkflowTool.py", line 301, in doActionFor
return self._invokeWithNotification(
File "/usr/lib/zope/lib/python/Products/CMFCore/WorkflowTool.py", line 616, in _invokeWithNotification
res = func(*args, **kw)
File "/usr/lib/zope/lib/python/Products/DCWorkflow/DCWorkflow.py", line 287, in doActionFor
self._changeStateOf(ob, tdef, kw)
File "/usr/lib/zope/lib/python/Products/DCWorkflow/DCWorkflow.py", line 472, in _changeStateOf
sdef = self._executeTransition(ob, tdef, kwargs)
File "/mnt/erp5_cd/buildbot_slave/slave/full.bot_livecd/build/unit_test/Products/ERP5Type/patches/DCWorkflow.py", line 315, in DCWorkflowDefinition_executeTransition
script(sci) # May throw an exception.
File "/usr/lib/zope/./build/build-base/python-2.4/build-lib/Shared/DC/Scripts/Bindings.py", line 306, in __call__
File "/usr/lib/zope/./build/build-base/python-2.4/build-lib/Shared/DC/Scripts/Bindings.py", line 343, in _bindAndExec
File "/mnt/erp5_cd/buildbot_slave/slave/full.bot_livecd/build/unit_test/Products/ERP5Type/tests/ERP5TypeTestCase.py", line 754, in _exec
return PythonScript_exec(self, *args)
File "/usr/lib/zope/./build/build-base/python-2.4/build-lib/Products/PythonScripts/PythonScript.py", line 323, in _exec
File "Script (Python)", line 1, in Account_Validate
File "/usr/lib/zope/./build/build-base/python-2.4/build-lib/Shared/DC/Scripts/Bindings.py", line 306, in __call__
File "/usr/lib/zope/./build/build-base/python-2.4/build-lib/Shared/DC/Scripts/Bindings.py", line 343, in _bindAndExec
File "/mnt/erp5_cd/buildbot_slave/slave/full.bot_livecd/build/unit_test/Products/ERP5Type/tests/ERP5TypeTestCase.py", line 754, in _exec
return PythonScript_exec(self, *args)
File "/usr/lib/zope/./build/build-base/python-2.4/build-lib/Products/PythonScripts/PythonScript.py", line 323, in _exec
File "Script (Python)", line 8, in Base_checkConsistency
ValidationFailed: Arity error for relation 'account_type' and portal_type: '('Category',)', arity is equal to 0 but should be between 1 and 1
ERROR: test_16_ManuallyAddedMovements (testInvoice.TestInvoice)
----------------------------------------------------------------------
Traceback (most recent call last):
File "/usr/lib/zope/lib/python/Testing/ZopeTestCase/profiler.py", line 80, in __call__
testMethod()
File "/mnt/erp5_cd/buildbot_slave/slave/full.bot_livecd/build/unit_test/Products/ERP5/tests/testInvoice.py", line 1881, in test_16_ManuallyAddedMovements
sequence_list.play(self, quiet=quiet)
File "/mnt/erp5_cd/buildbot_slave/slave/full.bot_livecd/build/unit_test/Products/ERP5Type/tests/Sequence.py", line 163, in play
sequence.play(context, sequence_number=i, quiet=quiet)
File "/mnt/erp5_cd/buildbot_slave/slave/full.bot_livecd/build/unit_test/Products/ERP5Type/tests/Sequence.py", line 113, in play
step.play(context, sequence=self, quiet=quiet)
Current Sequence:
CreateEntities
CreateCurrency
> CreateSaleInvoiceTransactionRule
CreateOrder
SetOrderProfile
SetOrderPriceCurrency
CreateNotVariatedResource
Tic
CreateOrderLine
SetOrderLineResource
SetOrderLineDefaultValues
OrderOrder
Tic
CheckDeliveryBuilding
ConfirmOrder
Tic
CheckOrderRule
CheckOrderSimulation
CheckDeliveryBuilding
AddPackingListContainer
AddPackingListContainerLine
SetContainerLineFullQuantity
Tic
CheckPackingListIsPacked
SetReadyPackingList
Tic
StartPackingList
CheckInvoicingRule
Tic
CheckInvoiceBuilding
RebuildAndCheckNothingIsCreated
CheckInvoicesConsistency
AddInvoiceLines
Tic
ConfirmInvoice
Tic
CheckSimulationTrees
File "/mnt/erp5_cd/buildbot_slave/slave/full.bot_livecd/build/unit_test/Products/ERP5Type/tests/Sequence.py", line 99, in play
method(sequence=sequence)
File "/mnt/erp5_cd/buildbot_slave/slave/full.bot_livecd/build/unit_test/Products/ERP5/tests/testInvoice.py", line 176, in stepCreateSaleInvoiceTransactionRule
'validate_action', wf_id='account_workflow')
File "/usr/lib/zope/lib/python/Products/CMFCore/WorkflowTool.py", line 301, in doActionFor
return self._invokeWithNotification(
File "/usr/lib/zope/lib/python/Products/CMFCore/WorkflowTool.py", line 616, in _invokeWithNotification
res = func(*args, **kw)
File "/usr/lib/zope/lib/python/Products/DCWorkflow/DCWorkflow.py", line 287, in doActionFor
self._changeStateOf(ob, tdef, kw)
File "/usr/lib/zope/lib/python/Products/DCWorkflow/DCWorkflow.py", line 472, in _changeStateOf
sdef = self._executeTransition(ob, tdef, kwargs)
File "/mnt/erp5_cd/buildbot_slave/slave/full.bot_livecd/build/unit_test/Products/ERP5Type/patches/DCWorkflow.py", line 315, in DCWorkflowDefinition_executeTransition
script(sci) # May throw an exception.
File "/usr/lib/zope/./build/build-base/python-2.4/build-lib/Shared/DC/Scripts/Bindings.py", line 306, in __call__
File "/usr/lib/zope/./build/build-base/python-2.4/build-lib/Shared/DC/Scripts/Bindings.py", line 343, in _bindAndExec
File "/mnt/erp5_cd/buildbot_slave/slave/full.bot_livecd/build/unit_test/Products/ERP5Type/tests/ERP5TypeTestCase.py", line 754, in _exec
return PythonScript_exec(self, *args)
File "/usr/lib/zope/./build/build-base/python-2.4/build-lib/Products/PythonScripts/PythonScript.py", line 323, in _exec
File "Script (Python)", line 1, in Account_Validate
File "/usr/lib/zope/./build/build-base/python-2.4/build-lib/Shared/DC/Scripts/Bindings.py", line 306, in __call__
File "/usr/lib/zope/./build/build-base/python-2.4/build-lib/Shared/DC/Scripts/Bindings.py", line 343, in _bindAndExec
File "/mnt/erp5_cd/buildbot_slave/slave/full.bot_livecd/build/unit_test/Products/ERP5Type/tests/ERP5TypeTestCase.py", line 754, in _exec
return PythonScript_exec(self, *args)
File "/usr/lib/zope/./build/build-base/python-2.4/build-lib/Products/PythonScripts/PythonScript.py", line 323, in _exec
File "Script (Python)", line 8, in Base_checkConsistency
ValidationFailed: Arity error for relation 'account_type' and portal_type: '('Category',)', arity is equal to 0 but should be between 1 and 1
ERROR: test_17_ManuallyAddedWrongMovements (testInvoice.TestInvoice)
----------------------------------------------------------------------
Traceback (most recent call last):
File "/usr/lib/zope/lib/python/Testing/ZopeTestCase/profiler.py", line 80, in __call__
testMethod()
File "/mnt/erp5_cd/buildbot_slave/slave/full.bot_livecd/build/unit_test/Products/ERP5/tests/testInvoice.py", line 1908, in test_17_ManuallyAddedWrongMovements
sequence_list.play(self, quiet=quiet)
File "/mnt/erp5_cd/buildbot_slave/slave/full.bot_livecd/build/unit_test/Products/ERP5Type/tests/Sequence.py", line 163, in play
sequence.play(context, sequence_number=i, quiet=quiet)
File "/mnt/erp5_cd/buildbot_slave/slave/full.bot_livecd/build/unit_test/Products/ERP5Type/tests/Sequence.py", line 113, in play
step.play(context, sequence=self, quiet=quiet)
Current Sequence:
CreateEntities
CreateCurrency
> CreateSaleInvoiceTransactionRule
CreateOrder
SetOrderProfile
SetOrderPriceCurrency
CreateNotVariatedResource
Tic
CreateOrderLine
SetOrderLineResource
SetOrderLineDefaultValues
OrderOrder
Tic
CheckDeliveryBuilding
ConfirmOrder
Tic
CheckOrderRule
CheckOrderSimulation
CheckDeliveryBuilding
AddPackingListContainer
AddPackingListContainerLine
SetContainerLineFullQuantity
Tic
CheckPackingListIsPacked
SetReadyPackingList
Tic
StartPackingList
CheckInvoicingRule
Tic
CheckInvoiceBuilding
AddWrongInvoiceLines
Tic
ConfirmInvoice
CheckConfirmInvoiceFails
CheckSimulationTrees
File "/mnt/erp5_cd/buildbot_slave/slave/full.bot_livecd/build/unit_test/Products/ERP5Type/tests/Sequence.py", line 99, in play
method(sequence=sequence)
File "/mnt/erp5_cd/buildbot_slave/slave/full.bot_livecd/build/unit_test/Products/ERP5/tests/testInvoice.py", line 176, in stepCreateSaleInvoiceTransactionRule
'validate_action', wf_id='account_workflow')
File "/usr/lib/zope/lib/python/Products/CMFCore/WorkflowTool.py", line 301, in doActionFor
return self._invokeWithNotification(
File "/usr/lib/zope/lib/python/Products/CMFCore/WorkflowTool.py", line 616, in _invokeWithNotification
res = func(*args, **kw)
File "/usr/lib/zope/lib/python/Products/DCWorkflow/DCWorkflow.py", line 287, in doActionFor
self._changeStateOf(ob, tdef, kw)
File "/usr/lib/zope/lib/python/Products/DCWorkflow/DCWorkflow.py", line 472, in _changeStateOf
sdef = self._executeTransition(ob, tdef, kwargs)
File "/mnt/erp5_cd/buildbot_slave/slave/full.bot_livecd/build/unit_test/Products/ERP5Type/patches/DCWorkflow.py", line 315, in DCWorkflowDefinition_executeTransition
script(sci) # May throw an exception.
File "/usr/lib/zope/./build/build-base/python-2.4/build-lib/Shared/DC/Scripts/Bindings.py", line 306, in __call__
File "/usr/lib/zope/./build/build-base/python-2.4/build-lib/Shared/DC/Scripts/Bindings.py", line 343, in _bindAndExec
File "/mnt/erp5_cd/buildbot_slave/slave/full.bot_livecd/build/unit_test/Products/ERP5Type/tests/ERP5TypeTestCase.py", line 754, in _exec
return PythonScript_exec(self, *args)
File "/usr/lib/zope/./build/build-base/python-2.4/build-lib/Products/PythonScripts/PythonScript.py", line 323, in _exec
File "Script (Python)", line 1, in Account_Validate
File "/usr/lib/zope/./build/build-base/python-2.4/build-lib/Shared/DC/Scripts/Bindings.py", line 306, in __call__
File "/usr/lib/zope/./build/build-base/python-2.4/build-lib/Shared/DC/Scripts/Bindings.py", line 343, in _bindAndExec
File "/mnt/erp5_cd/buildbot_slave/slave/full.bot_livecd/build/unit_test/Products/ERP5Type/tests/ERP5TypeTestCase.py", line 754, in _exec
return PythonScript_exec(self, *args)
File "/usr/lib/zope/./build/build-base/python-2.4/build-lib/Products/PythonScripts/PythonScript.py", line 323, in _exec
File "Script (Python)", line 8, in Base_checkConsistency
ValidationFailed: Arity error for relation 'account_type' and portal_type: '('Category',)', arity is equal to 0 but should be between 1 and 1
FAIL: test_04_WebPageTranslation (testERP5Web.TestERP5Web)
----------------------------------------------------------------------
Traceback (most recent call last):
File "/usr/lib/zope/lib/python/Testing/ZopeTestCase/profiler.py", line 80, in __call__
testMethod()
File "/mnt/erp5_cd/buildbot_slave/slave/full.bot_livecd/build/unit_test/Products/ERP5/tests/testERP5Web.py", line 254, in test_04_WebPageTranslation
self.assertEquals(1, len(websection.WebSection_getDocumentValueList()))
AssertionError: 1 != 4
FAIL: test_01_worklist (testSQLCachedWorklist.TestSQLCachedWorklist)
----------------------------------------------------------------------
Traceback (most recent call last):
File "/usr/lib/zope/lib/python/Testing/ZopeTestCase/profiler.py", line 80, in __call__
testMethod()
File "/mnt/erp5_cd/buildbot_slave/slave/full.bot_livecd/build/unit_test/Products/ERP5/tests/testWorklist.py", line 193, in test_01_worklist
self.assertEquals(
AssertionError: 2 != 1
ERROR: test_53_DateFormat (testERP5Catalog.TestERP5Catalog)
----------------------------------------------------------------------
Traceback (most recent call last):
File "/usr/lib/zope/lib/python/Testing/ZopeTestCase/profiler.py", line 80, in __call__
testMethod()
File "/mnt/erp5_cd/buildbot_slave/slave/full.bot_livecd/build/unit_test/Products/ERP5Catalog/tests/testERP5Catalog.py", line 1774, in test_53_DateFormat
[x.path for x in self.getCatalogTool()(
File "/mnt/erp5_cd/buildbot_slave/slave/full.bot_livecd/build/unit_test/Products/ERP5Catalog/CatalogTool.py", line 588, in searchResults
return ZCatalog.searchResults(self, query=query, sql_catalog_id=catalog_id, **kw)
File "/mnt/erp5_cd/buildbot_slave/slave/full.bot_livecd/build/unit_test/Products/ZSQLCatalog/ZSQLCatalog.py", line 1052, in searchResults
return apply(catalog.searchResults, (REQUEST,used), kw)
File "/mnt/erp5_cd/buildbot_slave/slave/full.bot_livecd/build/unit_test/Products/ZSQLCatalog/SQLCatalog.py", line 2527, in searchResults
return self.queryResults(method, REQUEST=REQUEST, used=used, **kw)
File "/mnt/erp5_cd/buildbot_slave/slave/full.bot_livecd/build/unit_test/Products/ZSQLCatalog/SQLCatalog.py", line 2508, in queryResults
query = build_sql_query_method(REQUEST=REQUEST, **kw)
File "/mnt/erp5_cd/buildbot_slave/slave/full.bot_livecd/build/unit_test/Products/ZSQLCatalog/SQLCatalog.py", line 2417, in buildSQLQuery
stat__=stat__)
File "/mnt/erp5_cd/buildbot_slave/slave/full.bot_livecd/build/unit_test/Products/ZSQLCatalog/SQLCatalog.py", line 445, in asSQLExpression
value = DateTime(value).toZone('UTC')
File "/usr/lib/zope/./build/build-base/python-2.4/build-lib/DateTime/DateTime.py", line 513, in __init__
SyntaxError: Unable to parse ('2006',), {}
More information about the Erp5-report
mailing list