[Erp5-report] ERP5-MASTER : 5900 Tests, 4 Errors, 3 Failures, 201 Skips

nobody at svn.erp5.org nobody at svn.erp5.org
Fri Jun 15 17:53:17 UTC 2018


Test Suite: ERP5-MASTER
Revision: slapos.cookbook=10479-3da76768a75716aea8929b501f9b1e1d85e721d0,erp5=49212-af3fb549dcc38b6472a12f79134c1183d5b73b49
Result: FAIL

All tests: 5900
Failures: 3
Errors: 4
Skips: 201

 https://nexedi.erp5.net/test_result_module/20180615-2E9138E1/view


The following tests failed:

  erp5_officejs_ui_test:testFunctionalOfficeJSSmartAssistant (1 failures)
   testFunctionalTestRunner (erp5.component.test.erp5_version.testFunctionalOfficeJSSmartAssistant.TestOfficejSUISmartAssistant)

  erp5_officejs_ui_test:testFunctionalOfficeJSWebTable (1 errors)
   testFunctionalTestRunner (erp5.component.test.erp5_version.testFunctionalOfficeJSWebTable.TestOfficejSUIWebTable)

  erp5_officejs_ui_test:testFunctionalOfficeJSoOoSpreadsheet (1 failures)
   testFunctionalTestRunner (erp5.component.test.erp5_version.testFunctionalOfficeJSoOoSpreadsheet.TestOfficejSUIoOoSpreadsheet)

  erp5_web_renderjs_ui_test:testFunctionalRJSLabelField (1 errors)
   testFunctionalTestRunner (erp5.component.test.erp5_version.testFunctionalRJSLabelField.TestRenderJSUILabelField)

  erp5_web_renderjs_ui_test:testFunctionalRJSListField (1 errors)
   testFunctionalTestRunner (erp5.component.test.erp5_version.testFunctionalRJSListField.TestRenderJSUIListField)

  erp5_web_renderjs_ui_test:testFunctionalRJSListbox (1 failures)
   testFunctionalTestRunner (erp5.component.test.erp5_version.testFunctionalRJSListbox.TestRenderJSUIListbox)

  testIngestionWithFlare                             (1 errors, 4 skips)
   test_09_Contribute (testIngestionWithFlare.TestIngestionWithFlare)

The following tests were at least partly skipped:

  erp5_configurator_maxma_demo:testMaxmaDemoConfigurationWorkflow (1 skips)

  erp5_hal_json_style:testHalJsonStyle               (4 skips)
   test_getRequestBody_matching_key (erp5.component.test.erp5_version.testHalJsonStyle.TestBase_getRequestBody) ... skipped 'TODO'
   test_getRequestHeader_matching_key (erp5.component.test.erp5_version.testHalJsonStyle.TestBase_getRequestHeader) ... skipped 'TODO'
   test_getRequestUrl_matching_key (erp5.component.test.erp5_version.testHalJsonStyle.TestBase_getRequestUrl) ... skipped 'TODO'
   test_getHateoas_drop_restricted (erp5.component.test.erp5_version.testHalJsonStyle.TestERP5Document_getHateoas_general) ... skipped 'TODO'

  erp5_officejs_ui_test:testFunctionalOfficeJSMediaPlayer (1 skips)

  erp5_web_monitoring_ui_test:testFunctionalOfficejsMonitoring (1 skips)

  erp5_web_shacache:testShaCache                     (1 skips)

  erp5_web_shadir:testShaDir                         (1 skips)

  erp5_worklist_sql_test:testSQLCachedWorklist       (2 skips)
   test_02_related_key (erp5.component.test.erp5_version.testSQLCachedWorklist.TestSQLCachedWorklist) ... skipped 'TODO ERP5'
   test_04_dynamic_variables (erp5.component.test.erp5_version.testSQLCachedWorklist.TestSQLCachedWorklist) ... skipped 'TODO ERP5'

  networkcache_erp5:testShaCacheExternal             (1 skips)

  testAccountingRulesSimulationLegacy                (22 skips)

  testAdvancedInvoicing                              (1 skips)

  testBPMCore                                        (1 skips)
   test_payBeforeDelivery (testBPMCore.TestBPMImplementation) ... skipped 'TODO ERP5'

  testBase                                           (3 skips)
   check if a document is not indexed where we set isIndexable=0 in the same transaction of newContent(). ... skipped 'isIndexable is not designed to work like tested here, this test       must be rewritten once we know how to handle correctly templates'
   check if a document is not indexed where we call edit() and set isIndexable=0 after it is already indexed. ... skipped 'isIndexable is not designed to work like tested here, this test       must be rewritten once we know how to handle correctly templates'
   check if a document is not indexed where we set isIndexable=0 and call edit() after it is already indexed. ... skipped 'isIndexable is not designed to work like tested here, this test       must be rewritten once we know how to handle correctly templates'

  testBusinessTemplate                               (8 skips)
   test_BusinessTemplateUpgradeDocumentFromFilesystemToZodb (testBusinessTemplate.TestConstraintTemplateItem) ... skipped 'Not implemented yet'
   test_BusinessTemplateUpgradeDocumentFromFilesystemToZodbWithConsistencyError (testBusinessTemplate.TestConstraintTemplateItem) ... skipped 'Not implemented yet'
   test_BusinessTemplateUpgradeDocumentFromFilesystemToZodbWithSyntaxError (testBusinessTemplate.TestConstraintTemplateItem) ... skipped 'Not implemented yet'
   test_BusinessTemplateWithZodbDocument (testBusinessTemplate.TestConstraintTemplateItem) ... skipped 'Not implemented yet'
   test_BusinessTemplateWithZodbDocumentMigrated (testBusinessTemplate.TestConstraintTemplateItem) ... skipped 'Not implemented yet'
   test_BusinessTemplateWithZodbDocumentNonExistingBefore (testBusinessTemplate.TestConstraintTemplateItem) ... skipped 'Not implemented yet'

  testCRM                                            (1 skips)

  testCalendar                                       (5 skips)
   test_2OverlappedLeaveRequestOverlappingAfterGroupCalendar (testCalendar.TestCalendar) ... skipped 'Need to check if we want later to support this again. Drop support for now'
   test_LeaveRequestOverlappingAfterGroupCalendar (testCalendar.TestCalendar) ... skipped 'Need to check if we want later to support this again. Drop support for now'
   test_LeaveRequestOverlappingBeforeGroupCalendar (testCalendar.TestCalendar) ... skipped 'Need to check if we want later to support this again. Drop support for now'
   test_LeaveRequestWithSameDateAsGroupCalendar (testCalendar.TestCalendar) ... skipped 'Need to check if we want later to support this again. Drop support for now'
   test_LeaveRequestWithSameDateAsRepeatedGroupCalendar (testCalendar.TestCalendar) ... skipped 'Need to check if we want later to support this again. Drop support for now'

  testConstraint                                     (1 skips)

  testDeliveryBuilderToSupportMultipleLines          (2 skips)

  testDms                                            (1 skips)

  testDmsWithFlare                                   (1 skips)

  testDmsWithPreConversion                           (1 skips)

  testERP5Base                                       (1 skips)

  testERP5Catalog                                    (3 skips)
   test_49_IndexInOrderedSearchFolder (testERP5Catalog.TestERP5Catalog) ... skipped 'TODO ERP5'
   test_SubDocumentsWithAcquireLocalRoleSecurityIndexing (testERP5Catalog.TestERP5Catalog) ... skipped 'TODO ERP5'

  testERP5Commerce                                   (1 skips)
   test_22_createShoppingCartWithAnonymousAndLogin (testERP5Commerce.TestCommerce) ... skipped 'WebSite_createWebSiteAccount is disabled by default.'

  testERP5DocumentSyncML                             (4 skips)

  testERP5Interfaces                                 (7 skips)

  testERP5SyncML                                     (2 skips)

  testERP5Type                                       (2 skips)

  testERP5TypeInterfaces                             (1 skips)

  testERP5Web                                        (3 skips)
   test_03_CreateWebSiteUser (testERP5Web.TestERP5Web) ... skipped 'WebSite_createWebSiteAccount is disabled by default.'

  testExternalAccount                                (1 skips)

  testFormPrintoutAsODT                              (1 skips)
   test_09_FieldReplacementWithValidation (testFormPrintoutAsODT.TestFormPrintoutAsODT) ... skipped 'Disable validation because OOo does not produce compliant xml, and RelaxNG status is still draft'

  testFunctionalAnonymousSelection                   (37 skips)
        So this part is skipped -->
        So this part is skipped -->
        So this part is skipped -->
        So this test is skipped -->
        So this test is skipped -->
        So this test is skipped -->
        So this test is skipped -->
        So this test is skipped -->
        So this test is skipped -->
        So this test is skipped -->
        So this test is skipped -->
        So this test is skipped -->
        So this test is skipped -->
        So this test is skipped -->
        So this test is skipped -->
        So this test is skipped -->
        So this test is skipped -->
        So this test is skipped -->
        So this test is skipped -->

  testFunctionalCore                                 (8 skips)
        So this test is skipped -->
        So this test is skipped -->

  testFunctionalKM                                   (3 skips)

  testI18NSearch                                     (1 skips)

  testIngestion                                      (4 skips)

  testIngestionWithFlare                             (4 skips)

  testInventory                                      (2 skips)

  testInventoryAPI                                   (3 skips)

  testInvoice                                        (6 skips)

  testItem                                           (4 skips)

  testKM                                             (3 skips)

  testOpenOrder                                      (3 skips)

  testOxatisSynchronization                          (1 skips)

  testPreferences                                    (1 skips)

  testProductionOrder                                (8 skips)

  testProductionOrderApparel                         (6 skips)

  testProductionPackingList                          (1 skips)

  testProductionPackingListApparel                   (1 skips)

  testProxyField                                     (1 skips)

  testResource                                       (1 skips)

  testReturnedSalePackingList                        (3 skips)

  testSelectionTool                                  (7 skips)
   testCallSelectionFor (testSelectionTool.TestSelectionTool) ... skipped 'Test to be written'
   testPage (testSelectionTool.TestSelectionTool) ... skipped 'Test to be written'
   testView (testSelectionTool.TestSelectionTool) ... skipped 'Test to be written'
   testCallSelectionFor (testSelectionTool.TestSelectionToolMemcachedStorage) ... skipped 'Test to be written'
   testDeleteGlobalSelection (testSelectionTool.TestSelectionToolMemcachedStorage) ... skipped 'To be decided if implementation is required'
   testPage (testSelectionTool.TestSelectionToolMemcachedStorage) ... skipped 'Test to be written'
   testView (testSelectionTool.TestSelectionToolMemcachedStorage) ... skipped 'Test to be written'

  testTaskReportDivergence                           (1 skips)

  testTemplate                                       (1 skips)

  testTradeModelLine                                 (1 skips)

  testTradeModelLinePurchase                         (1 skips)

  testUbercartSynchronisation                        (1 skips)

  testVanillaERP5Catalog                             (1 skips)

  testVirtuemartSynchronization                      (1 skips)

  testWebDavSupport                                  (1 skips)
-------------- next part --------------
A non-text attachment was scrubbed...
Name: summary.diff
Type: text/x-diff
Size: 2739 bytes
Desc: not available
URL: <http://mail.nexedi.net/pipermail/erp5-report/attachments/20180615/8b209500/attachment.diff>
-------------- next part --------------

FAIL: testFunctionalTestRunner (erp5.component.test.erp5_version.testFunctionalOfficeJSSmartAssistant.TestOfficejSUISmartAssistant)
----------------------------------------------------------------------
Traceback (most recent call last):
  File "/srv/slapgrid/slappart8/srv/testnode/aai/soft/2da363b8a5af316bd4fab5fb9b352d79/parts/erp5/product/ERP5Type/tests/ERP5TypeFunctionalTestCase.py", line 336, in testFunctionalTestRunner
    self.assertEqual([], error_title_list, '\n'.join(error_title_list))
AssertionError: testOfficeJSSmartAssistant


ERROR: testFunctionalTestRunner (erp5.component.test.erp5_version.testFunctionalOfficeJSWebTable.TestOfficejSUIWebTable)
----------------------------------------------------------------------
Traceback (most recent call last):
  File "/srv/slapgrid/slappart6/srv/testnode/aai/soft/a13cfe6484e2e47916d83a1af102d54d/parts/erp5/product/ERP5Type/tests/ERP5TypeFunctionalTestCase.py", line 308, in testFunctionalTestRunner
    iframe = self.runner.test(debug=debug)
  File "/srv/slapgrid/slappart6/srv/testnode/aai/soft/a13cfe6484e2e47916d83a1af102d54d/parts/erp5/product/ERP5Type/tests/ERP5TypeFunctionalTestCase.py", line 163, in test
    browser = webdriver.Firefox(**kw)
  File "/srv/slapgrid/slappart6/srv/testnode/aai/soft/a13cfe6484e2e47916d83a1af102d54d/eggs/selenium-3.8.0-py2.7.egg/selenium/webdriver/firefox/webdriver.py", line 158, in __init__
    keep_alive=True)
  File "/srv/slapgrid/slappart6/srv/testnode/aai/soft/a13cfe6484e2e47916d83a1af102d54d/eggs/selenium-3.8.0-py2.7.egg/selenium/webdriver/remote/webdriver.py", line 154, in __init__
    self.start_session(desired_capabilities, browser_profile)
  File "/srv/slapgrid/slappart6/srv/testnode/aai/soft/a13cfe6484e2e47916d83a1af102d54d/eggs/selenium-3.8.0-py2.7.egg/selenium/webdriver/remote/webdriver.py", line 243, in start_session
    response = self.execute(Command.NEW_SESSION, parameters)
  File "/srv/slapgrid/slappart6/srv/testnode/aai/soft/a13cfe6484e2e47916d83a1af102d54d/eggs/selenium-3.8.0-py2.7.egg/selenium/webdriver/remote/webdriver.py", line 311, in execute
    self.error_handler.check_response(response)
  File "/srv/slapgrid/slappart6/srv/testnode/aai/soft/a13cfe6484e2e47916d83a1af102d54d/eggs/selenium-3.8.0-py2.7.egg/selenium/webdriver/remote/errorhandler.py", line 237, in check_response
    raise exception_class(message, screen, stacktrace)
WebDriverException: Message: connection refused



FAIL: testFunctionalTestRunner (erp5.component.test.erp5_version.testFunctionalOfficeJSoOoSpreadsheet.TestOfficejSUIoOoSpreadsheet)
----------------------------------------------------------------------
Traceback (most recent call last):
  File "/srv/slapgrid/slappart6/srv/testnode/aai/soft/a13cfe6484e2e47916d83a1af102d54d/parts/erp5/product/ERP5Type/tests/ERP5TypeFunctionalTestCase.py", line 336, in testFunctionalTestRunner
    self.assertEqual([], error_title_list, '\n'.join(error_title_list))
AssertionError: testOnlyfficeSpreadsheetErp5Synchronization


ERROR: testFunctionalTestRunner (erp5.component.test.erp5_version.testFunctionalRJSLabelField.TestRenderJSUILabelField)
----------------------------------------------------------------------
Traceback (most recent call last):
  File "/srv/slapgrid/slappart6/srv/testnode/aai/soft/a13cfe6484e2e47916d83a1af102d54d/parts/erp5/product/ERP5Type/tests/ERP5TypeFunctionalTestCase.py", line 308, in testFunctionalTestRunner
    iframe = self.runner.test(debug=debug)
  File "/srv/slapgrid/slappart6/srv/testnode/aai/soft/a13cfe6484e2e47916d83a1af102d54d/parts/erp5/product/ERP5Type/tests/ERP5TypeFunctionalTestCase.py", line 150, in test
    xvfb.run()
  File "/srv/slapgrid/slappart6/srv/testnode/aai/soft/a13cfe6484e2e47916d83a1af102d54d/parts/erp5/product/ERP5Type/tests/ERP5TypeFunctionalTestCase.py", line 116, in run
    raise EnvironmentError("All displays locked : %r" % (self.display_list,))
EnvironmentError: All displays locked : [':123', ':124', ':125', ':126', ':127', ':128', ':129', ':130', ':131', ':132', ':133', ':134', ':135', ':136', ':137', ':138', ':139', ':140', ':141', ':142', ':143']


ERROR: testFunctionalTestRunner (erp5.component.test.erp5_version.testFunctionalRJSListField.TestRenderJSUIListField)
----------------------------------------------------------------------
Traceback (most recent call last):
  File "/srv/slapgrid/slappart6/srv/testnode/aai/soft/a13cfe6484e2e47916d83a1af102d54d/parts/erp5/product/ERP5Type/tests/ERP5TypeFunctionalTestCase.py", line 308, in testFunctionalTestRunner
    iframe = self.runner.test(debug=debug)
  File "/srv/slapgrid/slappart6/srv/testnode/aai/soft/a13cfe6484e2e47916d83a1af102d54d/parts/erp5/product/ERP5Type/tests/ERP5TypeFunctionalTestCase.py", line 150, in test
    xvfb.run()
  File "/srv/slapgrid/slappart6/srv/testnode/aai/soft/a13cfe6484e2e47916d83a1af102d54d/parts/erp5/product/ERP5Type/tests/ERP5TypeFunctionalTestCase.py", line 116, in run
    raise EnvironmentError("All displays locked : %r" % (self.display_list,))
EnvironmentError: All displays locked : [':123', ':124', ':125', ':126', ':127', ':128', ':129', ':130', ':131', ':132', ':133', ':134', ':135', ':136', ':137', ':138', ':139', ':140', ':141', ':142', ':143']


FAIL: testFunctionalTestRunner (erp5.component.test.erp5_version.testFunctionalRJSListbox.TestRenderJSUIListbox)
----------------------------------------------------------------------
Traceback (most recent call last):
  File "/srv/slapgrid/slappart6/srv/testnode/aai/soft/a13cfe6484e2e47916d83a1af102d54d/parts/erp5/product/ERP5Type/tests/ERP5TypeFunctionalTestCase.py", line 336, in testFunctionalTestRunner
    self.assertEqual([], error_title_list, '\n'.join(error_title_list))
AssertionError: testSortWithPager


ERROR: test_09_Contribute (testIngestionWithFlare.TestIngestionWithFlare)
----------------------------------------------------------------------
Traceback (most recent call last):
  File "/srv/slapgrid/slappart6/srv/testnode/aai/soft/a13cfe6484e2e47916d83a1af102d54d/parts/erp5/Products/ERP5OOo/tests/testIngestion.py", line 1265, in test_09_Contribute
    self.playSequence(step_list)
  File "/srv/slapgrid/slappart6/srv/testnode/aai/soft/a13cfe6484e2e47916d83a1af102d54d/parts/erp5/Products/ERP5OOo/tests/testIngestion.py", line 972, in playSequence
    sequence_list.play(self)
  File "/srv/slapgrid/slappart6/srv/testnode/aai/soft/a13cfe6484e2e47916d83a1af102d54d/parts/erp5/product/ERP5Type/tests/Sequence.py", line 206, in play
    sequence.play(context, sequence_number=i, quiet=quiet)
  File "/srv/slapgrid/slappart6/srv/testnode/aai/soft/a13cfe6484e2e47916d83a1af102d54d/parts/erp5/product/ERP5Type/tests/Sequence.py", line 127, in play
    .play(context, sequence=self, quiet=quiet)
    Current Sequence:
      CleanUp
    > ContributeFileListWithNoType
      CleanUp
      ContributeFileListWithType
  File "/srv/slapgrid/slappart6/srv/testnode/aai/soft/a13cfe6484e2e47916d83a1af102d54d/parts/erp5/product/ERP5Type/tests/Sequence.py", line 91, in play
    method(sequence=sequence)
  File "/srv/slapgrid/slappart6/srv/testnode/aai/soft/a13cfe6484e2e47916d83a1af102d54d/parts/erp5/Products/ERP5OOo/tests/testIngestion.py", line 829, in stepContributeFileListWithNoType
    self.contributeFileList(with_portal_type=False)
  File "/srv/slapgrid/slappart6/srv/testnode/aai/soft/a13cfe6484e2e47916d83a1af102d54d/parts/erp5/Products/ERP5OOo/tests/testIngestion.py", line 338, in contributeFileList
    self.assert_('magic' in document.SearchableText())
  File "/srv/slapgrid/slappart6/srv/testnode/aai/soft/a13cfe6484e2e47916d83a1af102d54d/parts/erp5/product/ERP5Type/Base.py", line 3061, in getSearchableText
    method_value = method()
  File "/srv/slapgrid/slappart6/srv/testnode/aai/soft/a13cfe6484e2e47916d83a1af102d54d/parts/erp5/product/ERP5/mixin/text_convertable.py", line 50, in asText
    mime, data = self.convert(format='txt', **kw)
  File "/srv/slapgrid/slappart6/srv/testnode/aai/soft/a13cfe6484e2e47916d83a1af102d54d/parts/erp5/product/ERP5/mixin/document.py", line 83, in convert
    result = self._convert(format, **kw)
  File "/srv/slapgrid/slappart6/srv/testnode/aai/soft/a13cfe6484e2e47916d83a1af102d54d/parts/erp5/product/ERP5OOo/Document/OOoDocument.py", line 398, in _convert
    mime, data = self._getConversionFromProxyServer(format)
  File "/srv/slapgrid/slappart6/srv/testnode/aai/soft/a13cfe6484e2e47916d83a1af102d54d/parts/erp5/product/ERP5OOo/Document/OOoDocument.py", line 314, in _getConversionFromProxyServer
    orig_format)
  File "/srv/slapgrid/slappart6/srv/testnode/aai/soft/a13cfe6484e2e47916d83a1af102d54d/parts/erp5/product/ERP5OOo/Document/OOoDocument.py", line 111, in _proxy_function
    result_set =  func(*args, **kw)
  File "/srv/slapgrid/slappart6/srv/testnode/aai/soft/a13cfe6484e2e47916d83a1af102d54d/parts/python2.7/lib/python2.7/xmlrpclib.py", line 1243, in __call__
    return self.__send(self.__name, args)
  File "/srv/slapgrid/slappart6/srv/testnode/aai/soft/a13cfe6484e2e47916d83a1af102d54d/parts/python2.7/lib/python2.7/xmlrpclib.py", line 1602, in __request
    verbose=self.__verbose
  File "/srv/slapgrid/slappart6/srv/testnode/aai/soft/a13cfe6484e2e47916d83a1af102d54d/parts/python2.7/lib/python2.7/xmlrpclib.py", line 1283, in request
    return self.single_request(host, handler, request_body, verbose)
  File "/srv/slapgrid/slappart6/srv/testnode/aai/soft/a13cfe6484e2e47916d83a1af102d54d/parts/python2.7/lib/python2.7/xmlrpclib.py", line 1313, in single_request
    response = h.getresponse(buffering=True)
  File "/srv/slapgrid/slappart6/srv/testnode/aai/soft/a13cfe6484e2e47916d83a1af102d54d/parts/python2.7/lib/python2.7/httplib.py", line 1121, in getresponse
    response.begin()
  File "/srv/slapgrid/slappart6/srv/testnode/aai/soft/a13cfe6484e2e47916d83a1af102d54d/parts/python2.7/lib/python2.7/httplib.py", line 438, in begin
    version, status, reason = self._read_status()
  File "/srv/slapgrid/slappart6/srv/testnode/aai/soft/a13cfe6484e2e47916d83a1af102d54d/parts/python2.7/lib/python2.7/httplib.py", line 394, in _read_status
    line = self.fp.readline(_MAXLINE + 1)
  File "/srv/slapgrid/slappart6/srv/testnode/aai/soft/a13cfe6484e2e47916d83a1af102d54d/parts/python2.7/lib/python2.7/socket.py", line 480, in readline
    data = self._sock.recv(self._rbufsize)
  File "/srv/slapgrid/slappart6/srv/testnode/aai/soft/a13cfe6484e2e47916d83a1af102d54d/parts/python2.7/lib/python2.7/ssl.py", line 766, in recv
    return self.read(buflen)
  File "/srv/slapgrid/slappart6/srv/testnode/aai/soft/a13cfe6484e2e47916d83a1af102d54d/parts/python2.7/lib/python2.7/ssl.py", line 653, in read
    v = self._sslobj.read(len)
SSLError: ('The read operation timed out',)


More information about the Erp5-report mailing list