[Erp5-report] PERF r44124 : 12 Tests, 0 Errors, 12 Failures, 0 Skips

nobody at svn.erp5.org nobody at svn.erp5.org
Thu Mar 10 17:48:46 CET 2011


Test Suite: PERF
Revision: 44124
Result: FAIL

All tests: 12
Failures: 12
Errors: 0
Skips: 0



The following tests failed:

  testPerformance                                    (4 failures)
   test_00_viewBarObject (testPerformance.TestPerformance)
   test_01_viewBarModule (testPerformance.TestPerformance)
   test_02_viewFooObjectWithManyLines (testPerformance.TestPerformance)
   test_viewProxyField (testPerformance.TestPerformance)

  testPerformance                                    (4 failures)
   test_00_viewBarObject (testPerformance.TestPerformance)
   test_01_viewBarModule (testPerformance.TestPerformance)
   test_02_viewFooObjectWithManyLines (testPerformance.TestPerformance)
   test_viewProxyField (testPerformance.TestPerformance)

  testPerformance                                    (4 failures)
   test_00_viewBarObject (testPerformance.TestPerformance)
   test_01_viewBarModule (testPerformance.TestPerformance)
   test_02_viewFooObjectWithManyLines (testPerformance.TestPerformance)
   test_viewProxyField (testPerformance.TestPerformance)

-------------- next part --------------
objective time to view object form 0.1440 < 0.1567 < 0.1470

nb objects = 000100
	add = 0.0068 < 0.0057 < 0.0073
	tic = 0.0323 < 0.0294 < 0.0344
	view = 0.1480 < 0.1621 < 0.1530

nb objects = 000200
	add = 0.0068 < 0.0056 < 0.0073
	tic = 0.0323 < 0.0290 < 0.0344
	view = 0.1497 < 0.1642 < 0.1547

nb objects = 000300
	add = 0.0068 < 0.0058 < 0.0073
	tic = 0.0323 < 0.0288 < 0.0344
	view = 0.1515 < 0.1662 < 0.1565

nb objects = 000400
	add = 0.0068 < 0.0057 < 0.0073
	tic = 0.0323 < 0.0289 < 0.0344
	view = 0.1532 < 0.1680 < 0.1582

nb objects = 000500
	add = 0.0068 < 0.0057 < 0.0073
	tic = 0.0323 < 0.0288 < 0.0344
	view = 0.1549 < 0.1699 < 0.1599

nb objects = 000600
	add = 0.0068 < 0.0057 < 0.0073
	tic = 0.0323 < 0.0288 < 0.0344
	view = 0.1566 < 0.1714 < 0.1616

nb objects = 000700
	add = 0.0068 < 0.0057 < 0.0073
	tic = 0.0323 < 0.0285 < 0.0344
	view = 0.1584 < 0.1731 < 0.1634

nb objects = 000800
	add = 0.0068 < 0.0057 < 0.0073
	tic = 0.0323 < 0.0289 < 0.0344
	view = 0.1601 < 0.1745 < 0.1651

nb objects = 000900
	add = 0.0068 < 0.0058 < 0.0073
	tic = 0.0323 < 0.0284 < 0.0344
	view = 0.1618 < 0.1763 < 0.1668

nb objects = 001000
	add = 0.0068 < 0.0057 < 0.0073
	tic = 0.0323 < 0.0285 < 0.0344
	view = 0.1636 < 0.1781 < 0.1686

time to view object form with many lines 0.2800 < 0.2889 < 0.2860

time to view proxyfield form 0.2130 < 0.2271 < 0.2170

Loading Zope ... 
Cleaning static files ... 
Instance at '/home/buildbot/slave/full.PERF/build/unit_test' loaded ... 
done (14.992s)test_00_viewBarObject (testPerformance.TestPerformance) ... 
Adding ERP5TypeTestCase user ... 
Adding erp5_portal_46b1242f30d521c53e744f4886ef0be0 ERP5 Site ... done (144.502s)
Running HTTP server at bot_perf:55031
Running WebDAV server at bot_perf:55203
Adding erp5_base business template ... (imported in 16.872s) (missing dependencies : ['erp5_full_text_catalog']) done (35.466s)
Adding erp5_ui_test business template ... (imported in 4.915s) (missing dependencies : ['erp5_ui_test_core']) done (13.427s)
Executing pending activities ... 369 342 done (23.189s)
Logout ... 
done (220.779s)
Running Unit tests of Performance
FAIL
test_01_viewBarModule (testPerformance.TestPerformance) ... FAIL
test_02_viewFooObjectWithManyLines (testPerformance.TestPerformance) ... FAIL
test_viewProxyField (testPerformance.TestPerformance) ... FAIL

======================================================================
FAIL: test_00_viewBarObject (testPerformance.TestPerformance)
----------------------------------------------------------------------
Traceback (most recent call last):
  File "/home/buildbot/slave/full.PERF/build/products/ERP5Type/tests/backportUnittest.py", line 151, in run
    testMethod()
  File "/home/buildbot/slave/full.PERF/build/Products/ERP5Type/tests/testPerformance.py", line 224, in test_00_viewBarObject
    prefix='objective')
  File "/home/buildbot/slave/full.PERF/build/Products/ERP5Type/tests/testPerformance.py", line 202, in checkViewBarObject
    '%.4f < %.4f < %.4f' % (min, req_time, max))
AssertionError: 0.1440 < 0.1567 < 0.1470

======================================================================
FAIL: test_01_viewBarModule (testPerformance.TestPerformance)
----------------------------------------------------------------------
Traceback (most recent call last):
  File "/home/buildbot/slave/full.PERF/build/products/ERP5Type/tests/backportUnittest.py", line 151, in run
    testMethod()
  File "/home/buildbot/slave/full.PERF/build/Products/ERP5Type/tests/testPerformance.py", line 311, in test_01_viewBarModule
    'View: %.4f < %.4f < %.4f' % (
AssertionError: View: 0.1480 < 0.1621 < 0.1530

======================================================================
FAIL: test_02_viewFooObjectWithManyLines (testPerformance.TestPerformance)
----------------------------------------------------------------------
Traceback (most recent call last):
  File "/home/buildbot/slave/full.PERF/build/products/ERP5Type/tests/backportUnittest.py", line 151, in run
    testMethod()
  File "/home/buildbot/slave/full.PERF/build/Products/ERP5Type/tests/testPerformance.py", line 387, in test_02_viewFooObjectWithManyLines
    '%.4f < %.4f < %.4f' % (
AssertionError: 0.2800 < 0.2889 < 0.2860

======================================================================
FAIL: test_viewProxyField (testPerformance.TestPerformance)
----------------------------------------------------------------------
Traceback (most recent call last):
  File "/home/buildbot/slave/full.PERF/build/products/ERP5Type/tests/backportUnittest.py", line 151, in run
    testMethod()
  File "/home/buildbot/slave/full.PERF/build/Products/ERP5Type/tests/testPerformance.py", line 354, in test_viewProxyField
    '%.4f < %.4f < %.4f' % (
AssertionError: 0.2130 < 0.2271 < 0.2170

----------------------------------------------------------------------
Ran 4 tests in 571.331s

FAILED (failures=4)
objective time to view object form 0.1440 < 0.1565 < 0.1470

nb objects = 000100
	add = 0.0068 < 0.0056 < 0.0073
	tic = 0.0323 < 0.0294 < 0.0344
	view = 0.1480 < 0.1618 < 0.1530

nb objects = 000200
	add = 0.0068 < 0.0056 < 0.0073
	tic = 0.0323 < 0.0285 < 0.0344
	view = 0.1497 < 0.1640 < 0.1547

nb objects = 000300
	add = 0.0068 < 0.0057 < 0.0073
	tic = 0.0323 < 0.0285 < 0.0344
	view = 0.1515 < 0.1657 < 0.1565

nb objects = 000400
	add = 0.0068 < 0.0056 < 0.0073
	tic = 0.0323 < 0.0287 < 0.0344
	view = 0.1532 < 0.1676 < 0.1582

nb objects = 000500
	add = 0.0068 < 0.0056 < 0.0073
	tic = 0.0323 < 0.0287 < 0.0344
	view = 0.1549 < 0.1694 < 0.1599

nb objects = 000600
	add = 0.0068 < 0.0057 < 0.0073
	tic = 0.0323 < 0.0284 < 0.0344
	view = 0.1566 < 0.1713 < 0.1616

nb objects = 000700
	add = 0.0068 < 0.0056 < 0.0073
	tic = 0.0323 < 0.0284 < 0.0344
	view = 0.1584 < 0.1730 < 0.1634

nb objects = 000800
	add = 0.0068 < 0.0056 < 0.0073
	tic = 0.0323 < 0.0283 < 0.0344
	view = 0.1601 < 0.1745 < 0.1651

nb objects = 000900
	add = 0.0068 < 0.0057 < 0.0073
	tic = 0.0323 < 0.0284 < 0.0344
	view = 0.1618 < 0.1760 < 0.1668

nb objects = 001000
	add = 0.0068 < 0.0056 < 0.0073
	tic = 0.0323 < 0.0282 < 0.0344
	view = 0.1636 < 0.1776 < 0.1686

time to view object form with many lines 0.2800 < 0.2882 < 0.2860

time to view proxyfield form 0.2130 < 0.2264 < 0.2170

Loading Zope ... 
Cleaning static files ... 
Instance at '/home/buildbot/slave/full.PERF/build/unit_test' loaded ... 
done (13.148s)test_00_viewBarObject (testPerformance.TestPerformance) ... 
Adding ERP5TypeTestCase user ... 
Adding erp5_portal_46b1242f30d521c53e744f4886ef0be0 ERP5 Site ... done (141.978s)
Running HTTP server at bot_perf:55031
Running WebDAV server at bot_perf:55203
Adding erp5_base business template ... (imported in 16.805s) (missing dependencies : ['erp5_full_text_catalog']) done (35.372s)
Adding erp5_ui_test business template ... (imported in 4.933s) (missing dependencies : ['erp5_ui_test_core']) done (13.416s)
Executing pending activities ... 369 342 done (23.158s)
Logout ... 
done (218.053s)
Running Unit tests of Performance
FAIL
test_01_viewBarModule (testPerformance.TestPerformance) ... FAIL
test_02_viewFooObjectWithManyLines (testPerformance.TestPerformance) ... FAIL
test_viewProxyField (testPerformance.TestPerformance) ... FAIL

======================================================================
FAIL: test_00_viewBarObject (testPerformance.TestPerformance)
----------------------------------------------------------------------
Traceback (most recent call last):
  File "/home/buildbot/slave/full.PERF/build/products/ERP5Type/tests/backportUnittest.py", line 151, in run
    testMethod()
  File "/home/buildbot/slave/full.PERF/build/Products/ERP5Type/tests/testPerformance.py", line 224, in test_00_viewBarObject
    prefix='objective')
  File "/home/buildbot/slave/full.PERF/build/Products/ERP5Type/tests/testPerformance.py", line 202, in checkViewBarObject
    '%.4f < %.4f < %.4f' % (min, req_time, max))
AssertionError: 0.1440 < 0.1565 < 0.1470

======================================================================
FAIL: test_01_viewBarModule (testPerformance.TestPerformance)
----------------------------------------------------------------------
Traceback (most recent call last):
  File "/home/buildbot/slave/full.PERF/build/products/ERP5Type/tests/backportUnittest.py", line 151, in run
    testMethod()
  File "/home/buildbot/slave/full.PERF/build/Products/ERP5Type/tests/testPerformance.py", line 311, in test_01_viewBarModule
    'View: %.4f < %.4f < %.4f' % (
AssertionError: View: 0.1480 < 0.1618 < 0.1530

======================================================================
FAIL: test_02_viewFooObjectWithManyLines (testPerformance.TestPerformance)
----------------------------------------------------------------------
Traceback (most recent call last):
  File "/home/buildbot/slave/full.PERF/build/products/ERP5Type/tests/backportUnittest.py", line 151, in run
    testMethod()
  File "/home/buildbot/slave/full.PERF/build/Products/ERP5Type/tests/testPerformance.py", line 387, in test_02_viewFooObjectWithManyLines
    '%.4f < %.4f < %.4f' % (
AssertionError: 0.2800 < 0.2882 < 0.2860

======================================================================
FAIL: test_viewProxyField (testPerformance.TestPerformance)
----------------------------------------------------------------------
Traceback (most recent call last):
  File "/home/buildbot/slave/full.PERF/build/products/ERP5Type/tests/backportUnittest.py", line 151, in run
    testMethod()
  File "/home/buildbot/slave/full.PERF/build/Products/ERP5Type/tests/testPerformance.py", line 354, in test_viewProxyField
    '%.4f < %.4f < %.4f' % (
AssertionError: 0.2130 < 0.2264 < 0.2170

----------------------------------------------------------------------
Ran 4 tests in 567.253s

FAILED (failures=4)
objective time to view object form 0.1440 < 0.1561 < 0.1470

nb objects = 000100
	add = 0.0068 < 0.0056 < 0.0073
	tic = 0.0323 < 0.0294 < 0.0344
	view = 0.1480 < 0.1615 < 0.1530

nb objects = 000200
	add = 0.0068 < 0.0056 < 0.0073
	tic = 0.0323 < 0.0284 < 0.0344
	view = 0.1497 < 0.1635 < 0.1547

nb objects = 000300
	add = 0.0068 < 0.0057 < 0.0073
	tic = 0.0323 < 0.0285 < 0.0344
	view = 0.1515 < 0.1654 < 0.1565

nb objects = 000400
	add = 0.0068 < 0.0056 < 0.0073
	tic = 0.0323 < 0.0283 < 0.0344
	view = 0.1532 < 0.1672 < 0.1582

nb objects = 000500
	add = 0.0068 < 0.0056 < 0.0073
	tic = 0.0323 < 0.0282 < 0.0344
	view = 0.1549 < 0.1689 < 0.1599

nb objects = 000600
	add = 0.0068 < 0.0057 < 0.0073
	tic = 0.0323 < 0.0295 < 0.0344
	view = 0.1566 < 0.1707 < 0.1616

nb objects = 000700
	add = 0.0068 < 0.0056 < 0.0073
	tic = 0.0323 < 0.0285 < 0.0344
	view = 0.1584 < 0.1724 < 0.1634

nb objects = 000800
	add = 0.0068 < 0.0056 < 0.0073
	tic = 0.0323 < 0.0285 < 0.0344
	view = 0.1601 < 0.1738 < 0.1651

nb objects = 000900
	add = 0.0068 < 0.0057 < 0.0073
	tic = 0.0323 < 0.0284 < 0.0344
	view = 0.1618 < 0.1752 < 0.1668

nb objects = 001000
	add = 0.0068 < 0.0056 < 0.0073
	tic = 0.0323 < 0.0283 < 0.0344
	view = 0.1636 < 0.1771 < 0.1686

time to view object form with many lines 0.2800 < 0.2869 < 0.2860

time to view proxyfield form 0.2130 < 0.2259 < 0.2170

Loading Zope ... 
Cleaning static files ... 
Instance at '/home/buildbot/slave/full.PERF/build/unit_test' loaded ... 
done (13.150s)test_00_viewBarObject (testPerformance.TestPerformance) ... 
Adding ERP5TypeTestCase user ... 
Adding erp5_portal_46b1242f30d521c53e744f4886ef0be0 ERP5 Site ... done (141.572s)
Running HTTP server at bot_perf:55031
Running WebDAV server at bot_perf:55203
Adding erp5_base business template ... (imported in 16.655s) (missing dependencies : ['erp5_full_text_catalog']) done (35.216s)
Adding erp5_ui_test business template ... (imported in 4.937s) (missing dependencies : ['erp5_ui_test_core']) done (13.384s)
Executing pending activities ... 369 342 done (23.216s)
Logout ... 
done (217.510s)
Running Unit tests of Performance
FAIL
test_01_viewBarModule (testPerformance.TestPerformance) ... FAIL
test_02_viewFooObjectWithManyLines (testPerformance.TestPerformance) ... FAIL
test_viewProxyField (testPerformance.TestPerformance) ... FAIL

======================================================================
FAIL: test_00_viewBarObject (testPerformance.TestPerformance)
----------------------------------------------------------------------
Traceback (most recent call last):
  File "/home/buildbot/slave/full.PERF/build/products/ERP5Type/tests/backportUnittest.py", line 151, in run
    testMethod()
  File "/home/buildbot/slave/full.PERF/build/Products/ERP5Type/tests/testPerformance.py", line 224, in test_00_viewBarObject
    prefix='objective')
  File "/home/buildbot/slave/full.PERF/build/Products/ERP5Type/tests/testPerformance.py", line 202, in checkViewBarObject
    '%.4f < %.4f < %.4f' % (min, req_time, max))
AssertionError: 0.1440 < 0.1561 < 0.1470

======================================================================
FAIL: test_01_viewBarModule (testPerformance.TestPerformance)
----------------------------------------------------------------------
Traceback (most recent call last):
  File "/home/buildbot/slave/full.PERF/build/products/ERP5Type/tests/backportUnittest.py", line 151, in run
    testMethod()
  File "/home/buildbot/slave/full.PERF/build/Products/ERP5Type/tests/testPerformance.py", line 311, in test_01_viewBarModule
    'View: %.4f < %.4f < %.4f' % (
AssertionError: View: 0.1480 < 0.1615 < 0.1530

======================================================================
FAIL: test_02_viewFooObjectWithManyLines (testPerformance.TestPerformance)
----------------------------------------------------------------------
Traceback (most recent call last):
  File "/home/buildbot/slave/full.PERF/build/products/ERP5Type/tests/backportUnittest.py", line 151, in run
    testMethod()
  File "/home/buildbot/slave/full.PERF/build/Products/ERP5Type/tests/testPerformance.py", line 387, in test_02_viewFooObjectWithManyLines
    '%.4f < %.4f < %.4f' % (
AssertionError: 0.2800 < 0.2869 < 0.2860

======================================================================
FAIL: test_viewProxyField (testPerformance.TestPerformance)
----------------------------------------------------------------------
Traceback (most recent call last):
  File "/home/buildbot/slave/full.PERF/build/products/ERP5Type/tests/backportUnittest.py", line 151, in run
    testMethod()
  File "/home/buildbot/slave/full.PERF/build/Products/ERP5Type/tests/testPerformance.py", line 354, in test_viewProxyField
    '%.4f < %.4f < %.4f' % (
AssertionError: 0.2130 < 0.2259 < 0.2170

----------------------------------------------------------------------
Ran 4 tests in 566.361s

FAILED (failures=4)


More information about the Erp5-report mailing list