[Erp5-report] ERP5 r41845 : 4538 Tests, 16 Errors, 34 Failures, 226 Skips

nobody at svn.erp5.org nobody at svn.erp5.org
Wed Dec 29 03:10:31 CET 2010


Test Suite: ERP5
Revision: 41845
Result: FAIL

All tests: 4538
Failures: 34
Errors: 16
Skips: 226



The following tests failed:

  testApparelModel                                   (1 errors)
   test_checkCopyComposition (testApparelModel.TestApparelModel)

  testDms                                            (1 failures, 1 errors, 2 skips)
   test_safeHTML_impossible_conversion (testDms.TestDocument), Some html are not parsable.
   test_Base_getConversionFormatItemList (testDms.TestDocument)

  testDmsWithFlare                                   (2 failures, 2 errors, 2 skips)
   test_HTML_to_ODT_conversion_keep_enconding (testDmsWithFlare.TestDocumentWithFlare), This test perform an PDF conversion of HTML content
   test_safeHTML_impossible_conversion (testDmsWithFlare.TestDocumentWithFlare), Some html are not parsable.
   test_09_SearchableText (testDmsWithFlare.TestDocumentWithFlare)
   test_Base_getConversionFormatItemList (testDmsWithFlare.TestDocumentWithFlare)

  testERP5Security                                   (1 failures)
   testERP5ExternalAuthenticationPlugin (testERP5Security.TestLocalRoleManagement)

  testERP5WebCodingStyle                             (1 failures)
   test_SkinCodingStyle (testERP5WebCodingStyle.CodingStyle)

  testIngestion                                      (5 failures)
   test_06_FormatGenerationDrawing (testIngestion.TestIngestion)
   test_06_FormatGenerationPresentation (testIngestion.TestIngestion)
   test_06_FormatGenerationSpreadsheet (testIngestion.TestIngestion)
   test_06_FormatGenerationText (testIngestion.TestIngestion)
   test_11_EmailIngestion (testIngestion.TestIngestion)

  testIngestionWithFlare                             (5 failures)
   test_06_FormatGenerationDrawing (testIngestionWithFlare.TestIngestionWithFlare)
   test_06_FormatGenerationPresentation (testIngestionWithFlare.TestIngestionWithFlare)
   test_06_FormatGenerationSpreadsheet (testIngestionWithFlare.TestIngestionWithFlare)
   test_06_FormatGenerationText (testIngestionWithFlare.TestIngestionWithFlare)
   test_10_MetadataSettingPreferenceOrder (testIngestionWithFlare.TestIngestionWithFlare)

  testInvalidationBug                                (1 failures)
   testCommitOrder (testInvalidationBug.TestInvalidationBug), Check order of resources being committed

  testKMGadget                                       (1 failures)
   test_02 (testKMGadget.TestGadgets), Check Gadgets

  testLegacyTradeModelLine                           (4 failures)
   test_01c_PackingListSplitBuildInvoiceBuild (Products.ERP5.tests.testTradeModelLine.TestTradeModelLineSale)
   test_tradeModelLineWithRounding (Products.ERP5.tests.testTradeModelLine.TestTradeModelLineSale)
   test_01c_PackingListSplitBuildInvoiceBuild (Products.ERP5.tests.testTradeModelLinePurchase.TestTradeModelLinePurchase)
   test_tradeModelLineWithRounding (Products.ERP5.tests.testTradeModelLinePurchase.TestTradeModelLinePurchase)

  testOOoConversionCache                             (1 failures, 1 errors)
   test_04_PersistentCacheConversionWithFlare (testOOoConversionCache.TestDocumentConversionCache)
   test_04_PersistentCacheConversionWithFlare (testOOoConversionCache.TestDocumentConversionCache)

  testOOoImport                                      (1 errors)
   test_CategoryTool_importCategoryFileExpirationSupport (testOOoImport.TestOOoImportWeb), Import category file with expiration request, and do it again to be

  testOpenOrder                                      (1 failures, 2 errors)
   testBuildingSaleOrder (testOpenOrder.TestOpenOrder)
   testOpenOrderRule (testOpenOrder.TestOpenOrder)
   testPeriodicityDateList (testOpenOrder.TestOpenOrder)

  testPayroll                                        (5 failures, 5 errors)
   test_AccountingLineGeneration (testPayroll.TestPayroll)
   test_NetSalaryReport (testPayroll.TestPayroll)
   test_PaySheetTransaction_getMovementList (testPayroll.TestPayroll)
   test_PayrollTaxesReport (testPayroll.TestPayroll)
   test_PayrollTaxesReportDifferentSalaryRange (testPayroll.TestPayroll)
   test_complexSliceOnModelLine (testPayroll.TestPayroll)
   test_paySheetCalculationWithBonus (testPayroll.TestPayroll)
   test_sliceOnModelLine (testPayroll.TestPayroll)
   test_sourceSectionIsSetOnMovements (testPayroll.TestPayroll)
   test_updatePaysheetAfterModelModification (testPayroll.TestPayroll), generate a paysheet using a model, modify the model by adding a new

  testPayroll_l10n_fr                                (1 failures)
   test_01_getYearToDateSlice (testPayroll_l10n_fr.TestPayroll_l10n_fr), Check that is possible to calculate the total amount spend on a slice

  testSpellChecking                                  (3 errors)
   test_business_template_list_with_workflow_template_item (testSpellChecking.TestSpellChecking)

  testSupply                                         (3 failures)
   testSupplyCellPropertyAndAccessor (testSupply.TestSaleSupply)
   testSupplyCellPropertyAndAccessor (testSupply.TestPurchaseSupply)
   testSupplyCellPropertyAndAccessor (testSupply.TestInternalSupply)

  testTradeModelLine                                 (1 failures)
   test_tradeModelLineWithRounding (testTradeModelLine.TestTradeModelLineSale)

  testTradeModelLinePurchase                         (1 failures)
   test_tradeModelLineWithRounding (testTradeModelLinePurchase.TestTradeModelLinePurchase)

The following tests were at least partly skipped:

  testAccountingRules                                (26 skips)

  testAdvancedInvoicing                              (4 skips)

  testBPMCore                                        (12 skips)

  testBPMEvaluation                                  (40 skips)
   done (7.309s)test_confirming (testBPMEvaluation.TestOrderDefaultProcess) ... skipped 'broken since r39918'
   test_transition (testBPMEvaluation.TestOrderDefaultProcess) ... skipped 'broken since r39918'
   test_transition_line_edit (testBPMEvaluation.TestOrderDefaultProcess) ... skipped 'broken since r39918'
   test_transition_line_edit_add (testBPMEvaluation.TestOrderDefaultProcess) ... skipped 'broken since r39918'
   test_transition_line_edit_add_many_transactions (testBPMEvaluation.TestOrderDefaultProcess) ... skipped 'broken since r39918'
   test_transition_line_edit_add_same_resource (testBPMEvaluation.TestOrderDefaultProcess) ... skipped 'broken since r39918'
   test_transition_line_edit_add_same_resource_edit_again (testBPMEvaluation.TestOrderDefaultProcess) ... skipped 'broken since r39918'
   test_transition_split (testBPMEvaluation.TestOrderDefaultProcess) ... skipped 'broken since r39918'
   test_transition_split_line_add (testBPMEvaluation.TestOrderDefaultProcess) ... skipped 'broken since r39918'
   test_transition_split_line_add_split (testBPMEvaluation.TestOrderDefaultProcess) ... skipped 'broken since r39918'
   test_starting (testBPMEvaluation.TestPackingListDefaultProcess) ... skipped 'broken since r39918'
   test_transition (testBPMEvaluation.TestPackingListDefaultProcess) ... skipped 'broken since r39918'
   test_transition_line_edit (testBPMEvaluation.TestPackingListDefaultProcess) ... skipped 'broken since r39918'
   test_transition_line_edit_add (testBPMEvaluation.TestPackingListDefaultProcess) ... skipped 'broken since r39918'
   test_transition_line_edit_add_many_transactions (testBPMEvaluation.TestPackingListDefaultProcess) ... skipped 'broken since r39918'
   test_transition_line_edit_add_same_resource (testBPMEvaluation.TestPackingListDefaultProcess) ... skipped 'broken since r39918'
   test_transition_line_edit_add_same_resource_edit_again (testBPMEvaluation.TestPackingListDefaultProcess) ... skipped 'broken since r39918'
   test_transition_split (testBPMEvaluation.TestPackingListDefaultProcess) ... skipped 'broken since r39918'
   test_transition_split_line_add (testBPMEvaluation.TestPackingListDefaultProcess) ... skipped 'broken since r39918'
   test_transition_split_line_add_split (testBPMEvaluation.TestPackingListDefaultProcess) ... skipped 'broken since r39918'
   test_confirming (testBPMEvaluation.TestOrderDifferentProcess) ... skipped 'broken since r39918'
   test_transition (testBPMEvaluation.TestOrderDifferentProcess) ... skipped 'broken since r39918'
   test_transition_line_edit (testBPMEvaluation.TestOrderDifferentProcess) ... skipped 'broken since r39918'
   test_transition_line_edit_add (testBPMEvaluation.TestOrderDifferentProcess) ... skipped 'broken since r39918'
   test_transition_line_edit_add_many_transactions (testBPMEvaluation.TestOrderDifferentProcess) ... skipped 'broken since r39918'
   test_transition_line_edit_add_same_resource (testBPMEvaluation.TestOrderDifferentProcess) ... skipped 'broken since r39918'
   test_transition_line_edit_add_same_resource_edit_again (testBPMEvaluation.TestOrderDifferentProcess) ... skipped 'broken since r39918'
   test_transition_split (testBPMEvaluation.TestOrderDifferentProcess) ... skipped 'broken since r39918'
   test_transition_split_line_add (testBPMEvaluation.TestOrderDifferentProcess) ... skipped 'broken since r39918'
   test_transition_split_line_add_split (testBPMEvaluation.TestOrderDifferentProcess) ... skipped 'broken since r39918'
   test_starting (testBPMEvaluation.TestPackingListDifferentProcess) ... skipped 'broken since r39918'
   test_transition (testBPMEvaluation.TestPackingListDifferentProcess) ... skipped 'broken since r39918'
   test_transition_line_edit (testBPMEvaluation.TestPackingListDifferentProcess) ... skipped 'broken since r39918'
   test_transition_line_edit_add (testBPMEvaluation.TestPackingListDifferentProcess) ... skipped 'broken since r39918'
   test_transition_line_edit_add_many_transactions (testBPMEvaluation.TestPackingListDifferentProcess) ... skipped 'broken since r39918'
   test_transition_line_edit_add_same_resource (testBPMEvaluation.TestPackingListDifferentProcess) ... skipped 'broken since r39918'
   test_transition_line_edit_add_same_resource_edit_again (testBPMEvaluation.TestPackingListDifferentProcess) ... skipped 'broken since r39918'
   test_transition_split (testBPMEvaluation.TestPackingListDifferentProcess) ... skipped 'broken since r39918'
   test_transition_split_line_add (testBPMEvaluation.TestPackingListDifferentProcess) ... skipped 'broken since r39918'
   test_transition_split_line_add_split (testBPMEvaluation.TestPackingListDifferentProcess) ... skipped 'broken since r39918'

  testBase                                           (3 skips)
   test_NonIndexable (testBase.TestBase), check if a document is not indexed where we set isIndexable=0 in the same transaction of newContent(). ... skipped 'isIndexable is not designed to work like tested here, this test       must be rewritten once we know how to handle correctly templates'
   test_NonIndexable2 (testBase.TestBase), check if a document is not indexed where we call edit() and set isIndexable=0 after it is already indexed. ... skipped 'isIndexable is not designed to work like tested here, this test       must be rewritten once we know how to handle correctly templates'
   test_NonIndexable3 (testBase.TestBase), check if a document is not indexed where we set isIndexable=0 and call edit() after it is already indexed. ... skipped 'isIndexable is not designed to work like tested here, this test       must be rewritten once we know how to handle correctly templates'

  testBusinessTemplate                               (3 skips)

  testCRM                                            (1 skips)

  testConversionInSimulation                         (4 skips)

  testDeliveryBuilderToSupportMultipleLines          (2 skips)

  testDivergenceTester                               (5 skips)

  testDms                                            (2 skips)

  testDmsWithFlare                                   (2 skips)

  testDynamicClassGeneration                         (1 skips)

  testERP5Base                                       (1 skips)

  testERP5Catalog                                    (4 skips)
   test_49_IndexInOrderedSearchFolder (testERP5Catalog.TestERP5Catalog) ... skipped 'TODO ERP5'
   test_SubDocumentsWithAcquireLocalRoleSecurityIndexing (testERP5Catalog.TestERP5Catalog) ... skipped 'TODO ERP5'
   test_sortOnRelatedKeyWithUnsetRelation (testERP5Catalog.TestERP5Catalog) ... skipped 'TODO ERP5'

  testERP5Discussion                                 (1 skips)

  testERP5Interfaces                                 (9 skips)

  testERP5Type                                       (1 skips)

  testERP5TypeInterfaces                             (1 skips)

  testERP5Web                                        (2 skips)

  testFormPrintoutAsODT                              (1 skips)
   test_09_FieldReplacementWithValidation (testFormPrintoutAsODT.TestFormPrintoutAsODT) ... skipped 'Disable validation because OOo does not produce compliant xml, and RelaxNG status is still draft'

  testICal                                           (1 skips)

  testImmobilisation                                 (2 skips)

  testInventoryAPI                                   (2 skips)

  testInvoice                                        (7 skips)

  testItem                                           (13 skips)

  testLegacyMRP                                      (4 skips)
   test_TransformationRule_expand_concurrent (Products.ERP5.tests.testMRP.TestMRPImplementation) ... skipped 'Unfinished experimental feature'
   test_TransformationRule_expand_reexpand (Products.ERP5.tests.testMRP.TestMRPImplementation) ... skipped 'Unfinished experimental feature'
   test_TransformationRule_getHeadProductionPathList (Products.ERP5.tests.testMRP.TestMRPImplementation) ... skipped 'Unfinished experimental feature'
   test_TransformationSourcingRule_expand (Products.ERP5.tests.testMRP.TestMRPImplementation) ... skipped 'Unfinished experimental feature'

  testLegacyProjectAndTask                           (1 skips)

  testLegacySimulationInventoryAPI                   (2 skips)

  testMRP                                            (5 skips)
   test_TransformationRule_expand_concurrent (testMRP.TestMRPImplementation) ... skipped 'Unfinished experimental feature'
   test_TransformationRule_expand_reexpand (testMRP.TestMRPImplementation) ... skipped 'Unfinished experimental feature'
   test_TransformationRule_getHeadProductionPathList (testMRP.TestMRPImplementation) ... skipped 'Unfinished experimental feature'
   test_TransformationSourcingRule_expand (testMRP.TestMRPImplementation) ... skipped 'Unfinished experimental feature'

  testOrderBuilder                                   (4 skips)

  testPackingList                                    (16 skips)

  testPackingListRoundingPrecision                   (8 skips)

  testPreferences                                    (1 skips)

  testProductionOrder                                (8 skips)

  testProductionOrderApparel                         (6 skips)

  testProductionPackingList                          (1 skips)

  testProductionPackingListApparel                   (1 skips)

  testProject                                        (1 skips)

  testProxyField                                     (1 skips)

  testReturnedSalePackingList                        (3 skips)

  testSQLCachedWorklist                              (1 skips)
   test_02_related_key (testSQLCachedWorklist.TestSQLCachedWorklist) ... skipped 'TODO ERP5'

  testSelectionTool                                  (7 skips)
   skipped 'Test to be written'
   testPage (testSelectionTool.TestSelectionTool) ... skipped 'Test to be written'
   testView (testSelectionTool.TestSelectionTool) ... skipped 'Test to be written'
   skipped 'Test to be written'
   testDeleteGlobalSelection (testSelectionTool.TestSelectionToolMemcachedStorage) ... skipped 'To be decided if implementation is required'
   testPage (testSelectionTool.TestSelectionToolMemcachedStorage) ... skipped 'Test to be written'
   testView (testSelectionTool.TestSelectionToolMemcachedStorage) ... skipped 'Test to be written'

  testTaskReportDivergence                           (4 skips)

  testTemplate                                       (1 skips)

  testWebDavSupport                                  (1 skips)
-------------- next part --------------
A non-text attachment was scrubbed...
Name: summary.diff
Type: text/x-diff
Size: 4453 bytes
Desc: not available
URL: <http://mail.tiolive.com/pipermail/erp5-report/attachments/20101229/c6334726/attachment-0001.diff>
-------------- next part --------------

ERROR: test_checkCopyComposition (testApparelModel.TestApparelModel)
----------------------------------------------------------------------
Traceback (most recent call last):
  File "/home/buildbot/slave/full.ERP5/build/products/ERP5Type/tests/backportUnittest.py", line 151, in run
    testMethod()
  File "/home/buildbot/slave/full.ERP5/build/unit_test.5/Products/ERP5/tests/testApparelModel.py", line 145, in test_checkCopyComposition
    apparel_model.ApparelModel_copyComposition()
  File "/usr/lib/erp5/lib/python/Shared/DC/Scripts/Bindings.py", line 311, in __call__
    return self._bindAndExec(args, kw, None)
  File "/usr/lib/erp5/lib/python/Shared/DC/Scripts/Bindings.py", line 348, in _bindAndExec
    return self._exec(bound_data, args, kw)
  File "/home/buildbot/slave/full.ERP5/build/unit_test.2/Products/ERP5Type/tests/ERP5TypeTestCase.py", line 1267, in _exec
    return PythonScript_exec(self, *args)
  File "/usr/lib/erp5/lib/python/Products/PythonScripts/PythonScript.py", line 325, in _exec
    result = f(*args, **kw)
  File "Script (Python)", line 35, in ApparelModel_copyComposition
AttributeError: setQuantity


ERROR: test_safeHTML_impossible_conversion (testDms.TestDocument), Some html are not parsable.
----------------------------------------------------------------------
Traceback (most recent call last):
  File "/home/buildbot/slave/full.ERP5/build/products/ERP5Type/tests/backportUnittest.py", line 151, in run
    testMethod()
  File "/home/buildbot/slave/full.ERP5/build/unit_test.5/Products/ERP5OOo/tests/testDms.py", line 1654, in test_safeHTML_impossible_conversion
    web_page.edit(text_content=html_content)
  File "/home/buildbot/slave/full.ERP5/build/unit_test.1/Products/ERP5Type/Base.py", line 238, in __call__
    result = apply(self.__dict__['_m'], (instance,) + args, kw)
  File "/home/buildbot/slave/full.ERP5/build/unit_test.2/Products/ERP5/Document/File.py", line 117, in _edit
    Base._edit(self, **kw)
  File "/home/buildbot/slave/full.ERP5/build/unit_test.1/Products/ERP5Type/Base.py", line 1694, in _edit
    unmodified_key_list = setChangedPropertyList(unordered_key_list)
  File "/home/buildbot/slave/full.ERP5/build/unit_test.1/Products/ERP5Type/Base.py", line 1678, in setChangedPropertyList
    modified_object_list = _setProperty(key, kw[key])
  File "/home/buildbot/slave/full.ERP5/build/unit_test.1/Products/ERP5Type/Base.py", line 206, in __call__
    return apply(self.__dict__['_m'], (instance,) + args, kw)
  File "/home/buildbot/slave/full.ERP5/build/unit_test.1/Products/ERP5Type/Base.py", line 1468, in _setProperty
    return method(value, **kw)
  File "/home/buildbot/slave/full.ERP5/build/unit_test.1/Products/ERP5Type/Base.py", line 253, in __call__
    wf[wf_id].notifySuccess(instance, transition_list, result, args=args, kw=kw)
  File "/home/buildbot/slave/full.ERP5/build/unit_test.4/Products/ERP5/InteractionWorkflow.py", line 302, in notifySuccess
    script(sci)  # May throw an exception
  File "/usr/lib/erp5/lib/python/Shared/DC/Scripts/Bindings.py", line 311, in __call__
    return self._bindAndExec(args, kw, None)
  File "/usr/lib/erp5/lib/python/Shared/DC/Scripts/Bindings.py", line 348, in _bindAndExec
    return self._exec(bound_data, args, kw)
  File "/home/buildbot/slave/full.ERP5/build/unit_test.2/Products/ERP5Type/tests/ERP5TypeTestCase.py", line 1267, in _exec
    return PythonScript_exec(self, *args)
  File "/usr/lib/erp5/lib/python/Products/PythonScripts/PythonScript.py", line 325, in _exec
    result = f(*args, **kw)
  File "Script (Python)", line 3, in updateContentMd5
  File "/home/buildbot/slave/full.ERP5/build/unit_test.1/Products/ERP5/mixin/cached_convertable.py", line 250, in updateContentMd5
    mime, data = self.convert(None)
  File "/home/buildbot/slave/full.ERP5/build/unit_test.2/Products/ERP5/mixin/document.py", line 70, in convert
    result = self._convert(format, **kw)
  File "/home/buildbot/slave/full.ERP5/build/unit_test.1/Products/ERP5/Document/TextDocument.py", line 161, in _convert
    mimetype=src_mimetype,
  File "/home/buildbot/slave/full.ERP5/build/unit_test.1/Products/PortalTransforms/TransformEngine.py", line 219, in convertToData
    context, **kwargs)
  File "/home/buildbot/slave/full.ERP5/build/unit_test.1/Products/PortalTransforms/TransformEngine.py", line 179, in convertTo
    usedby=usedby, **kwargs)
  File "/home/buildbot/slave/full.ERP5/build/unit_test.1/Products/PortalTransforms/Transform.py", line 191, in convert
    return self._v_transform.convert(*args, **kwargs)
  File "/home/buildbot/slave/full.ERP5/build/unit_test.1/Products/PortalTransforms/transforms/safe_html.py", line 407, in convert
    default_encoding=self.config.get('default_encoding', 'utf-8'))
  File "/home/buildbot/slave/full.ERP5/build/unit_test.1/Products/PortalTransforms/transforms/safe_html.py", line 279, in scrubHTML
    parser.feed(html)
  File "/usr/lib64/python2.4/HTMLParser.py", line 108, in feed
    self.goahead(0)
  File "/usr/lib64/python2.4/HTMLParser.py", line 148, in goahead
    k = self.parse_starttag(i)
  File "/usr/lib64/python2.4/HTMLParser.py", line 226, in parse_starttag
    endpos = self.check_for_whole_start_tag(i)
  File "/usr/lib64/python2.4/HTMLParser.py", line 301, in check_for_whole_start_tag
    self.error("malformed start tag")
  File "/usr/lib64/python2.4/HTMLParser.py", line 115, in error
    raise HTMLParseError(message, self.getpos())
HTMLParseError: malformed start tag, at line 2, column 237


FAIL: test_Base_getConversionFormatItemList (testDms.TestDocument)
----------------------------------------------------------------------
Traceback (most recent call last):
  File "/home/buildbot/slave/full.ERP5/build/products/ERP5Type/tests/backportUnittest.py", line 151, in run
    testMethod()
  File "/home/buildbot/slave/full.ERP5/build/unit_test.5/Products/ERP5OOo/tests/testDms.py", line 662, in test_Base_getConversionFormatItemList
    self.assertTrue(('DocBook', 'docbook.xml') in
AssertionError


ERROR: test_HTML_to_ODT_conversion_keep_enconding (testDmsWithFlare.TestDocumentWithFlare), This test perform an PDF conversion of HTML content
----------------------------------------------------------------------
Traceback (most recent call last):
  File "/home/buildbot/slave/full.ERP5/build/products/ERP5Type/tests/backportUnittest.py", line 151, in run
    testMethod()
  File "/home/buildbot/slave/full.ERP5/build/unit_test.5/Products/ERP5OOo/tests/testDms.py", line 1406, in test_HTML_to_ODT_conversion_keep_enconding
    mime_type, pdf_data = web_page.convert('pdf')
  File "/home/buildbot/slave/full.ERP5/build/unit_test.2/Products/ERP5/mixin/document.py", line 70, in convert
    result = self._convert(format, **kw)
  File "/home/buildbot/slave/full.ERP5/build/unit_test.1/Products/ERP5/Document/TextDocument.py", line 161, in _convert
    mimetype=src_mimetype,
  File "/home/buildbot/slave/full.ERP5/build/unit_test.1/Products/PortalTransforms/TransformEngine.py", line 219, in convertToData
    context, **kwargs)
  File "/home/buildbot/slave/full.ERP5/build/unit_test.1/Products/PortalTransforms/TransformEngine.py", line 179, in convertTo
    usedby=usedby, **kwargs)
  File "/home/buildbot/slave/full.ERP5/build/unit_test.1/Products/PortalTransforms/chain.py", line 49, in convert
    data = transform.convert(orig, data, **kwargs)
  File "/home/buildbot/slave/full.ERP5/build/unit_test.1/Products/PortalTransforms/Transform.py", line 191, in convert
    return self._v_transform.convert(*args, **kwargs)
  File "/home/buildbot/slave/full.ERP5/build/unit_test.2/Products/ERP5OOo/transforms/odt_to_pdf.py", line 31, in convert
    doc = OOOdCommandTransform(context, filename, data, self.inputs[0])
  File "/home/buildbot/slave/full.ERP5/build/unit_test.2/Products/ERP5OOo/transforms/oood_commandtransform.py", line 77, in __init__
    tmp_ooo.convertToBaseFormat()
  File "/home/buildbot/slave/full.ERP5/build/unit_test.2/Products/ERP5/mixin/base_convertable.py", line 62, in convertToBaseFormat
    message = self._convertToBaseFormat() # Call implemetation method
  File "/home/buildbot/slave/full.ERP5/build/unit_test.1/Products/ERP5OOo/Document/OOoDocument.py", line 468, in _convertToBaseFormat
    raise ConversionError(
ConversionError: OOoDocument: Error converting document to base format. (Code 402: 10)


ERROR: test_safeHTML_impossible_conversion (testDmsWithFlare.TestDocumentWithFlare), Some html are not parsable.
----------------------------------------------------------------------
Traceback (most recent call last):
  File "/home/buildbot/slave/full.ERP5/build/products/ERP5Type/tests/backportUnittest.py", line 151, in run
    testMethod()
  File "/home/buildbot/slave/full.ERP5/build/unit_test.5/Products/ERP5OOo/tests/testDms.py", line 1654, in test_safeHTML_impossible_conversion
    web_page.edit(text_content=html_content)
  File "/home/buildbot/slave/full.ERP5/build/unit_test.1/Products/ERP5Type/Base.py", line 238, in __call__
    result = apply(self.__dict__['_m'], (instance,) + args, kw)
  File "/home/buildbot/slave/full.ERP5/build/unit_test.2/Products/ERP5/Document/File.py", line 117, in _edit
    Base._edit(self, **kw)
  File "/home/buildbot/slave/full.ERP5/build/unit_test.1/Products/ERP5Type/Base.py", line 1694, in _edit
    unmodified_key_list = setChangedPropertyList(unordered_key_list)
  File "/home/buildbot/slave/full.ERP5/build/unit_test.1/Products/ERP5Type/Base.py", line 1678, in setChangedPropertyList
    modified_object_list = _setProperty(key, kw[key])
  File "/home/buildbot/slave/full.ERP5/build/unit_test.1/Products/ERP5Type/Base.py", line 206, in __call__
    return apply(self.__dict__['_m'], (instance,) + args, kw)
  File "/home/buildbot/slave/full.ERP5/build/unit_test.1/Products/ERP5Type/Base.py", line 1468, in _setProperty
    return method(value, **kw)
  File "/home/buildbot/slave/full.ERP5/build/unit_test.1/Products/ERP5Type/Base.py", line 253, in __call__
    wf[wf_id].notifySuccess(instance, transition_list, result, args=args, kw=kw)
  File "/home/buildbot/slave/full.ERP5/build/unit_test.4/Products/ERP5/InteractionWorkflow.py", line 302, in notifySuccess
    script(sci)  # May throw an exception
  File "/usr/lib/erp5/lib/python/Shared/DC/Scripts/Bindings.py", line 311, in __call__
    return self._bindAndExec(args, kw, None)
  File "/usr/lib/erp5/lib/python/Shared/DC/Scripts/Bindings.py", line 348, in _bindAndExec
    return self._exec(bound_data, args, kw)
  File "/home/buildbot/slave/full.ERP5/build/unit_test.2/Products/ERP5Type/tests/ERP5TypeTestCase.py", line 1267, in _exec
    return PythonScript_exec(self, *args)
  File "/usr/lib/erp5/lib/python/Products/PythonScripts/PythonScript.py", line 325, in _exec
    result = f(*args, **kw)
  File "Script (Python)", line 3, in updateContentMd5
  File "/home/buildbot/slave/full.ERP5/build/unit_test.1/Products/ERP5/mixin/cached_convertable.py", line 250, in updateContentMd5
    mime, data = self.convert(None)
  File "/home/buildbot/slave/full.ERP5/build/unit_test.2/Products/ERP5/mixin/document.py", line 70, in convert
    result = self._convert(format, **kw)
  File "/home/buildbot/slave/full.ERP5/build/unit_test.1/Products/ERP5/Document/TextDocument.py", line 161, in _convert
    mimetype=src_mimetype,
  File "/home/buildbot/slave/full.ERP5/build/unit_test.1/Products/PortalTransforms/TransformEngine.py", line 219, in convertToData
    context, **kwargs)
  File "/home/buildbot/slave/full.ERP5/build/unit_test.1/Products/PortalTransforms/TransformEngine.py", line 179, in convertTo
    usedby=usedby, **kwargs)
  File "/home/buildbot/slave/full.ERP5/build/unit_test.1/Products/PortalTransforms/Transform.py", line 191, in convert
    return self._v_transform.convert(*args, **kwargs)
  File "/home/buildbot/slave/full.ERP5/build/unit_test.1/Products/PortalTransforms/transforms/safe_html.py", line 407, in convert
    default_encoding=self.config.get('default_encoding', 'utf-8'))
  File "/home/buildbot/slave/full.ERP5/build/unit_test.1/Products/PortalTransforms/transforms/safe_html.py", line 279, in scrubHTML
    parser.feed(html)
  File "/usr/lib64/python2.4/HTMLParser.py", line 108, in feed
    self.goahead(0)
  File "/usr/lib64/python2.4/HTMLParser.py", line 148, in goahead
    k = self.parse_starttag(i)
  File "/usr/lib64/python2.4/HTMLParser.py", line 226, in parse_starttag
    endpos = self.check_for_whole_start_tag(i)
  File "/usr/lib64/python2.4/HTMLParser.py", line 301, in check_for_whole_start_tag
    self.error("malformed start tag")
  File "/usr/lib64/python2.4/HTMLParser.py", line 115, in error
    raise HTMLParseError(message, self.getpos())
HTMLParseError: malformed start tag, at line 2, column 237


FAIL: test_09_SearchableText (testDmsWithFlare.TestDocumentWithFlare)
----------------------------------------------------------------------
Traceback (most recent call last):
  File "/home/buildbot/slave/full.ERP5/build/products/ERP5Type/tests/backportUnittest.py", line 151, in run
    testMethod()
  File "/home/buildbot/slave/full.ERP5/build/unit_test.5/Products/ERP5OOo/tests/testDms.py", line 849, in test_09_SearchableText
    getAdvancedSearchTextResultList('%s reference:%s language:%s' \
  File "/home/buildbot/slave/full.ERP5/build/unit_test.2/Products/ERP5Type/tests/ERP5TypeTestCase.py", line 756, in failIfDifferentSet
    self.assertEquals(set(a), set(b), msg)
AssertionError: [<Web Page at /erp5_portal_efe675ffc6dff92eecfb7dac1e0cc9a6/web_page_module/1>] != []


FAIL: test_Base_getConversionFormatItemList (testDmsWithFlare.TestDocumentWithFlare)
----------------------------------------------------------------------
Traceback (most recent call last):
  File "/home/buildbot/slave/full.ERP5/build/products/ERP5Type/tests/backportUnittest.py", line 151, in run
    testMethod()
  File "/home/buildbot/slave/full.ERP5/build/unit_test.5/Products/ERP5OOo/tests/testDms.py", line 662, in test_Base_getConversionFormatItemList
    self.assertTrue(('DocBook', 'docbook.xml') in
AssertionError


FAIL: testERP5ExternalAuthenticationPlugin (testERP5Security.TestLocalRoleManagement)
----------------------------------------------------------------------
Traceback (most recent call last):
  File "/home/buildbot/slave/full.ERP5/build/products/ERP5Type/tests/backportUnittest.py", line 151, in run
    testMethod()
  File "/home/buildbot/slave/full.ERP5/build/unit_test.5/Products/ERP5Security/tests/testERP5Security.py", line 767, in testERP5ExternalAuthenticationPlugin
    self.assertEqual(response.getStatus(), 200)
AssertionError: 302 != 200


FAIL: test_SkinCodingStyle (testERP5WebCodingStyle.CodingStyle)
----------------------------------------------------------------------
Traceback (most recent call last):
  File "/home/buildbot/slave/full.ERP5/build/products/ERP5Type/tests/backportUnittest.py", line 151, in run
    testMethod()
  File "/home/buildbot/slave/full.ERP5/build/unit_test.5/Products/ERP5Type/tests/CodingStyleTestCase.py", line 96, in test_SkinCodingStyle
    raise self.failureException('\n'.join(map(lambda x: repr(x), message_list)))
AssertionError: <ObjectMessage object at 0x6793ab8
  'object_relative_url': '/portal_skins/erp5_web_crm/EventModule_addWebMessage'
  'message': 'Wrong prefix EventModule for python script EventModule_addWebMessage'
  'mapping': {}>
<ObjectMessage object at 0x5b107e8
  'object_relative_url': '/portal_skins/erp5_web_crm/WebMessage_viewWebFormInformation'
  'message': 'Wrong prefix WebMessage for python script WebMessage_viewWebFormInformation'
  'mapping': {}>


FAIL: test_06_FormatGenerationDrawing (testIngestion.TestIngestion)
----------------------------------------------------------------------
Traceback (most recent call last):
  File "/home/buildbot/slave/full.ERP5/build/products/ERP5Type/tests/backportUnittest.py", line 151, in run
    testMethod()
  File "/home/buildbot/slave/full.ERP5/build/unit_test.2/Products/ERP5OOo/tests/testIngestion.py", line 1219, in test_06_FormatGenerationDrawing
    self.playSequence(step_list)
  File "/home/buildbot/slave/full.ERP5/build/unit_test.2/Products/ERP5OOo/tests/testIngestion.py", line 961, in playSequence
    sequence_list.play(self)
  File "/home/buildbot/slave/full.ERP5/build/unit_test.1/Products/ERP5Type/tests/Sequence.py", line 195, in play
    sequence.play(context, sequence_number=i, quiet=quiet)
  File "/home/buildbot/slave/full.ERP5/build/unit_test.1/Products/ERP5Type/tests/Sequence.py", line 115, in play
    self._step_list[self._played_index] \
    Current Sequence:
      CleanUp
      CreateDrawingDocument
    > CheckDrawingDocumentExportList
  File "/home/buildbot/slave/full.ERP5/build/unit_test.1/Products/ERP5Type/tests/Sequence.py", line 98, in play
    method(sequence=sequence)
  File "/home/buildbot/slave/full.ERP5/build/unit_test.2/Products/ERP5OOo/tests/testIngestion.py", line 766, in stepCheckDrawingDocumentExportList
    self.checkDocumentExportList(document, 'sxd', ['jpg', 'draw.pdf', 'svg'])
  File "/home/buildbot/slave/full.ERP5/build/unit_test.2/Products/ERP5OOo/tests/testIngestion.py", line 290, in checkDocumentExportList
    self.assertTrue(target in target_list, 'target:%r not in %r' % (target,
AssertionError: target:'draw.pdf' not in ['pbm', 'wmf', 'sdd', 'emf', 'met', 'tif', 'tiff', 'odg', 'odp', 'sdd', 'sxi', 'eps', 'svg', 'sxd', 'pct', 'pict', 'xhtml', 'xpm', 'pdf', 'pot', 'gif', 'png', 'ras', 'jpg', 'jpeg', 'jfif', 'jif', 'jpe', 'htm', 'ppt', 'pps', 'otp', 'pgm', 'bmp', 'ppm', 'svm', 'otg', 'htm', 'odg', 'sxd', 'sda']


FAIL: test_06_FormatGenerationPresentation (testIngestion.TestIngestion)
----------------------------------------------------------------------
Traceback (most recent call last):
  File "/home/buildbot/slave/full.ERP5/build/products/ERP5Type/tests/backportUnittest.py", line 151, in run
    testMethod()
  File "/home/buildbot/slave/full.ERP5/build/unit_test.2/Products/ERP5OOo/tests/testIngestion.py", line 1212, in test_06_FormatGenerationPresentation
    self.playSequence(step_list)
  File "/home/buildbot/slave/full.ERP5/build/unit_test.2/Products/ERP5OOo/tests/testIngestion.py", line 961, in playSequence
    sequence_list.play(self)
  File "/home/buildbot/slave/full.ERP5/build/unit_test.1/Products/ERP5Type/tests/Sequence.py", line 195, in play
    sequence.play(context, sequence_number=i, quiet=quiet)
  File "/home/buildbot/slave/full.ERP5/build/unit_test.1/Products/ERP5Type/tests/Sequence.py", line 115, in play
    self._step_list[self._played_index] \
    Current Sequence:
      CleanUp
      CreatePresentationDocument
    > CheckPresentationDocumentExportList
  File "/home/buildbot/slave/full.ERP5/build/unit_test.1/Products/ERP5Type/tests/Sequence.py", line 98, in play
    method(sequence=sequence)
  File "/home/buildbot/slave/full.ERP5/build/unit_test.2/Products/ERP5OOo/tests/testIngestion.py", line 761, in stepCheckPresentationDocumentExportList
    self.checkDocumentExportList(document, 'ppt', ['impr.pdf', 'ppt'])
  File "/home/buildbot/slave/full.ERP5/build/unit_test.2/Products/ERP5OOo/tests/testIngestion.py", line 290, in checkDocumentExportList
    self.assertTrue(target in target_list, 'target:%r not in %r' % (target,
AssertionError: target:'impr.pdf' not in ['pbm', 'wmf', 'sdd', 'emf', 'met', 'tif', 'tiff', 'odg', 'odp', 'sdd', 'sxi', 'eps', 'svg', 'sxd', 'pct', 'pict', 'xhtml', 'xpm', 'pdf', 'pot', 'gif', 'png', 'ras', 'jpg', 'jpeg', 'jfif', 'jif', 'jpe', 'htm', 'ppt', 'pps', 'otp', 'pgm', 'bmp', 'ppm', 'svm']


FAIL: test_06_FormatGenerationSpreadsheet (testIngestion.TestIngestion)
----------------------------------------------------------------------
Traceback (most recent call last):
  File "/home/buildbot/slave/full.ERP5/build/products/ERP5Type/tests/backportUnittest.py", line 151, in run
    testMethod()
  File "/home/buildbot/slave/full.ERP5/build/unit_test.2/Products/ERP5OOo/tests/testIngestion.py", line 1205, in test_06_FormatGenerationSpreadsheet
    self.playSequence(step_list)
  File "/home/buildbot/slave/full.ERP5/build/unit_test.2/Products/ERP5OOo/tests/testIngestion.py", line 961, in playSequence
    sequence_list.play(self)
  File "/home/buildbot/slave/full.ERP5/build/unit_test.1/Products/ERP5Type/tests/Sequence.py", line 195, in play
    sequence.play(context, sequence_number=i, quiet=quiet)
  File "/home/buildbot/slave/full.ERP5/build/unit_test.1/Products/ERP5Type/tests/Sequence.py", line 115, in play
    self._step_list[self._played_index] \
    Current Sequence:
      CleanUp
      CreateSpreadsheetDocument
    > CheckSpreadsheetDocumentExportList
  File "/home/buildbot/slave/full.ERP5/build/unit_test.1/Products/ERP5Type/tests/Sequence.py", line 98, in play
    method(sequence=sequence)
  File "/home/buildbot/slave/full.ERP5/build/unit_test.2/Products/ERP5OOo/tests/testIngestion.py", line 756, in stepCheckSpreadsheetDocumentExportList
    ['csv', 'calc.html', 'xls', 'calc.pdf'])
  File "/home/buildbot/slave/full.ERP5/build/unit_test.2/Products/ERP5OOo/tests/testIngestion.py", line 290, in checkDocumentExportList
    self.assertTrue(target in target_list, 'target:%r not in %r' % (target,
AssertionError: target:'calc.html' not in ['xlt', 'pdf', 'csv', 'txt', 'xls', 'xls', 'xlc', 'xlm', 'xlw', 'xls', 'xlc', 'xlm', 'xlw', 'xhtml', 'xlt', 'ods', 'sxc', 'htm', 'xlt', 'ots', 'xls', 'xlw', 'xlc', 'xlm', 'xls', 'xlc', 'xlm', 'xlw']


FAIL: test_06_FormatGenerationText (testIngestion.TestIngestion)
----------------------------------------------------------------------
Traceback (most recent call last):
  File "/home/buildbot/slave/full.ERP5/build/products/ERP5Type/tests/backportUnittest.py", line 151, in run
    testMethod()
  File "/home/buildbot/slave/full.ERP5/build/unit_test.2/Products/ERP5OOo/tests/testIngestion.py", line 1198, in test_06_FormatGenerationText
    self.playSequence(step_list)
  File "/home/buildbot/slave/full.ERP5/build/unit_test.2/Products/ERP5OOo/tests/testIngestion.py", line 961, in playSequence
    sequence_list.play(self)
  File "/home/buildbot/slave/full.ERP5/build/unit_test.1/Products/ERP5Type/tests/Sequence.py", line 195, in play
    sequence.play(context, sequence_number=i, quiet=quiet)
  File "/home/buildbot/slave/full.ERP5/build/unit_test.1/Products/ERP5Type/tests/Sequence.py", line 115, in play
    self._step_list[self._played_index] \
    Current Sequence:
      CleanUp
      CreateTextDocument
    > CheckTextDocumentExportList
  File "/home/buildbot/slave/full.ERP5/build/unit_test.1/Products/ERP5Type/tests/Sequence.py", line 98, in play
    method(sequence=sequence)
  File "/home/buildbot/slave/full.ERP5/build/unit_test.2/Products/ERP5OOo/tests/testIngestion.py", line 750, in stepCheckTextDocumentExportList
    ['pdf', 'doc', 'rtf', 'writer.html', 'txt'])
  File "/home/buildbot/slave/full.ERP5/build/unit_test.2/Products/ERP5OOo/tests/testIngestion.py", line 290, in checkDocumentExportList
    self.assertTrue(target in target_list, 'target:%r not in %r' % (target,
AssertionError: target:'writer.html' not in ['sxw', 'sdw', 'odt', 'htm', 'sdw', 'pdf', 'odm', 'sxg', 'sdw', 'txt', 'sdw', 'txt', 'htm', 'sdw', 'sdw', 'sxw', 'txt', 'odt', 'pdb', 'htm', 'doc', 'doc', 'doc', 'xhtml', 'ott', 'rtf', 'txt', 'psw', 'txt']


FAIL: test_11_EmailIngestion (testIngestion.TestIngestion)
----------------------------------------------------------------------
Traceback (most recent call last):
  File "/home/buildbot/slave/full.ERP5/build/products/ERP5Type/tests/backportUnittest.py", line 151, in run
    testMethod()
  File "/home/buildbot/slave/full.ERP5/build/unit_test.2/Products/ERP5OOo/tests/testIngestion.py", line 1330, in test_11_EmailIngestion
    self.playSequence(step_list)
  File "/home/buildbot/slave/full.ERP5/build/unit_test.2/Products/ERP5OOo/tests/testIngestion.py", line 961, in playSequence
    sequence_list.play(self)
  File "/home/buildbot/slave/full.ERP5/build/unit_test.1/Products/ERP5Type/tests/Sequence.py", line 195, in play
    sequence.play(context, sequence_number=i, quiet=quiet)
  File "/home/buildbot/slave/full.ERP5/build/unit_test.1/Products/ERP5Type/tests/Sequence.py", line 115, in play
    self._step_list[self._played_index] \
    Current Sequence:
      CleanUp
      ReceiveEmail
      CreatePerson
      ReceiveEmail
      VerifyEmailedDocumentInitialContribution
      ReceiveEmail
    > VerifyEmailedDocumentMultipleContribution
      ReceiveMultipleAttachmentsEmail
      VerifyEmailedMultipleDocumentsInitialContribution
      ReceiveMultipleAttachmentsEmail
      VerifyEmailedMultipleDocumentsMultipleContribution
  File "/home/buildbot/slave/full.ERP5/build/unit_test.1/Products/ERP5Type/tests/Sequence.py", line 98, in play
    method(sequence=sequence)
  File "/home/buildbot/slave/full.ERP5/build/unit_test.2/Products/ERP5OOo/tests/testIngestion.py", line 954, in stepVerifyEmailedDocumentMultipleContribution
    attachment_list, ingested_document = self.verifyEmailedDocument()
  File "/home/buildbot/slave/full.ERP5/build/unit_test.2/Products/ERP5OOo/tests/testIngestion.py", line 1016, in verifyEmailedDocument
    self.assertEquals('converted', ingested_document.getExternalProcessingState())
AssertionError: 'converted' != 'conversion_failed'


FAIL: test_06_FormatGenerationDrawing (testIngestionWithFlare.TestIngestionWithFlare)
----------------------------------------------------------------------
Traceback (most recent call last):
  File "/home/buildbot/slave/full.ERP5/build/products/ERP5Type/tests/backportUnittest.py", line 151, in run
    testMethod()
  File "/home/buildbot/slave/full.ERP5/build/unit_test.2/Products/ERP5OOo/tests/testIngestion.py", line 1219, in test_06_FormatGenerationDrawing
    self.playSequence(step_list)
  File "/home/buildbot/slave/full.ERP5/build/unit_test.2/Products/ERP5OOo/tests/testIngestion.py", line 961, in playSequence
    sequence_list.play(self)
  File "/home/buildbot/slave/full.ERP5/build/unit_test.1/Products/ERP5Type/tests/Sequence.py", line 195, in play
    sequence.play(context, sequence_number=i, quiet=quiet)
  File "/home/buildbot/slave/full.ERP5/build/unit_test.1/Products/ERP5Type/tests/Sequence.py", line 115, in play
    self._step_list[self._played_index] \
    Current Sequence:
      CleanUp
      CreateDrawingDocument
    > CheckDrawingDocumentExportList
  File "/home/buildbot/slave/full.ERP5/build/unit_test.1/Products/ERP5Type/tests/Sequence.py", line 98, in play
    method(sequence=sequence)
  File "/home/buildbot/slave/full.ERP5/build/unit_test.2/Products/ERP5OOo/tests/testIngestion.py", line 766, in stepCheckDrawingDocumentExportList
    self.checkDocumentExportList(document, 'sxd', ['jpg', 'draw.pdf', 'svg'])
  File "/home/buildbot/slave/full.ERP5/build/unit_test.2/Products/ERP5OOo/tests/testIngestion.py", line 290, in checkDocumentExportList
    self.assertTrue(target in target_list, 'target:%r not in %r' % (target,
AssertionError: target:'draw.pdf' not in ['pbm', 'wmf', 'sdd', 'emf', 'met', 'tif', 'tiff', 'odg', 'odp', 'sdd', 'sxi', 'eps', 'svg', 'sxd', 'pct', 'pict', 'xhtml', 'xpm', 'pdf', 'pot', 'gif', 'png', 'ras', 'jpg', 'jpeg', 'jfif', 'jif', 'jpe', 'htm', 'ppt', 'pps', 'otp', 'pgm', 'bmp', 'ppm', 'svm', 'otg', 'htm', 'odg', 'sxd', 'sda']


FAIL: test_06_FormatGenerationPresentation (testIngestionWithFlare.TestIngestionWithFlare)
----------------------------------------------------------------------
Traceback (most recent call last):
  File "/home/buildbot/slave/full.ERP5/build/products/ERP5Type/tests/backportUnittest.py", line 151, in run
    testMethod()
  File "/home/buildbot/slave/full.ERP5/build/unit_test.2/Products/ERP5OOo/tests/testIngestion.py", line 1212, in test_06_FormatGenerationPresentation
    self.playSequence(step_list)
  File "/home/buildbot/slave/full.ERP5/build/unit_test.2/Products/ERP5OOo/tests/testIngestion.py", line 961, in playSequence
    sequence_list.play(self)
  File "/home/buildbot/slave/full.ERP5/build/unit_test.1/Products/ERP5Type/tests/Sequence.py", line 195, in play
    sequence.play(context, sequence_number=i, quiet=quiet)
  File "/home/buildbot/slave/full.ERP5/build/unit_test.1/Products/ERP5Type/tests/Sequence.py", line 115, in play
    self._step_list[self._played_index] \
    Current Sequence:
      CleanUp
      CreatePresentationDocument
    > CheckPresentationDocumentExportList
  File "/home/buildbot/slave/full.ERP5/build/unit_test.1/Products/ERP5Type/tests/Sequence.py", line 98, in play
    method(sequence=sequence)
  File "/home/buildbot/slave/full.ERP5/build/unit_test.2/Products/ERP5OOo/tests/testIngestion.py", line 761, in stepCheckPresentationDocumentExportList
    self.checkDocumentExportList(document, 'ppt', ['impr.pdf', 'ppt'])
  File "/home/buildbot/slave/full.ERP5/build/unit_test.2/Products/ERP5OOo/tests/testIngestion.py", line 290, in checkDocumentExportList
    self.assertTrue(target in target_list, 'target:%r not in %r' % (target,
AssertionError: target:'impr.pdf' not in ['pbm', 'wmf', 'sdd', 'emf', 'met', 'tif', 'tiff', 'odg', 'odp', 'sdd', 'sxi', 'eps', 'svg', 'sxd', 'pct', 'pict', 'xhtml', 'xpm', 'pdf', 'pot', 'gif', 'png', 'ras', 'jpg', 'jpeg', 'jfif', 'jif', 'jpe', 'htm', 'ppt', 'pps', 'otp', 'pgm', 'bmp', 'ppm', 'svm']


FAIL: test_06_FormatGenerationSpreadsheet (testIngestionWithFlare.TestIngestionWithFlare)
----------------------------------------------------------------------
Traceback (most recent call last):
  File "/home/buildbot/slave/full.ERP5/build/products/ERP5Type/tests/backportUnittest.py", line 151, in run
    testMethod()
  File "/home/buildbot/slave/full.ERP5/build/unit_test.2/Products/ERP5OOo/tests/testIngestion.py", line 1205, in test_06_FormatGenerationSpreadsheet
    self.playSequence(step_list)
  File "/home/buildbot/slave/full.ERP5/build/unit_test.2/Products/ERP5OOo/tests/testIngestion.py", line 961, in playSequence
    sequence_list.play(self)
  File "/home/buildbot/slave/full.ERP5/build/unit_test.1/Products/ERP5Type/tests/Sequence.py", line 195, in play
    sequence.play(context, sequence_number=i, quiet=quiet)
  File "/home/buildbot/slave/full.ERP5/build/unit_test.1/Products/ERP5Type/tests/Sequence.py", line 115, in play
    self._step_list[self._played_index] \
    Current Sequence:
      CleanUp
      CreateSpreadsheetDocument
    > CheckSpreadsheetDocumentExportList
  File "/home/buildbot/slave/full.ERP5/build/unit_test.1/Products/ERP5Type/tests/Sequence.py", line 98, in play
    method(sequence=sequence)
  File "/home/buildbot/slave/full.ERP5/build/unit_test.2/Products/ERP5OOo/tests/testIngestion.py", line 756, in stepCheckSpreadsheetDocumentExportList
    ['csv', 'calc.html', 'xls', 'calc.pdf'])
  File "/home/buildbot/slave/full.ERP5/build/unit_test.2/Products/ERP5OOo/tests/testIngestion.py", line 290, in checkDocumentExportList
    self.assertTrue(target in target_list, 'target:%r not in %r' % (target,
AssertionError: target:'calc.html' not in ['xlt', 'pdf', 'csv', 'txt', 'xls', 'xls', 'xlc', 'xlm', 'xlw', 'xls', 'xlc', 'xlm', 'xlw', 'xhtml', 'xlt', 'ods', 'sxc', 'htm', 'xlt', 'ots', 'xls', 'xlw', 'xlc', 'xlm', 'xls', 'xlc', 'xlm', 'xlw']


FAIL: test_06_FormatGenerationText (testIngestionWithFlare.TestIngestionWithFlare)
----------------------------------------------------------------------
Traceback (most recent call last):
  File "/home/buildbot/slave/full.ERP5/build/products/ERP5Type/tests/backportUnittest.py", line 151, in run
    testMethod()
  File "/home/buildbot/slave/full.ERP5/build/unit_test.2/Products/ERP5OOo/tests/testIngestion.py", line 1198, in test_06_FormatGenerationText
    self.playSequence(step_list)
  File "/home/buildbot/slave/full.ERP5/build/unit_test.2/Products/ERP5OOo/tests/testIngestion.py", line 961, in playSequence
    sequence_list.play(self)
  File "/home/buildbot/slave/full.ERP5/build/unit_test.1/Products/ERP5Type/tests/Sequence.py", line 195, in play
    sequence.play(context, sequence_number=i, quiet=quiet)
  File "/home/buildbot/slave/full.ERP5/build/unit_test.1/Products/ERP5Type/tests/Sequence.py", line 115, in play
    self._step_list[self._played_index] \
    Current Sequence:
      CleanUp
      CreateTextDocument
    > CheckTextDocumentExportList
  File "/home/buildbot/slave/full.ERP5/build/unit_test.1/Products/ERP5Type/tests/Sequence.py", line 98, in play
    method(sequence=sequence)
  File "/home/buildbot/slave/full.ERP5/build/unit_test.2/Products/ERP5OOo/tests/testIngestion.py", line 750, in stepCheckTextDocumentExportList
    ['pdf', 'doc', 'rtf', 'writer.html', 'txt'])
  File "/home/buildbot/slave/full.ERP5/build/unit_test.2/Products/ERP5OOo/tests/testIngestion.py", line 290, in checkDocumentExportList
    self.assertTrue(target in target_list, 'target:%r not in %r' % (target,
AssertionError: target:'writer.html' not in ['sxw', 'sdw', 'odt', 'htm', 'sdw', 'pdf', 'odm', 'sxg', 'sdw', 'txt', 'sdw', 'txt', 'htm', 'sdw', 'sdw', 'sxw', 'txt', 'odt', 'pdb', 'htm', 'doc', 'doc', 'doc', 'xhtml', 'ott', 'rtf', 'txt', 'psw', 'txt']


FAIL: test_10_MetadataSettingPreferenceOrder (testIngestionWithFlare.TestIngestionWithFlare)
----------------------------------------------------------------------
Traceback (most recent call last):
  File "/home/buildbot/slave/full.ERP5/build/products/ERP5Type/tests/backportUnittest.py", line 151, in run
    testMethod()
  File "/home/buildbot/slave/full.ERP5/build/unit_test.2/Products/ERP5OOo/tests/testIngestion.py", line 1304, in test_10_MetadataSettingPreferenceOrder
    self.playSequence(step_list)
  File "/home/buildbot/slave/full.ERP5/build/unit_test.2/Products/ERP5OOo/tests/testIngestion.py", line 961, in playSequence
    sequence_list.play(self)
  File "/home/buildbot/slave/full.ERP5/build/unit_test.1/Products/ERP5Type/tests/Sequence.py", line 195, in play
    sequence.play(context, sequence_number=i, quiet=quiet)
  File "/home/buildbot/slave/full.ERP5/build/unit_test.1/Products/ERP5Type/tests/Sequence.py", line 115, in play
    self._step_list[self._played_index] \
    Current Sequence:
      CleanUp
      CreateTextDocument
      StraightUpload
      CheckConvertingState
      Tic
    > CheckConvertedState
      SetSimulatedDiscoveryScriptForOrdering
      CheckMetadataSettingOrderFICU
      CreateTextDocument
      StraightUpload
      CheckConvertingState
      Tic
      CheckConvertedState
      SetSimulatedDiscoveryScriptForOrdering
      CheckMetadataSettingOrderCUFI
      CreateTextDocument
      StraightUpload
      CheckConvertingState
      Tic
      CheckConvertedState
      SetSimulatedDiscoveryScriptForOrdering
      CheckMetadataSettingOrderUIFC
      CreateTextDocument
      StraightUpload
      CheckConvertingState
      Tic
      CheckConvertedState
      SetSimulatedDiscoveryScriptForOrdering
      CheckMetadataSettingOrderICUF
      CreateTextDocument
      StraightUpload
      CheckConvertingState
      Tic
      CheckConvertedState
      SetSimulatedDiscoveryScriptForOrdering
      CheckMetadataSettingOrderUFCI
  File "/home/buildbot/slave/full.ERP5/build/unit_test.1/Products/ERP5Type/tests/Sequence.py", line 98, in play
    method(sequence=sequence)
  File "/home/buildbot/slave/full.ERP5/build/unit_test.2/Products/ERP5OOo/tests/testIngestion.py", line 500, in stepCheckConvertedState
    return self.assertEquals(document.getExternalProcessingState(), 'converted')
AssertionError: 'conversion_failed' != 'converted'


FAIL: testCommitOrder (testInvalidationBug.TestInvalidationBug), Check order of resources being committed
----------------------------------------------------------------------
Traceback (most recent call last):
  File "/home/buildbot/slave/full.ERP5/build/products/ERP5Type/tests/backportUnittest.py", line 151, in run
    testMethod()
  File "/home/buildbot/slave/full.ERP5/build/unit_test.4/Products/ERP5/tests/testInvalidationBug.py", line 94, in testCommitOrder
    self.assertEqual(result_list[-2], [1,0]) # catalog
AssertionError: [1, 1] != [1, 0]


FAIL: test_02 (testKMGadget.TestGadgets), Check Gadgets
----------------------------------------------------------------------
Traceback (most recent call last):
  File "/home/buildbot/slave/full.ERP5/build/products/ERP5Type/tests/backportUnittest.py", line 151, in run
    testMethod()
  File "/home/buildbot/slave/full.ERP5/build/unit_test.2/bt5/erp5_km/TestTemplateItem/testKMGadget.py", line 235, in test_02
    current_websection_pad.getObject())
AssertionError: <Knowledge Pad at /erp5_portal_7ea3330e2e3fe67d835614dd5f9fc295/knowledge_pad_module/9> == <Knowledge Pad at /erp5_portal_7ea3330e2e3fe67d835614dd5f9fc295/knowledge_pad_module/9>


FAIL: test_01c_PackingListSplitBuildInvoiceBuild (Products.ERP5.tests.testTradeModelLine.TestTradeModelLineSale)
----------------------------------------------------------------------
Traceback (most recent call last):
  File "/home/buildbot/slave/full.ERP5/build/products/ERP5Type/tests/backportUnittest.py", line 151, in run
    testMethod()
  File "/home/buildbot/slave/full.ERP5/build/unit_test.3/Products/ERP5/tests/testTradeModelLine.py", line 680, in test_01c_PackingListSplitBuildInvoiceBuild
    self.processPackingListBuildInvoice(packing_list)
  File "/home/buildbot/slave/full.ERP5/build/unit_test.3/Products/ERP5/tests/testTradeModelLine.py", line 330, in processPackingListBuildInvoice
    self.checkCausalityState(invoice, 'solved')
  File "/home/buildbot/slave/full.ERP5/build/unit_test.3/Products/ERP5/tests/testTradeModelLine.py", line 417, in checkCausalityState
    delivery.getDivergenceList())
AssertionError: [<DivergenceMessage object at 0xa0d5758
  'decision_value': -0.049999999999999989
  'divergence_scope': 'property'
  'prevision_value': -0.050000000000000003
  'mapping': {}
  'object_relative_url': 'accounting_module/3/5'
  'simulation_movement': <Simulation Movement at /erp5_portal_0393a62e4371b0e9e8e3707f047ac555/portal_simulation/5/3/1/1/1/1/2/3>
  'tested_property': 'price'
  'message': 'Price'>, <DivergenceMessage object at 0x94b0710
  'decision_value': -0.049999999999999989
  'divergence_scope': 'property'
  'prevision_value': -0.050000000000000003
  'mapping': {}
  'object_relative_url': 'accounting_module/3/5'
  'simulation_movement': <Simulation Movement at /erp5_portal_0393a62e4371b0e9e8e3707f047ac555/portal_simulation/5/1/1/1/1/1/2/3>
  'tested_property': 'price'
  'message': 'Price'>]


FAIL: test_tradeModelLineWithRounding (Products.ERP5.tests.testTradeModelLine.TestTradeModelLineSale)
----------------------------------------------------------------------
Traceback (most recent call last):
  File "/home/buildbot/slave/full.ERP5/build/products/ERP5Type/tests/backportUnittest.py", line 151, in run
    testMethod()
  File "/home/buildbot/slave/full.ERP5/build/unit_test.3/Products/ERP5/tests/testTradeModelLine.py", line 1096, in test_tradeModelLineWithRounding
    self.assertEqual(2, len(amount_list)) # XXX 1 or 2 ???
AssertionError: 2 != 1


FAIL: test_01c_PackingListSplitBuildInvoiceBuild (Products.ERP5.tests.testTradeModelLinePurchase.TestTradeModelLinePurchase)
----------------------------------------------------------------------
Traceback (most recent call last):
  File "/home/buildbot/slave/full.ERP5/build/products/ERP5Type/tests/backportUnittest.py", line 151, in run
    testMethod()
  File "/home/buildbot/slave/full.ERP5/build/unit_test.3/Products/ERP5/tests/testTradeModelLine.py", line 680, in test_01c_PackingListSplitBuildInvoiceBuild
    self.processPackingListBuildInvoice(packing_list)
  File "/home/buildbot/slave/full.ERP5/build/unit_test.3/Products/ERP5/tests/testTradeModelLine.py", line 330, in processPackingListBuildInvoice
    self.checkCausalityState(invoice, 'solved')
  File "/home/buildbot/slave/full.ERP5/build/unit_test.3/Products/ERP5/tests/testTradeModelLine.py", line 417, in checkCausalityState
    delivery.getDivergenceList())
AssertionError: [<DivergenceMessage object at 0xbfade18
  'decision_value': -0.049999999999999989
  'divergence_scope': 'property'
  'prevision_value': -0.050000000000000003
  'mapping': {}
  'object_relative_url': 'accounting_module/3/5'
  'simulation_movement': <Simulation Movement at /erp5_portal_d08328230494c3b46faa6f7449e56966/portal_simulation/5/3/1/1/1/1/2/3>
  'tested_property': 'price'
  'message': 'Price'>, <DivergenceMessage object at 0x9c96c68
  'decision_value': -0.049999999999999989
  'divergence_scope': 'property'
  'prevision_value': -0.050000000000000003
  'mapping': {}
  'object_relative_url': 'accounting_module/3/5'
  'simulation_movement': <Simulation Movement at /erp5_portal_d08328230494c3b46faa6f7449e56966/portal_simulation/5/1/1/1/1/1/2/3>
  'tested_property': 'price'
  'message': 'Price'>]


FAIL: test_tradeModelLineWithRounding (Products.ERP5.tests.testTradeModelLinePurchase.TestTradeModelLinePurchase)
----------------------------------------------------------------------
Traceback (most recent call last):
  File "/home/buildbot/slave/full.ERP5/build/products/ERP5Type/tests/backportUnittest.py", line 151, in run
    testMethod()
  File "/home/buildbot/slave/full.ERP5/build/unit_test.3/Products/ERP5/tests/testTradeModelLine.py", line 1096, in test_tradeModelLineWithRounding
    self.assertEqual(2, len(amount_list)) # XXX 1 or 2 ???
AssertionError: 2 != 1


ERROR: test_04_PersistentCacheConversionWithFlare (testOOoConversionCache.TestDocumentConversionCache)
----------------------------------------------------------------------
Traceback (most recent call last):
  File "/home/buildbot/slave/full.ERP5/build/products/ERP5Type/tests/backportUnittest.py", line 168, in run
    self.tearDown()
  File "/home/buildbot/slave/full.ERP5/build/unit_test.2/Products/ERP5Type/tests/ERP5TypeTestCase.py", line 997, in tearDown
    PortalTestCase.tearDown(self)
  File "/usr/lib/erp5/lib/python/Testing/ZopeTestCase/base.py", line 102, in tearDown
    self.beforeTearDown()
  File "/home/buildbot/slave/full.ERP5/build/unit_test.5/Products/ERP5OOo/tests/testDms.py", line 160, in beforeTearDown
    assert not activity_status
AssertionError


FAIL: test_04_PersistentCacheConversionWithFlare (testOOoConversionCache.TestDocumentConversionCache)
----------------------------------------------------------------------
Traceback (most recent call last):
  File "/home/buildbot/slave/full.ERP5/build/products/ERP5Type/tests/backportUnittest.py", line 151, in run
    testMethod()
  File "/home/buildbot/slave/full.ERP5/build/unit_test.2/Products/ERP5OOo/tests/testOOoConversionCache.py", line 210, in test_04_PersistentCacheConversionWithFlare
    'Cache Storage failed for %s' % (format))
AssertionError: Cache Storage failed for txt


ERROR: test_CategoryTool_importCategoryFileExpirationSupport (testOOoImport.TestOOoImportWeb), Import category file with expiration request, and do it again to be
----------------------------------------------------------------------
Traceback (most recent call last):
  File "/home/buildbot/slave/full.ERP5/build/products/ERP5Type/tests/backportUnittest.py", line 151, in run
    testMethod()
  File "/home/buildbot/slave/full.ERP5/build/unit_test.3/Products/ERP5OOo/tests/testOOoImport.py", line 1063, in test_CategoryTool_importCategoryFileExpirationSupport
    existing_category_list='expire')
  File "/usr/lib/erp5/lib/python/Shared/DC/Scripts/Bindings.py", line 311, in __call__
    return self._bindAndExec(args, kw, None)
  File "/usr/lib/erp5/lib/python/Shared/DC/Scripts/Bindings.py", line 348, in _bindAndExec
    return self._exec(bound_data, args, kw)
  File "/home/buildbot/slave/full.ERP5/build/unit_test.2/Products/ERP5Type/tests/ERP5TypeTestCase.py", line 1267, in _exec
    return PythonScript_exec(self, *args)
  File "/usr/lib/erp5/lib/python/Products/PythonScripts/PythonScript.py", line 325, in _exec
    result = f(*args, **kw)
  File "Script (Python)", line 65, in CategoryTool_importCategoryFile
  File "/usr/lib/erp5/lib/python/Shared/DC/Scripts/Bindings.py", line 311, in __call__
    return self._bindAndExec(args, kw, None)
  File "/usr/lib/erp5/lib/python/Shared/DC/Scripts/Bindings.py", line 348, in _bindAndExec
    return self._exec(bound_data, args, kw)
  File "/home/buildbot/slave/full.ERP5/build/unit_test.2/Products/ERP5Type/tests/ERP5TypeTestCase.py", line 1267, in _exec
    return PythonScript_exec(self, *args)
  File "/usr/lib/erp5/lib/python/Products/PythonScripts/PythonScript.py", line 325, in _exec
    result = f(*args, **kw)
  File "Script (Python)", line 92, in Base_getCategoriesSpreadSheetMapping
  File "/home/buildbot/slave/full.ERP5/build/unit_test.2/Products/ERP5/mixin/base_convertable.py", line 62, in convertToBaseFormat
    message = self._convertToBaseFormat() # Call implemetation method
  File "/home/buildbot/slave/full.ERP5/build/unit_test.1/Products/ERP5OOo/Document/OOoDocument.py", line 468, in _convertToBaseFormat
    raise ConversionError(
ConversionError: OOoDocument: Error converting document to base format. (Code 402: 10)


ERROR: testBuildingSaleOrder (testOpenOrder.TestOpenOrder)
----------------------------------------------------------------------
Traceback (most recent call last):
  File "/home/buildbot/slave/full.ERP5/build/products/ERP5Type/tests/backportUnittest.py", line 151, in run
    testMethod()
  File "/home/buildbot/slave/full.ERP5/build/unit_test.1/Products/ERP5/tests/testOpenOrder.py", line 349, in testBuildingSaleOrder
    forecasting_term_day_count=5
  File "/home/buildbot/slave/full.ERP5/build/unit_test.1/Products/ERP5Type/Core/Folder.py", line 459, in newContent
    return FolderMixIn.newContent(self, *args, **kw)
  File "/home/buildbot/slave/full.ERP5/build/unit_test.1/Products/ERP5Type/Core/Folder.py", line 151, in newContent
    raise ValueError('Disallowed subobject type: %s' % portal_type)
ValueError: Disallowed subobject type: Open Sale Order


ERROR: testOpenOrderRule (testOpenOrder.TestOpenOrder)
----------------------------------------------------------------------
Traceback (most recent call last):
  File "/home/buildbot/slave/full.ERP5/build/products/ERP5Type/tests/backportUnittest.py", line 151, in run
    testMethod()
  File "/home/buildbot/slave/full.ERP5/build/unit_test.1/Products/ERP5/tests/testOpenOrder.py", line 243, in testOpenOrderRule
    stop_date=DateTime(3000,8,1),
  File "/home/buildbot/slave/full.ERP5/build/unit_test.1/Products/ERP5Type/Core/Folder.py", line 459, in newContent
    return FolderMixIn.newContent(self, *args, **kw)
  File "/home/buildbot/slave/full.ERP5/build/unit_test.1/Products/ERP5Type/Core/Folder.py", line 151, in newContent
    raise ValueError('Disallowed subobject type: %s' % portal_type)
ValueError: Disallowed subobject type: Open Sale Order


FAIL: testPeriodicityDateList (testOpenOrder.TestOpenOrder)
----------------------------------------------------------------------
Traceback (most recent call last):
  File "/home/buildbot/slave/full.ERP5/build/products/ERP5Type/tests/backportUnittest.py", line 151, in run
    testMethod()
  File "/home/buildbot/slave/full.ERP5/build/unit_test.1/Products/ERP5/tests/testOpenOrder.py", line 186, in testPeriodicityDateList
    [(D(2008,2,1,0,1), DateTime(2008,2,29)),
AssertionError: [(DateTime('2008/02/01 00:01:00 US/Eastern'), DateTime('2008/02/29')), (DateTime('2008/03/01 00:01:00 US/Eastern'), DateTime('2008/03/31')), (DateTime('2008/04/01 00:01:00 US/Eastern'), DateTime('2008/04/30')), (DateTime('2008/05/01 00:01:00 US/Eastern'), DateTime('2008/05/31')), (DateTime('2008/06/01 00:01:00 US/Eastern'), DateTime('2008/06/30')), (DateTime('2008/07/01 00:01:00 US/Eastern'), DateTime('2008/07/31')), (DateTime('2008/08/01 00:01:00 US/Eastern'), DateTime('2008/08/31')), (DateTime('2008/09/01 00:01:00 US/Eastern'), DateTime('2008/09/30')), (DateTime('2008/10/01 00:01:00 US/Eastern'), DateTime('2008/10/31')), (DateTime('2008/11/01 00:01:00 US/Eastern'), DateTime('2008/11/30'))] != [(DateTime('2008/02/01 00:01:00 US/Eastern'), DateTime('2008/02/29')), (DateTime('2008/03/01 00:01:00 US/Eastern'), DateTime('2008/03/31')), (DateTime('2008/04/01 00:01:00 GMT-4'), DateTime('2008/04/30')), (DateTime('2008/05/01 00:01:00 GMT-4'), DateTime('2008/05/31')), (DateTime('2008/06/01 00:01:00 GMT-4'), DateTime('2008/06/30')), (DateTime('2008/07/01 00:01:00 GMT-4'), DateTime('2008/07/31')), (DateTime('2008/08/01 00:01:00 GMT-4'), DateTime('2008/08/31')), (DateTime('2008/09/01 00:01:00 GMT-4'), DateTime('2008/09/30')), (DateTime('2008/10/01 00:01:00 GMT-4'), DateTime('2008/10/31')), (DateTime('2008/11/01 00:01:00 GMT-4'), DateTime('2008/11/30'))]


ERROR: test_AccountingLineGeneration (testPayroll.TestPayroll)
----------------------------------------------------------------------
Traceback (most recent call last):
  File "/home/buildbot/slave/full.ERP5/build/products/ERP5Type/tests/backportUnittest.py", line 151, in run
    testMethod()
  File "/home/buildbot/slave/full.ERP5/build/unit_test.3/Products/ERP5/tests/testPayroll.py", line 3122, in test_AccountingLineGeneration
    self.stepTic()
  File "/home/buildbot/slave/full.ERP5/build/unit_test.2/Products/ERP5Type/tests/ERP5TypeTestCase.py", line 1018, in stepTic
    self.tic()
  File "/home/buildbot/slave/full.ERP5/build/unit_test.1/Products/ERP5Type/tests/ProcessingNodeTestCase.py", line 173, in tic
    raise RuntimeError(error_message)
RuntimeError: tic is looping forever. These messages are pending: [('/erp5_portal_7b7a3575330a52ab2ff14077272db47e/accounting_module/1', 'expand', -2, 5)]
Last error message:
ValueError
A Business Process can not erase amounts
Traceback (innermost last):
  Module Products.CMFActivity.ActivityTool, line 303, in __call__
  Module Products.ERP5Type.UnrestrictedMethod, line 71, in <lambda>
  Module Products.ERP5Type.UnrestrictedMethod, line 104, in unrestricted_apply
  Module Products.ERP5.Document.Delivery, line 800, in expand
  Module Products.ERP5Type.UnrestrictedMethod, line 71, in <lambda>
  Module Products.ERP5Type.UnrestrictedMethod, line 104, in unrestricted_apply
  Module Products.ERP5.Document.AppliedRule, line 112, in expand
  Module Products.ERP5.mixin.rule, line 215, in expand
  Module Products.ERP5.mixin.movement_collection_updater, line 159, in updateMovementCollection
  Module Products.ERP5.mixin.movement_collection_updater, line 69, in getMovementCollectionDiff
  Module Products.ERP5.mixin.rule, line 117, in getGeneratedMovementList
  Module Products.ERP5.Document.BusinessProcess, line 727, in getTradePhaseMovementList
ValueError: A Business Process can not erase amounts



ERROR: test_NetSalaryReport (testPayroll.TestPayroll)
----------------------------------------------------------------------
Traceback (most recent call last):
  File "/home/buildbot/slave/full.ERP5/build/products/ERP5Type/tests/backportUnittest.py", line 151, in run
    testMethod()
  File "/home/buildbot/slave/full.ERP5/build/unit_test.3/Products/ERP5/tests/testPayroll.py", line 2808, in test_NetSalaryReport
    self.stepTic()
  File "/home/buildbot/slave/full.ERP5/build/unit_test.2/Products/ERP5Type/tests/ERP5TypeTestCase.py", line 1018, in stepTic
    self.tic()
  File "/home/buildbot/slave/full.ERP5/build/unit_test.1/Products/ERP5Type/tests/ProcessingNodeTestCase.py", line 173, in tic
    raise RuntimeError(error_message)
RuntimeError: tic is looping forever. These messages are pending: [('/erp5_portal_7b7a3575330a52ab2ff14077272db47e/accounting_module/2', 'expand', -2, 5)]
Last error message:
ValueError
A Business Process can not erase amounts
Traceback (innermost last):
  Module Products.CMFActivity.ActivityTool, line 303, in __call__
  Module Products.ERP5Type.UnrestrictedMethod, line 71, in <lambda>
  Module Products.ERP5Type.UnrestrictedMethod, line 104, in unrestricted_apply
  Module Products.ERP5.Document.Delivery, line 800, in expand
  Module Products.ERP5Type.UnrestrictedMethod, line 71, in <lambda>
  Module Products.ERP5Type.UnrestrictedMethod, line 104, in unrestricted_apply
  Module Products.ERP5.Document.AppliedRule, line 112, in expand
  Module Products.ERP5.mixin.rule, line 215, in expand
  Module Products.ERP5.mixin.movement_collection_updater, line 159, in updateMovementCollection
  Module Products.ERP5.mixin.movement_collection_updater, line 69, in getMovementCollectionDiff
  Module Products.ERP5.mixin.rule, line 117, in getGeneratedMovementList
  Module Products.ERP5.Document.BusinessProcess, line 727, in getTradePhaseMovementList
ValueError: A Business Process can not erase amounts



ERROR: test_PaySheetTransaction_getMovementList (testPayroll.TestPayroll)
----------------------------------------------------------------------
Traceback (most recent call last):
  File "/home/buildbot/slave/full.ERP5/build/products/ERP5Type/tests/backportUnittest.py", line 151, in run
    testMethod()
  File "/home/buildbot/slave/full.ERP5/build/unit_test.3/Products/ERP5/tests/testPayroll.py", line 2307, in test_PaySheetTransaction_getMovementList
    sequence_list.play(self)
  File "/home/buildbot/slave/full.ERP5/build/unit_test.1/Products/ERP5Type/tests/Sequence.py", line 195, in play
    sequence.play(context, sequence_number=i, quiet=quiet)
  File "/home/buildbot/slave/full.ERP5/build/unit_test.1/Products/ERP5Type/tests/Sequence.py", line 115, in play
    self._step_list[self._played_index] \
    Current Sequence:
      CreateUrssafService
      CreateBasicPaysheet
    > CheckPaySheetTransaction_getMovementListReturn
  File "/home/buildbot/slave/full.ERP5/build/unit_test.1/Products/ERP5Type/tests/Sequence.py", line 98, in play
    method(sequence=sequence)
  File "/home/buildbot/slave/full.ERP5/build/unit_test.3/Products/ERP5/tests/testPayroll.py", line 1397, in stepCheckPaySheetTransaction_getMovementListReturn
    self.assertEquals(2, movement.employee_price)
AttributeError: employee_price


ERROR: test_PayrollTaxesReport (testPayroll.TestPayroll)
----------------------------------------------------------------------
Traceback (most recent call last):
  File "/home/buildbot/slave/full.ERP5/build/products/ERP5Type/tests/backportUnittest.py", line 151, in run
    testMethod()
  File "/home/buildbot/slave/full.ERP5/build/unit_test.3/Products/ERP5/tests/testPayroll.py", line 2413, in test_PayrollTaxesReport
    self.stepTic()
  File "/home/buildbot/slave/full.ERP5/build/unit_test.2/Products/ERP5Type/tests/ERP5TypeTestCase.py", line 1018, in stepTic
    self.tic()
  File "/home/buildbot/slave/full.ERP5/build/unit_test.1/Products/ERP5Type/tests/ProcessingNodeTestCase.py", line 173, in tic
    raise RuntimeError(error_message)
RuntimeError: tic is looping forever. These messages are pending: [('/erp5_portal_7b7a3575330a52ab2ff14077272db47e/accounting_module/5', 'expand', -2, 5)]
Last error message:
ValueError
A Business Process can not erase amounts
Traceback (innermost last):
  Module Products.CMFActivity.ActivityTool, line 303, in __call__
  Module Products.ERP5Type.UnrestrictedMethod, line 71, in <lambda>
  Module Products.ERP5Type.UnrestrictedMethod, line 104, in unrestricted_apply
  Module Products.ERP5.Document.Delivery, line 800, in expand
  Module Products.ERP5Type.UnrestrictedMethod, line 71, in <lambda>
  Module Products.ERP5Type.UnrestrictedMethod, line 104, in unrestricted_apply
  Module Products.ERP5.Document.AppliedRule, line 112, in expand
  Module Products.ERP5.mixin.rule, line 215, in expand
  Module Products.ERP5.mixin.movement_collection_updater, line 159, in updateMovementCollection
  Module Products.ERP5.mixin.movement_collection_updater, line 69, in getMovementCollectionDiff
  Module Products.ERP5.mixin.rule, line 117, in getGeneratedMovementList
  Module Products.ERP5.Document.BusinessProcess, line 727, in getTradePhaseMovementList
ValueError: A Business Process can not erase amounts



ERROR: test_PayrollTaxesReportDifferentSalaryRange (testPayroll.TestPayroll)
----------------------------------------------------------------------
Traceback (most recent call last):
  File "/home/buildbot/slave/full.ERP5/build/products/ERP5Type/tests/backportUnittest.py", line 151, in run
    testMethod()
  File "/home/buildbot/slave/full.ERP5/build/unit_test.3/Products/ERP5/tests/testPayroll.py", line 2611, in test_PayrollTaxesReportDifferentSalaryRange
    self.stepTic()
  File "/home/buildbot/slave/full.ERP5/build/unit_test.2/Products/ERP5Type/tests/ERP5TypeTestCase.py", line 1018, in stepTic
    self.tic()
  File "/home/buildbot/slave/full.ERP5/build/unit_test.1/Products/ERP5Type/tests/ProcessingNodeTestCase.py", line 173, in tic
    raise RuntimeError(error_message)
RuntimeError: tic is looping forever. These messages are pending: [('/erp5_portal_7b7a3575330a52ab2ff14077272db47e/accounting_module/7', 'expand', -2, 5)]
Last error message:
ValueError
A Business Process can not erase amounts
Traceback (innermost last):
  Module Products.CMFActivity.ActivityTool, line 303, in __call__
  Module Products.ERP5Type.UnrestrictedMethod, line 71, in <lambda>
  Module Products.ERP5Type.UnrestrictedMethod, line 104, in unrestricted_apply
  Module Products.ERP5.Document.Delivery, line 800, in expand
  Module Products.ERP5Type.UnrestrictedMethod, line 71, in <lambda>
  Module Products.ERP5Type.UnrestrictedMethod, line 104, in unrestricted_apply
  Module Products.ERP5.Document.AppliedRule, line 112, in expand
  Module Products.ERP5.mixin.rule, line 215, in expand
  Module Products.ERP5.mixin.movement_collection_updater, line 159, in updateMovementCollection
  Module Products.ERP5.mixin.movement_collection_updater, line 69, in getMovementCollectionDiff
  Module Products.ERP5.mixin.rule, line 117, in getGeneratedMovementList
  Module Products.ERP5.Document.BusinessProcess, line 727, in getTradePhaseMovementList
ValueError: A Business Process can not erase amounts



FAIL: test_complexSliceOnModelLine (testPayroll.TestPayroll)
----------------------------------------------------------------------
Traceback (most recent call last):
  File "/home/buildbot/slave/full.ERP5/build/products/ERP5Type/tests/backportUnittest.py", line 151, in run
    testMethod()
  File "/home/buildbot/slave/full.ERP5/build/unit_test.3/Products/ERP5/tests/testPayroll.py", line 2155, in test_complexSliceOnModelLine
    sequence_list.play(self)
  File "/home/buildbot/slave/full.ERP5/build/unit_test.1/Products/ERP5Type/tests/Sequence.py", line 195, in play
    sequence.play(context, sequence_number=i, quiet=quiet)
  File "/home/buildbot/slave/full.ERP5/build/unit_test.1/Products/ERP5Type/tests/Sequence.py", line 115, in play
    self._step_list[self._played_index] \
    Current Sequence:
      CreateUrssafService
      CreateLabourService
      CreateEmployer
      CreateEmployee
      CreatePriceCurrency
      CreateBasicModel
      Tic
      ModelCreateUrssafModelLine
      UrssafModelLineCreateMovements
      CreateBasicPaysheet
      PaysheetCreateLabourPaySheetLine
      Tic
      CreateBusinessProcess
      CreateBusinessLink
      CreateUrssafRoubaixOrganisation
      ModifyBusinessLinkTradePhase
      ModelSpecialiseBusinessProcess
      Tic
      CreateUrssafService
      CreateLabourService
      CreateEmployer
      CreateEmployee
      CreateModelWithSlices
      Tic
      ModelCreateUrssafModelLineWithComplexSlices
      Tic
      UrssafModelLineWithComplexSlicesCreateMovements
      CreateBasicPaysheet
      PaysheetCreateLabourPaySheetLine
      CreateBusinessProcess
      CreateBusinessLink
      CreateUrssafRoubaixOrganisation
      ModifyBusinessLinkTradePhase
      ModelSpecialiseBusinessProcess
      Tic
      CheckUpdateAggregatedAmountListReturnUsingComplexSlices
      PaysheetApplyTransformation
      Tic
      CheckPaysheetLineAreCreatedUsingComplexSlices
    > CheckPaysheetLineAmountsUsingComplexSlices
      CheckUpdateAggregatedAmountListReturnNothing
      CheckPaysheetLineAmountsUsingComplexSlices
  File "/home/buildbot/slave/full.ERP5/build/unit_test.1/Products/ERP5Type/tests/Sequence.py", line 98, in play
    method(sequence=sequence)
  File "/home/buildbot/slave/full.ERP5/build/unit_test.3/Products/ERP5/tests/testPayroll.py", line 765, in stepCheckPaysheetLineAmountsUsingComplexSlices
    self.assertEquals(cell1.getQuantity(), 200)
AssertionError: 3000.0 != 200


FAIL: test_paySheetCalculationWithBonus (testPayroll.TestPayroll)
----------------------------------------------------------------------
Traceback (most recent call last):
  File "/home/buildbot/slave/full.ERP5/build/products/ERP5Type/tests/backportUnittest.py", line 151, in run
    testMethod()
  File "/home/buildbot/slave/full.ERP5/build/unit_test.3/Products/ERP5/tests/testPayroll.py", line 2268, in test_paySheetCalculationWithBonus
    sequence_list.play(self)
  File "/home/buildbot/slave/full.ERP5/build/unit_test.1/Products/ERP5Type/tests/Sequence.py", line 195, in play
    sequence.play(context, sequence_number=i, quiet=quiet)
  File "/home/buildbot/slave/full.ERP5/build/unit_test.1/Products/ERP5Type/tests/Sequence.py", line 115, in play
    self._step_list[self._played_index] \
    Current Sequence:
      CreateUrssafService
      CreateLabourService
      CreateEmployer
      CreateEmployee
      CreatePriceCurrency
      CreateBasicModel
      Tic
      ModelCreateUrssafModelLine
      UrssafModelLineCreateMovements
      CreateBasicPaysheet
      PaysheetCreateLabourPaySheetLine
      Tic
      CreateBusinessProcess
      CreateBusinessLink
      CreateUrssafRoubaixOrganisation
      ModifyBusinessLinkTradePhase
      ModelSpecialiseBusinessProcess
      Tic
      CreateBonusService
      PaysheetCreateBonusPaySheetLine
      PaysheetCreateBonusPaySheetLineMovements
      CheckUpdateAggregatedAmountListReturn
      PaysheetApplyTransformation
      Tic
      CheckPaysheetLineAreCreatedUsingBonus
    > CheckPaysheetLineWithBonusAmounts
      CheckUpdateAggregatedAmountListReturnNothing
      CheckPaysheetLineWithBonusAmounts
  File "/home/buildbot/slave/full.ERP5/build/unit_test.1/Products/ERP5Type/tests/Sequence.py", line 98, in play
    method(sequence=sequence)
  File "/home/buildbot/slave/full.ERP5/build/unit_test.3/Products/ERP5/tests/testPayroll.py", line 682, in stepCheckPaysheetLineWithBonusAmounts
    self.assertEquals(cell1.getQuantity(), 4000)
AssertionError: 5000.0 != 4000


FAIL: test_sliceOnModelLine (testPayroll.TestPayroll)
----------------------------------------------------------------------
Traceback (most recent call last):
  File "/home/buildbot/slave/full.ERP5/build/products/ERP5Type/tests/backportUnittest.py", line 151, in run
    testMethod()
  File "/home/buildbot/slave/full.ERP5/build/unit_test.3/Products/ERP5/tests/testPayroll.py", line 2125, in test_sliceOnModelLine
    sequence_list.play(self)
  File "/home/buildbot/slave/full.ERP5/build/unit_test.1/Products/ERP5Type/tests/Sequence.py", line 195, in play
    sequence.play(context, sequence_number=i, quiet=quiet)
  File "/home/buildbot/slave/full.ERP5/build/unit_test.1/Products/ERP5Type/tests/Sequence.py", line 115, in play
    self._step_list[self._played_index] \
    Current Sequence:
      CreateUrssafService
      CreateLabourService
      CreateEmployer
      CreateEmployee
      CreatePriceCurrency
      CreateBasicModel
      Tic
      ModelCreateUrssafModelLine
      UrssafModelLineCreateMovements
      CreateBasicPaysheet
      PaysheetCreateLabourPaySheetLine
      Tic
      CreateBusinessProcess
      CreateBusinessLink
      CreateUrssafRoubaixOrganisation
      ModifyBusinessLinkTradePhase
      ModelSpecialiseBusinessProcess
      Tic
      CreateUrssafService
      CreateLabourService
      CreateEmployer
      CreateEmployee
      CreateModelWithSlices
      Tic
      ModelCreateUrssafModelLineWithSlices
      Tic
      UrssafModelLineWithSlicesCreateMovements
      CreateBasicPaysheet
      PaysheetCreateLabourPaySheetLine
      CreateBusinessProcess
      CreateBusinessLink
      CreateUrssafRoubaixOrganisation
      ModifyBusinessLinkTradePhase
      ModelSpecialiseBusinessProcess
      Tic
      CheckUpdateAggregatedAmountListReturnUsingSlices
      PaysheetApplyTransformation
      Tic
      CheckPaysheetLineAreCreatedUsingSlices
    > CheckPaysheetLineAmountsUsingSlices
      CheckUpdateAggregatedAmountListReturnNothing
      CheckPaysheetLineAmountsUsingSlices
  File "/home/buildbot/slave/full.ERP5/build/unit_test.1/Products/ERP5Type/tests/Sequence.py", line 98, in play
    method(sequence=sequence)
  File "/home/buildbot/slave/full.ERP5/build/unit_test.3/Products/ERP5/tests/testPayroll.py", line 725, in stepCheckPaysheetLineAmountsUsingSlices
    self.assertEquals(cell1.getQuantity(), 200)
AssertionError: 3000.0 != 200


FAIL: test_sourceSectionIsSetOnMovements (testPayroll.TestPayroll)
----------------------------------------------------------------------
Traceback (most recent call last):
  File "/home/buildbot/slave/full.ERP5/build/products/ERP5Type/tests/backportUnittest.py", line 151, in run
    testMethod()
  File "/home/buildbot/slave/full.ERP5/build/unit_test.3/Products/ERP5/tests/testPayroll.py", line 2095, in test_sourceSectionIsSetOnMovements
    sequence_list.play(self)
  File "/home/buildbot/slave/full.ERP5/build/unit_test.1/Products/ERP5Type/tests/Sequence.py", line 195, in play
    sequence.play(context, sequence_number=i, quiet=quiet)
  File "/home/buildbot/slave/full.ERP5/build/unit_test.1/Products/ERP5Type/tests/Sequence.py", line 115, in play
    self._step_list[self._played_index] \
    Current Sequence:
      CreateUrssafService
      CreateLabourService
      CreateEmployer
      CreateEmployee
      CreatePriceCurrency
      CreateBasicModel
      Tic
      ModelCreateUrssafModelLine
      UrssafModelLineCreateMovements
      CreateBasicPaysheet
      PaysheetCreateLabourPaySheetLine
      Tic
      CreateBusinessProcess
      CreateBusinessLink
      CreateUrssafRoubaixOrganisation
      ModifyBusinessLinkTradePhase
      ModelSpecialiseBusinessProcess
      Tic
      PaysheetApplyTransformation
      Tic
    > CheckSourceSectionOnMovements
  File "/home/buildbot/slave/full.ERP5/build/unit_test.1/Products/ERP5Type/tests/Sequence.py", line 98, in play
    method(sequence=sequence)
  File "/home/buildbot/slave/full.ERP5/build/unit_test.3/Products/ERP5/tests/testPayroll.py", line 919, in stepCheckSourceSectionOnMovements
    self.assertEquals(cell1.getSourceSectionValue(), urssaf_roubaix)
AssertionError: <Person at /erp5_portal_7b7a3575330a52ab2ff14077272db47e/person_module/22> != <Organisation at /erp5_portal_7b7a3575330a52ab2ff14077272db47e/organisation_module/43>


FAIL: test_updatePaysheetAfterModelModification (testPayroll.TestPayroll), generate a paysheet using a model, modify the model by adding a new
----------------------------------------------------------------------
Traceback (most recent call last):
  File "/home/buildbot/slave/full.ERP5/build/products/ERP5Type/tests/backportUnittest.py", line 151, in run
    testMethod()
  File "/home/buildbot/slave/full.ERP5/build/unit_test.3/Products/ERP5/tests/testPayroll.py", line 3329, in test_updatePaysheetAfterModelModification
    sequence_list.play(self)
  File "/home/buildbot/slave/full.ERP5/build/unit_test.1/Products/ERP5Type/tests/Sequence.py", line 195, in play
    sequence.play(context, sequence_number=i, quiet=quiet)
  File "/home/buildbot/slave/full.ERP5/build/unit_test.1/Products/ERP5Type/tests/Sequence.py", line 115, in play
    self._step_list[self._played_index] \
    Current Sequence:
      CreateUrssafService
      CreateLabourService
      CreateEmployer
      CreateEmployee
      CreatePriceCurrency
      CreateModelWithSlices
      Tic
      ModelCreateUrssafModelLine
      UrssafModelLineCreateMovements
      CreateBasicPaysheet
      PaysheetCreateLabourPaySheetLine
      Tic
      CreateBusinessProcess
      CreateBusinessLink
      CreateUrssafRoubaixOrganisation
      ModifyBusinessLinkTradePhase
      ModelSpecialiseBusinessProcess
      Tic
      CheckUpdateAggregatedAmountListReturn
      PaysheetApplyTransformation
      Tic
      CheckPaysheetLineAreCreated
      CheckPaysheetLineAmounts
      CheckUpdateAggregatedAmountListReturnNothing
      CheckPaysheetLineAmounts
      ModelCreateUrssafModelLineWithSlices
      Tic
      UrssafModelLineWithSlicesCreateMovements
      Tic
      PaysheetApplyTransformation
      Tic
      CheckPaysheetLineAreCreatedAfterUpdateWithLinesWithSameResource
    > CheckPaysheetLineAmountsAfterUpdateWithLinesWithSameResource
      CheckUpdateAggregatedAmountListReturnNothing
      CheckPaysheetLineAmountsAfterUpdateWithLinesWithSameResource
  File "/home/buildbot/slave/full.ERP5/build/unit_test.1/Products/ERP5Type/tests/Sequence.py", line 98, in play
    method(sequence=sequence)
  File "/home/buildbot/slave/full.ERP5/build/unit_test.3/Products/ERP5/tests/testPayroll.py", line 797, in stepCheckPaysheetLineAmountsAfterUpdateWithLinesWithSameResource
    self.assertEquals(cell1.getQuantity(), 200)
AssertionError: 3000.0 != 200


FAIL: test_01_getYearToDateSlice (testPayroll_l10n_fr.TestPayroll_l10n_fr), Check that is possible to calculate the total amount spend on a slice
----------------------------------------------------------------------
Traceback (most recent call last):
  File "/home/buildbot/slave/full.ERP5/build/products/ERP5Type/tests/backportUnittest.py", line 151, in run
    testMethod()
  File "/home/buildbot/slave/full.ERP5/build/unit_test.4/Products/ERP5/tests/testPayroll_l10n_fr.py", line 118, in test_01_getYearToDateSlice
    sequence_list.play(self)
  File "/home/buildbot/slave/full.ERP5/build/unit_test.1/Products/ERP5Type/tests/Sequence.py", line 195, in play
    sequence.play(context, sequence_number=i, quiet=quiet)
  File "/home/buildbot/slave/full.ERP5/build/unit_test.1/Products/ERP5Type/tests/Sequence.py", line 115, in play
    self._step_list[self._played_index] \
    Current Sequence:
      CreateUrssafService
      CreateLabourService
      CreateEmployer
      CreateEmployee
      CreatePriceCurrency
      CreateModelWithSlices
      SetCurrencyOnModel
      ModelCreateUrssafModelLineWithSlices
      UrssafModelLineWithSlicesCreateMovements
      CreateBasicPaysheet
      PaysheetSetModelAndApplyIt
      PaysheetCreateLabourPaySheetLine
      CreateBusinessProcess
      CreateBusinessLink
      CreateUrssafRoubaixOrganisation
      ModifyBusinessLinkTradePhase
      ModelSpecialiseBusinessProcess
      Tic
      CheckUpdateAggregatedAmountListReturnUsingSlices
      PaysheetApplyTransformation
      Tic
      CheckPaysheetLineAreCreatedUsingSlices
    > CheckPaysheetLineAmountsUsingSlices
      CheckUpdateAggregatedAmountListReturnNothing
      CheckPaysheetLineAmountsUsingSlices
      CreateBasicPaysheet
      PaysheetSetModelAndApplyIt
      PaysheetCreateLabourPaySheetLine
      CreateBusinessProcess
      CreateBusinessLink
      CreateUrssafRoubaixOrganisation
      ModifyBusinessLinkTradePhase
      ModelSpecialiseBusinessProcess
      Tic
      CheckUpdateAggregatedAmountListReturnUsingSlices
      PaysheetApplyTransformation
      Tic
      CheckPaysheetLineAreCreatedUsingSlices
      CheckPaysheetLineAmountsUsingSlices
      CheckUpdateAggregatedAmountListReturnNothing
      CheckPaysheetLineAmountsUsingSlices
      CheckYearToDateSliceAmount
  File "/home/buildbot/slave/full.ERP5/build/unit_test.1/Products/ERP5Type/tests/Sequence.py", line 98, in play
    method(sequence=sequence)
  File "/home/buildbot/slave/full.ERP5/build/unit_test.3/Products/ERP5/tests/testPayroll.py", line 725, in stepCheckPaysheetLineAmountsUsingSlices
    self.assertEquals(cell1.getQuantity(), 200)
AssertionError: 3000.0 != 200


ERROR: test_business_template_list_with_workflow_template_item (testSpellChecking.TestSpellChecking)
----------------------------------------------------------------------
Traceback (most recent call last):
  File "/home/buildbot/slave/full.ERP5/build/products/ERP5Type/tests/backportUnittest.py", line 140, in run
    self.setUp()
  File "/home/buildbot/slave/full.ERP5/build/unit_test.2/Products/ERP5Type/tests/ERP5TypeTestCase.py", line 522, in setUp
    use_dummy_mail_host=use_dummy_mail_host)
  File "/home/buildbot/slave/full.ERP5/build/unit_test.2/Products/ERP5Type/tests/ERP5TypeTestCase.py", line 910, in setUpERP5Site
    quiet=quiet)
  File "/home/buildbot/slave/full.ERP5/build/unit_test.2/Products/ERP5Type/tests/ERP5TypeTestCase.py", line 817, in _installBusinessTemplateList
    update_translation=1)
  File "/home/buildbot/slave/full.ERP5/build/unit_test.1/Products/ERP5Type/Base.py", line 238, in __call__
    result = apply(self.__dict__['_m'], (instance,) + args, kw)
  File "/home/buildbot/slave/full.ERP5/build/unit_test.1/Products/ERP5/Document/BusinessTemplate.py", line 4798, in install
    return self._install(**kw)
  File "/home/buildbot/slave/full.ERP5/build/unit_test.1/Products/ERP5/Document/BusinessTemplate.py", line 4730, in _install
    trashbin=trashbin, installed_bt=installed_bt)
  File "/home/buildbot/slave/full.ERP5/build/unit_test.1/Products/ERP5/Document/BusinessTemplate.py", line 3398, in install
    self.local_file_importer_name(name)
  File "/home/buildbot/slave/full.ERP5/build/unit_test.1/Products/ERP5Type/Utils.py", line 950, in importLocalDocument
    module = imp.load_source(class_path, path)
  File "/home/buildbot/slave/full.ERP5/build/unit_test.5/Document/OrderBuilder.py", line 31, in ?
    from Products.ERP5.Document.BPMBuilder import BPMBuilder
ImportError: No module named BPMBuilder


FAIL: testSupplyCellPropertyAndAccessor (testSupply.TestSaleSupply)
----------------------------------------------------------------------
Traceback (most recent call last):
  File "/home/buildbot/slave/full.ERP5/build/products/ERP5Type/tests/backportUnittest.py", line 151, in run
    testMethod()
  File "/home/buildbot/slave/full.ERP5/build/unit_test.6/Products/ERP5/tests/testSupply.py", line 331, in testSupplyCellPropertyAndAccessor
    self.assertEqual(supply_cell.getDestinationReference(), 'banana')
AssertionError: 'orange' != 'banana'


FAIL: testSupplyCellPropertyAndAccessor (testSupply.TestPurchaseSupply)
----------------------------------------------------------------------
Traceback (most recent call last):
  File "/home/buildbot/slave/full.ERP5/build/products/ERP5Type/tests/backportUnittest.py", line 151, in run
    testMethod()
  File "/home/buildbot/slave/full.ERP5/build/unit_test.6/Products/ERP5/tests/testSupply.py", line 331, in testSupplyCellPropertyAndAccessor
    self.assertEqual(supply_cell.getDestinationReference(), 'banana')
AssertionError: 'orange' != 'banana'


FAIL: testSupplyCellPropertyAndAccessor (testSupply.TestInternalSupply)
----------------------------------------------------------------------
Traceback (most recent call last):
  File "/home/buildbot/slave/full.ERP5/build/products/ERP5Type/tests/backportUnittest.py", line 151, in run
    testMethod()
  File "/home/buildbot/slave/full.ERP5/build/unit_test.6/Products/ERP5/tests/testSupply.py", line 331, in testSupplyCellPropertyAndAccessor
    self.assertEqual(supply_cell.getDestinationReference(), 'banana')
AssertionError: 'orange' != 'banana'


FAIL: test_tradeModelLineWithRounding (testTradeModelLine.TestTradeModelLineSale)
----------------------------------------------------------------------
Traceback (most recent call last):
  File "/home/buildbot/slave/full.ERP5/build/products/ERP5Type/tests/backportUnittest.py", line 151, in run
    testMethod()
  File "/home/buildbot/slave/full.ERP5/build/unit_test.3/Products/ERP5/tests/testTradeModelLine.py", line 1096, in test_tradeModelLineWithRounding
    self.assertEqual(2, len(amount_list)) # XXX 1 or 2 ???
AssertionError: 2 != 1


FAIL: test_tradeModelLineWithRounding (testTradeModelLinePurchase.TestTradeModelLinePurchase)
----------------------------------------------------------------------
Traceback (most recent call last):
  File "/home/buildbot/slave/full.ERP5/build/products/ERP5Type/tests/backportUnittest.py", line 151, in run
    testMethod()
  File "/home/buildbot/slave/full.ERP5/build/unit_test.3/Products/ERP5/tests/testTradeModelLine.py", line 1096, in test_tradeModelLineWithRounding
    self.assertEqual(2, len(amount_list)) # XXX 1 or 2 ???
AssertionError: 2 != 1


More information about the Erp5-report mailing list