[Erp5-report] PERF r39243 : 12 Tests, 0 Errors, 12 Failures, 0 Skips

nobody at svn.erp5.org nobody at svn.erp5.org
Fri Oct 15 18:31:28 CEST 2010


Test Suite: PERF
Revision: 39243
Result: FAIL

All tests: 12
Failures: 12
Errors: 0
Skips: 0


The following tests failed:

  testPerformance                                    (4 failures)
   test_00_viewBarObject (testPerformance.TestPerformance)
   test_01_viewBarModule (testPerformance.TestPerformance)
   test_02_viewFooObjectWithManyLines (testPerformance.TestPerformance)
   test_viewProxyField (testPerformance.TestPerformance)

  testPerformance                                    (4 failures)
   test_00_viewBarObject (testPerformance.TestPerformance)
   test_01_viewBarModule (testPerformance.TestPerformance)
   test_02_viewFooObjectWithManyLines (testPerformance.TestPerformance)
   test_viewProxyField (testPerformance.TestPerformance)

  testPerformance                                    (4 failures)
   test_00_viewBarObject (testPerformance.TestPerformance)
   test_01_viewBarModule (testPerformance.TestPerformance)
   test_02_viewFooObjectWithManyLines (testPerformance.TestPerformance)
   test_viewProxyField (testPerformance.TestPerformance)

-------------- next part --------------
objective time to view object form 0.1440 < 0.1542 < 0.1470

nb objects = 000100
	add = 0.0068 < 0.0071 < 0.0073
	tic = 0.0323 < 0.0304 < 0.0344
	view = 0.1480 < 0.1604 < 0.1530

nb objects = 000200
	add = 0.0068 < 0.0071 < 0.0073
	tic = 0.0323 < 0.0303 < 0.0344
	view = 0.1497 < 0.1619 < 0.1547

nb objects = 000300
	add = 0.0068 < 0.0072 < 0.0073
	tic = 0.0323 < 0.0301 < 0.0344
	view = 0.1515 < 0.1637 < 0.1565

nb objects = 000400
	add = 0.0068 < 0.0071 < 0.0073
	tic = 0.0323 < 0.0303 < 0.0344
	view = 0.1532 < 0.1654 < 0.1582

nb objects = 000500
	add = 0.0068 < 0.0071 < 0.0073
	tic = 0.0323 < 0.0303 < 0.0344
	view = 0.1549 < 0.1671 < 0.1599

nb objects = 000600
	add = 0.0068 < 0.0072 < 0.0073
	tic = 0.0323 < 0.0304 < 0.0344
	view = 0.1566 < 0.1691 < 0.1616

nb objects = 000700
	add = 0.0068 < 0.0071 < 0.0073
	tic = 0.0323 < 0.0302 < 0.0344
	view = 0.1584 < 0.1708 < 0.1634

nb objects = 000800
	add = 0.0068 < 0.0071 < 0.0073
	tic = 0.0323 < 0.0305 < 0.0344
	view = 0.1601 < 0.1725 < 0.1651

nb objects = 000900
	add = 0.0068 < 0.0072 < 0.0073
	tic = 0.0323 < 0.0300 < 0.0344
	view = 0.1618 < 0.1741 < 0.1668

nb objects = 001000
	add = 0.0068 < 0.0071 < 0.0073
	tic = 0.0323 < 0.0304 < 0.0344
	view = 0.1636 < 0.1755 < 0.1686

time to view object form with many lines 0.2800 < 0.2974 < 0.2860

time to view proxyfield form 0.2130 < 0.2301 < 0.2170

Loading Zope ... 
Cleaning static files ... 
Instance at '/home/buildbot/slave/parts/bot_perf/full.PERF/build/unit_test' loaded ... 
done (15.304s)test_00_viewBarObject (testPerformance.TestPerformance) ... 
Adding ERP5TypeTestCase user ... 
Adding erp5_portal_46b1242f30d521c53e744f4886ef0be0 ERP5 Site ... done (109.872s)
Running ZServer at 127.0.0.1:55166
Adding erp5_base business template ... (imported in 16.922s) done (49.703s)
Adding erp5_ui_test business template ... (imported in 4.536s) done (14.550s)
Executing pending activities ... 357 337 done (21.236s)
Logout ... 
done (196.932s)
Running Unit tests of Performance
FAIL
test_01_viewBarModule (testPerformance.TestPerformance) ... FAIL
test_02_viewFooObjectWithManyLines (testPerformance.TestPerformance) ... FAIL
test_viewProxyField (testPerformance.TestPerformance) ... FAIL

======================================================================
FAIL: test_00_viewBarObject (testPerformance.TestPerformance)
----------------------------------------------------------------------
Traceback (most recent call last):
  File "/home/buildbot/slave/parts/bot_perf/full.PERF/build/products/ERP5Type/tests/backportUnittest.py", line 151, in run
    testMethod()
  File "/home/buildbot/slave/parts/bot_perf/full.PERF/build/Products/ERP5Type/tests/testPerformance.py", line 224, in test_00_viewBarObject
    prefix='objective')
  File "/home/buildbot/slave/parts/bot_perf/full.PERF/build/Products/ERP5Type/tests/testPerformance.py", line 202, in checkViewBarObject
    '%.4f < %.4f < %.4f' % (min, req_time, max))
AssertionError: 0.1440 < 0.1542 < 0.1470

======================================================================
FAIL: test_01_viewBarModule (testPerformance.TestPerformance)
----------------------------------------------------------------------
Traceback (most recent call last):
  File "/home/buildbot/slave/parts/bot_perf/full.PERF/build/products/ERP5Type/tests/backportUnittest.py", line 151, in run
    testMethod()
  File "/home/buildbot/slave/parts/bot_perf/full.PERF/build/Products/ERP5Type/tests/testPerformance.py", line 311, in test_01_viewBarModule
    'View: %.4f < %.4f < %.4f' % (
AssertionError: View: 0.1480 < 0.1604 < 0.1530

======================================================================
FAIL: test_02_viewFooObjectWithManyLines (testPerformance.TestPerformance)
----------------------------------------------------------------------
Traceback (most recent call last):
  File "/home/buildbot/slave/parts/bot_perf/full.PERF/build/products/ERP5Type/tests/backportUnittest.py", line 151, in run
    testMethod()
  File "/home/buildbot/slave/parts/bot_perf/full.PERF/build/Products/ERP5Type/tests/testPerformance.py", line 387, in test_02_viewFooObjectWithManyLines
    '%.4f < %.4f < %.4f' % (
AssertionError: 0.2800 < 0.2974 < 0.2860

======================================================================
FAIL: test_viewProxyField (testPerformance.TestPerformance)
----------------------------------------------------------------------
Traceback (most recent call last):
  File "/home/buildbot/slave/parts/bot_perf/full.PERF/build/products/ERP5Type/tests/backportUnittest.py", line 151, in run
    testMethod()
  File "/home/buildbot/slave/parts/bot_perf/full.PERF/build/Products/ERP5Type/tests/testPerformance.py", line 354, in test_viewProxyField
    '%.4f < %.4f < %.4f' % (
AssertionError: 0.2130 < 0.2301 < 0.2170

----------------------------------------------------------------------
Ran 4 tests in 548.639s

FAILED (failures=4)
objective time to view object form 0.1440 < 0.1542 < 0.1470

nb objects = 000100
	add = 0.0068 < 0.0071 < 0.0073
	tic = 0.0323 < 0.0304 < 0.0344
	view = 0.1480 < 0.1604 < 0.1530

nb objects = 000200
	add = 0.0068 < 0.0070 < 0.0073
	tic = 0.0323 < 0.0301 < 0.0344
	view = 0.1497 < 0.1622 < 0.1547

nb objects = 000300
	add = 0.0068 < 0.0072 < 0.0073
	tic = 0.0323 < 0.0303 < 0.0344
	view = 0.1515 < 0.1636 < 0.1565

nb objects = 000400
	add = 0.0068 < 0.0071 < 0.0073
	tic = 0.0323 < 0.0303 < 0.0344
	view = 0.1532 < 0.1652 < 0.1582

nb objects = 000500
	add = 0.0068 < 0.0071 < 0.0073
	tic = 0.0323 < 0.0301 < 0.0344
	view = 0.1549 < 0.1672 < 0.1599

nb objects = 000600
	add = 0.0068 < 0.0072 < 0.0073
	tic = 0.0323 < 0.0312 < 0.0344
	view = 0.1566 < 0.1693 < 0.1616

nb objects = 000700
	add = 0.0068 < 0.0071 < 0.0073
	tic = 0.0323 < 0.0308 < 0.0344
	view = 0.1584 < 0.1709 < 0.1634

nb objects = 000800
	add = 0.0068 < 0.0071 < 0.0073
	tic = 0.0323 < 0.0305 < 0.0344
	view = 0.1601 < 0.1723 < 0.1651

nb objects = 000900
	add = 0.0068 < 0.0072 < 0.0073
	tic = 0.0323 < 0.0307 < 0.0344
	view = 0.1618 < 0.1741 < 0.1668

nb objects = 001000
	add = 0.0068 < 0.0071 < 0.0073
	tic = 0.0323 < 0.0308 < 0.0344
	view = 0.1636 < 0.1756 < 0.1686

time to view object form with many lines 0.2800 < 0.2971 < 0.2860

time to view proxyfield form 0.2130 < 0.2296 < 0.2170

Loading Zope ... 
Cleaning static files ... 
Instance at '/home/buildbot/slave/parts/bot_perf/full.PERF/build/unit_test' loaded ... 
done (12.593s)test_00_viewBarObject (testPerformance.TestPerformance) ... 
Adding ERP5TypeTestCase user ... 
Adding erp5_portal_46b1242f30d521c53e744f4886ef0be0 ERP5 Site ... done (109.102s)
Running ZServer at 127.0.0.1:55166
Adding erp5_base business template ... (imported in 16.846s) done (49.571s)
Adding erp5_ui_test business template ... (imported in 4.547s) done (14.556s)
Executing pending activities ... 357 337 done (21.268s)
Logout ... 
done (196.066s)
Running Unit tests of Performance
FAIL
test_01_viewBarModule (testPerformance.TestPerformance) ... FAIL
test_02_viewFooObjectWithManyLines (testPerformance.TestPerformance) ... FAIL
test_viewProxyField (testPerformance.TestPerformance) ... FAIL

======================================================================
FAIL: test_00_viewBarObject (testPerformance.TestPerformance)
----------------------------------------------------------------------
Traceback (most recent call last):
  File "/home/buildbot/slave/parts/bot_perf/full.PERF/build/products/ERP5Type/tests/backportUnittest.py", line 151, in run
    testMethod()
  File "/home/buildbot/slave/parts/bot_perf/full.PERF/build/Products/ERP5Type/tests/testPerformance.py", line 224, in test_00_viewBarObject
    prefix='objective')
  File "/home/buildbot/slave/parts/bot_perf/full.PERF/build/Products/ERP5Type/tests/testPerformance.py", line 202, in checkViewBarObject
    '%.4f < %.4f < %.4f' % (min, req_time, max))
AssertionError: 0.1440 < 0.1542 < 0.1470

======================================================================
FAIL: test_01_viewBarModule (testPerformance.TestPerformance)
----------------------------------------------------------------------
Traceback (most recent call last):
  File "/home/buildbot/slave/parts/bot_perf/full.PERF/build/products/ERP5Type/tests/backportUnittest.py", line 151, in run
    testMethod()
  File "/home/buildbot/slave/parts/bot_perf/full.PERF/build/Products/ERP5Type/tests/testPerformance.py", line 311, in test_01_viewBarModule
    'View: %.4f < %.4f < %.4f' % (
AssertionError: View: 0.1480 < 0.1604 < 0.1530

======================================================================
FAIL: test_02_viewFooObjectWithManyLines (testPerformance.TestPerformance)
----------------------------------------------------------------------
Traceback (most recent call last):
  File "/home/buildbot/slave/parts/bot_perf/full.PERF/build/products/ERP5Type/tests/backportUnittest.py", line 151, in run
    testMethod()
  File "/home/buildbot/slave/parts/bot_perf/full.PERF/build/Products/ERP5Type/tests/testPerformance.py", line 387, in test_02_viewFooObjectWithManyLines
    '%.4f < %.4f < %.4f' % (
AssertionError: 0.2800 < 0.2971 < 0.2860

======================================================================
FAIL: test_viewProxyField (testPerformance.TestPerformance)
----------------------------------------------------------------------
Traceback (most recent call last):
  File "/home/buildbot/slave/parts/bot_perf/full.PERF/build/products/ERP5Type/tests/backportUnittest.py", line 151, in run
    testMethod()
  File "/home/buildbot/slave/parts/bot_perf/full.PERF/build/Products/ERP5Type/tests/testPerformance.py", line 354, in test_viewProxyField
    '%.4f < %.4f < %.4f' % (
AssertionError: 0.2130 < 0.2296 < 0.2170

----------------------------------------------------------------------
Ran 4 tests in 548.052s

FAILED (failures=4)
objective time to view object form 0.1440 < 0.1542 < 0.1470

nb objects = 000100
	add = 0.0068 < 0.0071 < 0.0073
	tic = 0.0323 < 0.0307 < 0.0344
	view = 0.1480 < 0.1605 < 0.1530

nb objects = 000200
	add = 0.0068 < 0.0070 < 0.0073
	tic = 0.0323 < 0.0304 < 0.0344
	view = 0.1497 < 0.1621 < 0.1547

nb objects = 000300
	add = 0.0068 < 0.0072 < 0.0073
	tic = 0.0323 < 0.0302 < 0.0344
	view = 0.1515 < 0.1638 < 0.1565

nb objects = 000400
	add = 0.0068 < 0.0071 < 0.0073
	tic = 0.0323 < 0.0304 < 0.0344
	view = 0.1532 < 0.1653 < 0.1582

nb objects = 000500
	add = 0.0068 < 0.0071 < 0.0073
	tic = 0.0323 < 0.0305 < 0.0344
	view = 0.1549 < 0.1670 < 0.1599

nb objects = 000600
	add = 0.0068 < 0.0072 < 0.0073
	tic = 0.0323 < 0.0305 < 0.0344
	view = 0.1566 < 0.1693 < 0.1616

nb objects = 000700
	add = 0.0068 < 0.0071 < 0.0073
	tic = 0.0323 < 0.0303 < 0.0344
	view = 0.1584 < 0.1708 < 0.1634

nb objects = 000800
	add = 0.0068 < 0.0070 < 0.0073
	tic = 0.0323 < 0.0305 < 0.0344
	view = 0.1601 < 0.1720 < 0.1651

nb objects = 000900
	add = 0.0068 < 0.0072 < 0.0073
	tic = 0.0323 < 0.0302 < 0.0344
	view = 0.1618 < 0.1739 < 0.1668

nb objects = 001000
	add = 0.0068 < 0.0070 < 0.0073
	tic = 0.0323 < 0.0303 < 0.0344
	view = 0.1636 < 0.1753 < 0.1686

time to view object form with many lines 0.2800 < 0.2972 < 0.2860

time to view proxyfield form 0.2130 < 0.2297 < 0.2170

Loading Zope ... 
Cleaning static files ... 
Instance at '/home/buildbot/slave/parts/bot_perf/full.PERF/build/unit_test' loaded ... 
done (12.589s)test_00_viewBarObject (testPerformance.TestPerformance) ... 
Adding ERP5TypeTestCase user ... 
Adding erp5_portal_46b1242f30d521c53e744f4886ef0be0 ERP5 Site ... done (109.375s)
Running ZServer at 127.0.0.1:55166
Adding erp5_base business template ... (imported in 17.010s) done (49.934s)
Adding erp5_ui_test business template ... (imported in 4.543s) done (14.567s)
Executing pending activities ... 357 337 done (21.174s)
Logout ... 
done (196.622s)
Running Unit tests of Performance
FAIL
test_01_viewBarModule (testPerformance.TestPerformance) ... FAIL
test_02_viewFooObjectWithManyLines (testPerformance.TestPerformance) ... FAIL
test_viewProxyField (testPerformance.TestPerformance) ... FAIL

======================================================================
FAIL: test_00_viewBarObject (testPerformance.TestPerformance)
----------------------------------------------------------------------
Traceback (most recent call last):
  File "/home/buildbot/slave/parts/bot_perf/full.PERF/build/products/ERP5Type/tests/backportUnittest.py", line 151, in run
    testMethod()
  File "/home/buildbot/slave/parts/bot_perf/full.PERF/build/Products/ERP5Type/tests/testPerformance.py", line 224, in test_00_viewBarObject
    prefix='objective')
  File "/home/buildbot/slave/parts/bot_perf/full.PERF/build/Products/ERP5Type/tests/testPerformance.py", line 202, in checkViewBarObject
    '%.4f < %.4f < %.4f' % (min, req_time, max))
AssertionError: 0.1440 < 0.1542 < 0.1470

======================================================================
FAIL: test_01_viewBarModule (testPerformance.TestPerformance)
----------------------------------------------------------------------
Traceback (most recent call last):
  File "/home/buildbot/slave/parts/bot_perf/full.PERF/build/products/ERP5Type/tests/backportUnittest.py", line 151, in run
    testMethod()
  File "/home/buildbot/slave/parts/bot_perf/full.PERF/build/Products/ERP5Type/tests/testPerformance.py", line 311, in test_01_viewBarModule
    'View: %.4f < %.4f < %.4f' % (
AssertionError: View: 0.1480 < 0.1605 < 0.1530

======================================================================
FAIL: test_02_viewFooObjectWithManyLines (testPerformance.TestPerformance)
----------------------------------------------------------------------
Traceback (most recent call last):
  File "/home/buildbot/slave/parts/bot_perf/full.PERF/build/products/ERP5Type/tests/backportUnittest.py", line 151, in run
    testMethod()
  File "/home/buildbot/slave/parts/bot_perf/full.PERF/build/Products/ERP5Type/tests/testPerformance.py", line 387, in test_02_viewFooObjectWithManyLines
    '%.4f < %.4f < %.4f' % (
AssertionError: 0.2800 < 0.2972 < 0.2860

======================================================================
FAIL: test_viewProxyField (testPerformance.TestPerformance)
----------------------------------------------------------------------
Traceback (most recent call last):
  File "/home/buildbot/slave/parts/bot_perf/full.PERF/build/products/ERP5Type/tests/backportUnittest.py", line 151, in run
    testMethod()
  File "/home/buildbot/slave/parts/bot_perf/full.PERF/build/Products/ERP5Type/tests/testPerformance.py", line 354, in test_viewProxyField
    '%.4f < %.4f < %.4f' % (
AssertionError: 0.2130 < 0.2297 < 0.2170

----------------------------------------------------------------------
Ran 4 tests in 548.303s

FAILED (failures=4)


More information about the Erp5-report mailing list