[Erp5-report] PERF r30852: 12 Tests, 0 Errors, 3 Failures

nobody at svn.erp5.org nobody at svn.erp5.org
Tue Nov 24 19:39:46 CET 2009


Test Suite: PERF
Revision: 30852
Result: FAIL

All tests: 12
Failures: 3
Errors: 0


The following tests failed:

  testPerformance                                    (1 failures)
   test_01_viewBarModule (testPerformance.TestPerformance)

  testPerformance                                    (1 failures)
   test_01_viewBarModule (testPerformance.TestPerformance)

  testPerformance                                    (1 failures)
   test_01_viewBarModule (testPerformance.TestPerformance)
-------------- next part --------------
objective time to view object form 0.1420 < 0.1431 < 0.1440

nb objects = 000100
	add = 0.0068 < 0.0070 < 0.0073
	tic = 0.0329 < 0.0392 < 0.0350
	view = 0.1470 < 0.1483 < 0.1500

nb objects = 000200
	add = 0.0068 < 0.0070 < 0.0073
	tic = 0.0329 < 0.0388 < 0.0350
	view = 0.1487 < 0.1498 < 0.1517

nb objects = 000300
	add = 0.0068 < 0.0070 < 0.0073
	tic = 0.0329 < 0.0387 < 0.0350
	view = 0.1504 < 0.1517 < 0.1534

nb objects = 000400
	add = 0.0068 < 0.0070 < 0.0073
	tic = 0.0329 < 0.0383 < 0.0350
	view = 0.1521 < 0.1534 < 0.1551

nb objects = 000500
	add = 0.0068 < 0.0070 < 0.0073
	tic = 0.0329 < 0.0386 < 0.0350
	view = 0.1538 < 0.1550 < 0.1568

nb objects = 000600
	add = 0.0068 < 0.0070 < 0.0073
	tic = 0.0329 < 0.0385 < 0.0350
	view = 0.1555 < 0.1567 < 0.1585

nb objects = 000700
	add = 0.0068 < 0.0071 < 0.0073
	tic = 0.0329 < 0.0384 < 0.0350
	view = 0.1571 < 0.1584 < 0.1601

nb objects = 000800
	add = 0.0068 < 0.0070 < 0.0073
	tic = 0.0329 < 0.0387 < 0.0350
	view = 0.1588 < 0.1602 < 0.1618

nb objects = 000900
	add = 0.0068 < 0.0070 < 0.0073
	tic = 0.0329 < 0.0385 < 0.0350
	view = 0.1605 < 0.1617 < 0.1635

nb objects = 001000
	add = 0.0068 < 0.0070 < 0.0073
	tic = 0.0329 < 0.0383 < 0.0350
	view = 0.1622 < 0.1631 < 0.1652

time to view object form with many lines 0.2880 < 0.2897 < 0.2920

time to view proxyfield form 0.2250 < 0.2259 < 0.2280


Loading Zope ... Cleaning static files ... Instance at '/home/buildbot/slave/parts/bot_perf/full.PERF/build/unit_test' loaded ... done (10.545s)
Adding ERP5TypeTestCase user ... 
Adding erp5_portal_46b1242f30d521c53e744f4886ef0be0 ERP5 Site ... done (82.915s)
Running ZServer on port 55166
Adding erp5_base business template ... (imported in 15.510s) done (31.024s)
Adding erp5_ui_test business template ... (imported in 5.710s) done (11.941s)
Executing pending activities ... 286 267 done (21.871s)
Logout ... 
done (149.009s)
Running Unit tests of Performance
.F..
======================================================================
FAIL: test_01_viewBarModule (testPerformance.TestPerformance)
----------------------------------------------------------------------
Traceback (most recent call last):
  File "/home/buildbot/slave/parts/bot_perf/full.PERF/build/Products/ERP5Type/tests/backportUnittest.py", line 134, in run
    testMethod()
  File "/home/buildbot/slave/parts/bot_perf/full.PERF/build/Products/ERP5Type/tests/testPerformance.py", line 291, in test_01_viewBarModule
    'Tic: %.4f < %.4f < %.4f' % (
AssertionError: Tic: 0.0329 < 0.0392 < 0.0350

----------------------------------------------------------------------
Ran 4 tests in 536.270s

FAILED (failures=1)

objective time to view object form 0.1420 < 0.1435 < 0.1440

nb objects = 000100
	add = 0.0068 < 0.0071 < 0.0073
	tic = 0.0329 < 0.0393 < 0.0350
	view = 0.1470 < 0.1488 < 0.1500

nb objects = 000200
	add = 0.0068 < 0.0070 < 0.0073
	tic = 0.0329 < 0.0387 < 0.0350
	view = 0.1487 < 0.1505 < 0.1517

nb objects = 000300
	add = 0.0068 < 0.0070 < 0.0073
	tic = 0.0329 < 0.0383 < 0.0350
	view = 0.1504 < 0.1525 < 0.1534

nb objects = 000400
	add = 0.0068 < 0.0070 < 0.0073
	tic = 0.0329 < 0.0387 < 0.0350
	view = 0.1521 < 0.1542 < 0.1551

nb objects = 000500
	add = 0.0068 < 0.0070 < 0.0073
	tic = 0.0329 < 0.0386 < 0.0350
	view = 0.1538 < 0.1560 < 0.1568

nb objects = 000600
	add = 0.0068 < 0.0070 < 0.0073
	tic = 0.0329 < 0.0386 < 0.0350
	view = 0.1555 < 0.1579 < 0.1585

nb objects = 000700
	add = 0.0068 < 0.0071 < 0.0073
	tic = 0.0329 < 0.0389 < 0.0350
	view = 0.1571 < 0.1595 < 0.1601

nb objects = 000800
	add = 0.0068 < 0.0070 < 0.0073
	tic = 0.0329 < 0.0388 < 0.0350
	view = 0.1588 < 0.1611 < 0.1618

nb objects = 000900
	add = 0.0068 < 0.0070 < 0.0073
	tic = 0.0329 < 0.0389 < 0.0350
	view = 0.1605 < 0.1628 < 0.1635

nb objects = 001000
	add = 0.0068 < 0.0071 < 0.0073
	tic = 0.0329 < 0.0389 < 0.0350
	view = 0.1622 < 0.1644 < 0.1652

time to view object form with many lines 0.2880 < 0.2906 < 0.2920

time to view proxyfield form 0.2250 < 0.2261 < 0.2280


Loading Zope ... Cleaning static files ... Instance at '/home/buildbot/slave/parts/bot_perf/full.PERF/build/unit_test' loaded ... done (14.473s)
Adding ERP5TypeTestCase user ... 
Adding erp5_portal_46b1242f30d521c53e744f4886ef0be0 ERP5 Site ... done (75.098s)
Running ZServer on port 55166
Adding erp5_base business template ... (imported in 14.415s) done (29.951s)
Adding erp5_ui_test business template ... (imported in 4.019s) done (10.283s)
Executing pending activities ... 286 267 done (22.440s)
Logout ... 
done (138.947s)
Running Unit tests of Performance
.F..
======================================================================
FAIL: test_01_viewBarModule (testPerformance.TestPerformance)
----------------------------------------------------------------------
Traceback (most recent call last):
  File "/home/buildbot/slave/parts/bot_perf/full.PERF/build/Products/ERP5Type/tests/backportUnittest.py", line 134, in run
    testMethod()
  File "/home/buildbot/slave/parts/bot_perf/full.PERF/build/Products/ERP5Type/tests/testPerformance.py", line 291, in test_01_viewBarModule
    'Tic: %.4f < %.4f < %.4f' % (
AssertionError: Tic: 0.0329 < 0.0393 < 0.0350

----------------------------------------------------------------------
Ran 4 tests in 527.423s

FAILED (failures=1)

objective time to view object form 0.1420 < 0.1434 < 0.1440

nb objects = 000100
	add = 0.0068 < 0.0071 < 0.0073
	tic = 0.0329 < 0.0388 < 0.0350
	view = 0.1470 < 0.1489 < 0.1500

nb objects = 000200
	add = 0.0068 < 0.0070 < 0.0073
	tic = 0.0329 < 0.0386 < 0.0350
	view = 0.1487 < 0.1505 < 0.1517

nb objects = 000300
	add = 0.0068 < 0.0070 < 0.0073
	tic = 0.0329 < 0.0386 < 0.0350
	view = 0.1504 < 0.1527 < 0.1534

nb objects = 000400
	add = 0.0068 < 0.0070 < 0.0073
	tic = 0.0329 < 0.0386 < 0.0350
	view = 0.1521 < 0.1543 < 0.1551

nb objects = 000500
	add = 0.0068 < 0.0070 < 0.0073
	tic = 0.0329 < 0.0389 < 0.0350
	view = 0.1538 < 0.1562 < 0.1568

nb objects = 000600
	add = 0.0068 < 0.0070 < 0.0073
	tic = 0.0329 < 0.0388 < 0.0350
	view = 0.1555 < 0.1582 < 0.1585

nb objects = 000700
	add = 0.0068 < 0.0070 < 0.0073
	tic = 0.0329 < 0.0390 < 0.0350
	view = 0.1571 < 0.1598 < 0.1601

nb objects = 000800
	add = 0.0068 < 0.0070 < 0.0073
	tic = 0.0329 < 0.0386 < 0.0350
	view = 0.1588 < 0.1614 < 0.1618

nb objects = 000900
	add = 0.0068 < 0.0070 < 0.0073
	tic = 0.0329 < 0.0387 < 0.0350
	view = 0.1605 < 0.1631 < 0.1635

nb objects = 001000
	add = 0.0068 < 0.0070 < 0.0073
	tic = 0.0329 < 0.0384 < 0.0350
	view = 0.1622 < 0.1646 < 0.1652

time to view object form with many lines 0.2880 < 0.2903 < 0.2920

time to view proxyfield form 0.2250 < 0.2263 < 0.2280


Loading Zope ... Cleaning static files ... Instance at '/home/buildbot/slave/parts/bot_perf/full.PERF/build/unit_test' loaded ... done (10.343s)
Adding ERP5TypeTestCase user ... 
Adding erp5_portal_46b1242f30d521c53e744f4886ef0be0 ERP5 Site ... done (73.907s)
Running ZServer on port 55166
Adding erp5_base business template ... (imported in 13.758s) done (29.245s)
Adding erp5_ui_test business template ... (imported in 4.033s) done (10.257s)
Executing pending activities ... 286 267 done (21.921s)
Logout ... 
done (136.448s)
Running Unit tests of Performance
.F..
======================================================================
FAIL: test_01_viewBarModule (testPerformance.TestPerformance)
----------------------------------------------------------------------
Traceback (most recent call last):
  File "/home/buildbot/slave/parts/bot_perf/full.PERF/build/Products/ERP5Type/tests/backportUnittest.py", line 134, in run
    testMethod()
  File "/home/buildbot/slave/parts/bot_perf/full.PERF/build/Products/ERP5Type/tests/testPerformance.py", line 291, in test_01_viewBarModule
    'Tic: %.4f < %.4f < %.4f' % (
AssertionError: Tic: 0.0329 < 0.0388 < 0.0350

----------------------------------------------------------------------
Ran 4 tests in 525.656s

FAILED (failures=1)


More information about the Erp5-report mailing list