[Erp5-report] PERF r30752: 12 Tests, 0 Errors, 3 Failures

nobody at svn.erp5.org nobody at svn.erp5.org
Thu Nov 19 01:44:48 CET 2009


Test Suite: PERF
Revision: 30752
Result: FAIL

All tests: 12
Failures: 3
Errors: 0


The following tests failed:

  testPerformance                                    (1 failures)
   test_01_viewBarModule (testPerformance.TestPerformance)

  testPerformance                                    (1 failures)
   test_01_viewBarModule (testPerformance.TestPerformance)

  testPerformance                                    (1 failures)
   test_01_viewBarModule (testPerformance.TestPerformance)
-------------- next part --------------
objective time to view object form 0.1420 < 0.1426 < 0.1440

nb objects = 000100
	add = 0.0068 < 0.0071 < 0.0073
	tic = 0.0329 < 0.0392 < 0.0350
	view = 0.1470 < 0.1481 < 0.1500

nb objects = 000200
	add = 0.0068 < 0.0070 < 0.0073
	tic = 0.0329 < 0.0385 < 0.0350
	view = 0.1487 < 0.1496 < 0.1517

nb objects = 000300
	add = 0.0068 < 0.0070 < 0.0073
	tic = 0.0329 < 0.0385 < 0.0350
	view = 0.1504 < 0.1517 < 0.1534

nb objects = 000400
	add = 0.0068 < 0.0070 < 0.0073
	tic = 0.0329 < 0.0382 < 0.0350
	view = 0.1521 < 0.1535 < 0.1551

nb objects = 000500
	add = 0.0068 < 0.0070 < 0.0073
	tic = 0.0329 < 0.0386 < 0.0350
	view = 0.1538 < 0.1551 < 0.1568

nb objects = 000600
	add = 0.0068 < 0.0070 < 0.0073
	tic = 0.0329 < 0.0384 < 0.0350
	view = 0.1555 < 0.1571 < 0.1585

nb objects = 000700
	add = 0.0068 < 0.0072 < 0.0073
	tic = 0.0329 < 0.0383 < 0.0350
	view = 0.1571 < 0.1587 < 0.1601

nb objects = 000800
	add = 0.0068 < 0.0070 < 0.0073
	tic = 0.0329 < 0.0382 < 0.0350
	view = 0.1588 < 0.1601 < 0.1618

nb objects = 000900
	add = 0.0068 < 0.0070 < 0.0073
	tic = 0.0329 < 0.0387 < 0.0350
	view = 0.1605 < 0.1619 < 0.1635

nb objects = 001000
	add = 0.0068 < 0.0070 < 0.0073
	tic = 0.0329 < 0.0387 < 0.0350
	view = 0.1622 < 0.1634 < 0.1652

time to view object form with many lines 0.2880 < 0.2899 < 0.2920

time to view proxyfield form 0.2250 < 0.2257 < 0.2280


Loading Zope ... Cleaning static files ... Instance at '/home/buildbot/slave/parts/bot_perf/full.PERF/build/unit_test' loaded ... done (10.554s)
Adding ERP5TypeTestCase user ... 
Adding erp5_portal_46b1242f30d521c53e744f4886ef0be0 ERP5 Site ... done (82.081s)
Running ZServer on port 55166
Adding erp5_base business template ... (imported in 15.854s) done (31.257s)
Adding erp5_ui_test business template ... (imported in 5.807s) done (12.005s)
Executing pending activities ... 286 267 done (22.234s)
Logout ... 
done (148.772s)
Ran Unit test of Performance
.F..
======================================================================
FAIL: test_01_viewBarModule (testPerformance.TestPerformance)
----------------------------------------------------------------------
Traceback (most recent call last):
  File "/home/buildbot/slave/parts/bot_perf/full.PERF/build/Products/ERP5Type/tests/backportUnittest.py", line 134, in run
    testMethod()
  File "/home/buildbot/slave/parts/bot_perf/full.PERF/build/Products/ERP5Type/tests/testPerformance.py", line 291, in test_01_viewBarModule
    'Tic: %.4f < %.4f < %.4f' % (
AssertionError: Tic: 0.0329 < 0.0392 < 0.0350

----------------------------------------------------------------------
Ran 4 tests in 535.962s

FAILED (failures=1)

objective time to view object form 0.1420 < 0.1432 < 0.1440

nb objects = 000100
	add = 0.0068 < 0.0070 < 0.0073
	tic = 0.0329 < 0.0393 < 0.0350
	view = 0.1470 < 0.1485 < 0.1500

nb objects = 000200
	add = 0.0068 < 0.0070 < 0.0073
	tic = 0.0329 < 0.0386 < 0.0350
	view = 0.1487 < 0.1503 < 0.1517

nb objects = 000300
	add = 0.0068 < 0.0070 < 0.0073
	tic = 0.0329 < 0.0389 < 0.0350
	view = 0.1504 < 0.1522 < 0.1534

nb objects = 000400
	add = 0.0068 < 0.0070 < 0.0073
	tic = 0.0329 < 0.0387 < 0.0350
	view = 0.1521 < 0.1541 < 0.1551

nb objects = 000500
	add = 0.0068 < 0.0070 < 0.0073
	tic = 0.0329 < 0.0384 < 0.0350
	view = 0.1538 < 0.1557 < 0.1568

nb objects = 000600
	add = 0.0068 < 0.0070 < 0.0073
	tic = 0.0329 < 0.0385 < 0.0350
	view = 0.1555 < 0.1579 < 0.1585

nb objects = 000700
	add = 0.0068 < 0.0070 < 0.0073
	tic = 0.0329 < 0.0383 < 0.0350
	view = 0.1571 < 0.1596 < 0.1601

nb objects = 000800
	add = 0.0068 < 0.0070 < 0.0073
	tic = 0.0329 < 0.0386 < 0.0350
	view = 0.1588 < 0.1610 < 0.1618

nb objects = 000900
	add = 0.0068 < 0.0070 < 0.0073
	tic = 0.0329 < 0.0387 < 0.0350
	view = 0.1605 < 0.1628 < 0.1635

nb objects = 001000
	add = 0.0068 < 0.0070 < 0.0073
	tic = 0.0329 < 0.0385 < 0.0350
	view = 0.1622 < 0.1644 < 0.1652

time to view object form with many lines 0.2880 < 0.2902 < 0.2920

time to view proxyfield form 0.2250 < 0.2257 < 0.2280


Loading Zope ... Cleaning static files ... Instance at '/home/buildbot/slave/parts/bot_perf/full.PERF/build/unit_test' loaded ... done (14.698s)
Adding ERP5TypeTestCase user ... 
Adding erp5_portal_46b1242f30d521c53e744f4886ef0be0 ERP5 Site ... done (75.438s)
Running ZServer on port 55166
Adding erp5_base business template ... (imported in 13.877s) done (29.383s)
Adding erp5_ui_test business template ... (imported in 3.997s) done (10.254s)
Executing pending activities ... 286 267 done (22.073s)
Logout ... 
done (138.293s)
Ran Unit test of Performance
.F..
======================================================================
FAIL: test_01_viewBarModule (testPerformance.TestPerformance)
----------------------------------------------------------------------
Traceback (most recent call last):
  File "/home/buildbot/slave/parts/bot_perf/full.PERF/build/Products/ERP5Type/tests/backportUnittest.py", line 134, in run
    testMethod()
  File "/home/buildbot/slave/parts/bot_perf/full.PERF/build/Products/ERP5Type/tests/testPerformance.py", line 291, in test_01_viewBarModule
    'Tic: %.4f < %.4f < %.4f' % (
AssertionError: Tic: 0.0329 < 0.0393 < 0.0350

----------------------------------------------------------------------
Ran 4 tests in 526.659s

FAILED (failures=1)

objective time to view object form 0.1420 < 0.1429 < 0.1440

nb objects = 000100
	add = 0.0068 < 0.0070 < 0.0073
	tic = 0.0329 < 0.0390 < 0.0350
	view = 0.1470 < 0.1482 < 0.1500

nb objects = 000200
	add = 0.0068 < 0.0070 < 0.0073
	tic = 0.0329 < 0.0387 < 0.0350
	view = 0.1487 < 0.1502 < 0.1517

nb objects = 000300
	add = 0.0068 < 0.0070 < 0.0073
	tic = 0.0329 < 0.0384 < 0.0350
	view = 0.1504 < 0.1522 < 0.1534

nb objects = 000400
	add = 0.0068 < 0.0070 < 0.0073
	tic = 0.0329 < 0.0384 < 0.0350
	view = 0.1521 < 0.1541 < 0.1551

nb objects = 000500
	add = 0.0068 < 0.0070 < 0.0073
	tic = 0.0329 < 0.0388 < 0.0350
	view = 0.1538 < 0.1556 < 0.1568

nb objects = 000600
	add = 0.0068 < 0.0070 < 0.0073
	tic = 0.0329 < 0.0388 < 0.0350
	view = 0.1555 < 0.1579 < 0.1585

nb objects = 000700
	add = 0.0068 < 0.0070 < 0.0073
	tic = 0.0329 < 0.0383 < 0.0350
	view = 0.1571 < 0.1594 < 0.1601

nb objects = 000800
	add = 0.0068 < 0.0070 < 0.0073
	tic = 0.0329 < 0.0389 < 0.0350
	view = 0.1588 < 0.1610 < 0.1618

nb objects = 000900
	add = 0.0068 < 0.0070 < 0.0073
	tic = 0.0329 < 0.0386 < 0.0350
	view = 0.1605 < 0.1627 < 0.1635

nb objects = 001000
	add = 0.0068 < 0.0070 < 0.0073
	tic = 0.0329 < 0.0383 < 0.0350
	view = 0.1622 < 0.1644 < 0.1652

time to view object form with many lines 0.2880 < 0.2895 < 0.2920

time to view proxyfield form 0.2250 < 0.2258 < 0.2280


Loading Zope ... Cleaning static files ... Instance at '/home/buildbot/slave/parts/bot_perf/full.PERF/build/unit_test' loaded ... done (10.388s)
Adding ERP5TypeTestCase user ... 
Adding erp5_portal_46b1242f30d521c53e744f4886ef0be0 ERP5 Site ... done (74.254s)
Running ZServer on port 55166
Adding erp5_base business template ... (imported in 13.720s) done (29.132s)
Adding erp5_ui_test business template ... (imported in 4.065s) done (10.335s)
Executing pending activities ... 286 267 done (22.219s)
Logout ... 
done (137.057s)
Ran Unit test of Performance
.F..
======================================================================
FAIL: test_01_viewBarModule (testPerformance.TestPerformance)
----------------------------------------------------------------------
Traceback (most recent call last):
  File "/home/buildbot/slave/parts/bot_perf/full.PERF/build/Products/ERP5Type/tests/backportUnittest.py", line 134, in run
    testMethod()
  File "/home/buildbot/slave/parts/bot_perf/full.PERF/build/Products/ERP5Type/tests/testPerformance.py", line 291, in test_01_viewBarModule
    'Tic: %.4f < %.4f < %.4f' % (
AssertionError: Tic: 0.0329 < 0.0390 < 0.0350

----------------------------------------------------------------------
Ran 4 tests in 524.921s

FAILED (failures=1)
Exception in thread Thread-1 (most likely raised during interpreter shutdown):
Traceback (most recent call last):
  File "/usr/lib64/python2.4/threading.py", line 442, in __bootstrap
  File "/usr/lib64/python2.4/threading.py", line 422, in run
  File "/home/buildbot/slave/parts/bot_perf/full.PERF/build/unit_test/Products/ERP5Type/tests/ERP5TypeTestCase.py", line 737, in zserverRunner
exceptions.AttributeError: 'NoneType' object has no attribute 'error'


More information about the Erp5-report mailing list