[Erp5-report] PERF r29620: 12 Tests, 0 Errors, 9 Failures

nobody at svn.erp5.org nobody at svn.erp5.org
Wed Oct 14 07:45:26 CEST 2009


Test Suite: PERF
Revision: 29620
Result: FAIL

All tests: 12
Failures: 9
Errors: 0


The following tests failed:

  testPerformance                                    (3 failures)
   test_00_viewBarObject (testPerformance.TestPerformance), 
   test_01_viewBarModule (testPerformance.TestPerformance), 
   test_viewProxyField (testPerformance.TestPerformance)

  testPerformance                                    (3 failures)
   test_00_viewBarObject (testPerformance.TestPerformance), 
   test_01_viewBarModule (testPerformance.TestPerformance), 
   test_viewProxyField (testPerformance.TestPerformance)

  testPerformance                                    (3 failures)
   test_00_viewBarObject (testPerformance.TestPerformance), 
   test_01_viewBarModule (testPerformance.TestPerformance), 
   test_viewProxyField (testPerformance.TestPerformance)
-------------- next part --------------
SOFTWARE_HOME: /usr/lib/erp5/lib/python
INSTANCE_HOME: /home/buildbot/slave/parts/bot_perf/full.PERF/build/unit_test
Cleaning static files ... 
objective time to view object form 0.1320 < 0.1500 < 0.1380

nb objects = 000100
	add = 0.0090 < 0.0113 < 0.0110
	tic = 0.0345 < 0.0464 < 0.0395
	view = 0.1550 < 0.1587 < 0.1950

nb objects = 000200
	add = 0.0090 < 0.0113 < 0.0110
	tic = 0.0345 < 0.0468 < 0.0395
	view = 0.1797 < 0.1537 < 0.2197

nb objects = 000300
	add = 0.0090 < 0.0112 < 0.0110
	tic = 0.0345 < 0.0456 < 0.0395
	view = 0.2044 < 0.1558 < 0.2444

nb objects = 000400
	add = 0.0090 < 0.0112 < 0.0110
	tic = 0.0345 < 0.0456 < 0.0395
	view = 0.2292 < 0.1576 < 0.2692

nb objects = 000500
	add = 0.0090 < 0.0113 < 0.0110
	tic = 0.0345 < 0.0453 < 0.0395
	view = 0.2539 < 0.1592 < 0.2939

nb objects = 000600
	add = 0.0090 < 0.0112 < 0.0110
	tic = 0.0345 < 0.0454 < 0.0395
	view = 0.2786 < 0.1611 < 0.3186

nb objects = 000700
	add = 0.0090 < 0.0113 < 0.0110
	tic = 0.0345 < 0.0452 < 0.0395
	view = 0.3033 < 0.1627 < 0.3433

nb objects = 000800
	add = 0.0090 < 0.0113 < 0.0110
	tic = 0.0345 < 0.0450 < 0.0395
	view = 0.3280 < 0.1647 < 0.3680

nb objects = 000900
	add = 0.0090 < 0.0112 < 0.0110
	tic = 0.0345 < 0.0453 < 0.0395
	view = 0.3528 < 0.1660 < 0.3928

nb objects = 001000
	add = 0.0090 < 0.0112 < 0.0110
	tic = 0.0345 < 0.0453 < 0.0395
	view = 0.3775 < 0.1677 < 0.4175

time to view object form with many lines 0.3000 < 0.3119 < 0.3200

time to view proxyfield form 0.2150 < 0.2462 < 0.2350


Loading Zope, please stand by ... done (7.610s)

Adding ERP5TypeTestCase user ... 
Adding erp5_portal_46b1242f30d521c53e744f4886ef0be0 ERP5 Site ... done (77.028s)
Running ZServer on port 55430
Adding erp5_base business template ... (imported in 18.440s) done (36.214s)
Adding erp5_ui_test business template ... (imported in 5.806s) done (12.408s)
Executing pending activities ... 749 558 92 12 120 1 done (66.809s)
Logout ... 
done (194.555s)
Ran Unit test of Performance
FF.F
======================================================================
FAIL: test_00_viewBarObject (testPerformance.TestPerformance), 
----------------------------------------------------------------------
Traceback (most recent call last):
  File "/usr/lib/erp5/lib/python/Testing/ZopeTestCase/profiler.py", line 98, in __call__
    testMethod()
  File "/home/buildbot/slave/parts/bot_perf/full.PERF/build/Products/ERP5Type/tests/testPerformance.py", line 164, in test_00_viewBarObject
    prefix='objective')
  File "/home/buildbot/slave/parts/bot_perf/full.PERF/build/Products/ERP5Type/tests/testPerformance.py", line 142, in checkViewBarObject
    '%.4f < %.4f < %.4f' % (min, req_time, max))
AssertionError: 0.1320 < 0.1500 < 0.1380

======================================================================
FAIL: test_01_viewBarModule (testPerformance.TestPerformance), 
----------------------------------------------------------------------
Traceback (most recent call last):
  File "/usr/lib/erp5/lib/python/Testing/ZopeTestCase/profiler.py", line 98, in __call__
    testMethod()
  File "/home/buildbot/slave/parts/bot_perf/full.PERF/build/Products/ERP5Type/tests/testPerformance.py", line 245, in test_01_viewBarModule
    'Create: %.4f < %.4f < %.4f' % (
AssertionError: Create: 0.0090 < 0.0113 < 0.0110

======================================================================
FAIL: test_viewProxyField (testPerformance.TestPerformance)
----------------------------------------------------------------------
Traceback (most recent call last):
  File "/usr/lib/erp5/lib/python/Testing/ZopeTestCase/profiler.py", line 98, in __call__
    testMethod()
  File "/home/buildbot/slave/parts/bot_perf/full.PERF/build/Products/ERP5Type/tests/testPerformance.py", line 282, in test_viewProxyField
    '%.4f < %.4f < %.4f' % (
AssertionError: 0.2150 < 0.2462 < 0.2350

----------------------------------------------------------------------
Ran 4 tests in 605.847s

FAILED (failures=3)

SOFTWARE_HOME: /usr/lib/erp5/lib/python
INSTANCE_HOME: /home/buildbot/slave/parts/bot_perf/full.PERF/build/unit_test
Cleaning static files ... 
objective time to view object form 0.1320 < 0.1504 < 0.1380

nb objects = 000100
	add = 0.0090 < 0.0112 < 0.0110
	tic = 0.0345 < 0.0464 < 0.0395
	view = 0.1550 < 0.1582 < 0.1950

nb objects = 000200
	add = 0.0090 < 0.0112 < 0.0110
	tic = 0.0345 < 0.0463 < 0.0395
	view = 0.1797 < 0.1533 < 0.2197

nb objects = 000300
	add = 0.0090 < 0.0112 < 0.0110
	tic = 0.0345 < 0.0453 < 0.0395
	view = 0.2044 < 0.1557 < 0.2444

nb objects = 000400
	add = 0.0090 < 0.0111 < 0.0110
	tic = 0.0345 < 0.0454 < 0.0395
	view = 0.2292 < 0.1572 < 0.2692

nb objects = 000500
	add = 0.0090 < 0.0112 < 0.0110
	tic = 0.0345 < 0.0456 < 0.0395
	view = 0.2539 < 0.1590 < 0.2939

nb objects = 000600
	add = 0.0090 < 0.0112 < 0.0110
	tic = 0.0345 < 0.0453 < 0.0395
	view = 0.2786 < 0.1608 < 0.3186

nb objects = 000700
	add = 0.0090 < 0.0112 < 0.0110
	tic = 0.0345 < 0.0451 < 0.0395
	view = 0.3033 < 0.1626 < 0.3433

nb objects = 000800
	add = 0.0090 < 0.0112 < 0.0110
	tic = 0.0345 < 0.0452 < 0.0395
	view = 0.3280 < 0.1638 < 0.3680

nb objects = 000900
	add = 0.0090 < 0.0112 < 0.0110
	tic = 0.0345 < 0.0452 < 0.0395
	view = 0.3528 < 0.1655 < 0.3928

nb objects = 001000
	add = 0.0090 < 0.0112 < 0.0110
	tic = 0.0345 < 0.0453 < 0.0395
	view = 0.3775 < 0.1672 < 0.4175

time to view object form with many lines 0.3000 < 0.3115 < 0.3200

time to view proxyfield form 0.2150 < 0.2462 < 0.2350


Loading Zope, please stand by ... done (3.715s)

Adding ERP5TypeTestCase user ... 
Adding erp5_portal_46b1242f30d521c53e744f4886ef0be0 ERP5 Site ... done (73.103s)
Running ZServer on port 55152
Adding erp5_base business template ... (imported in 17.906s) done (35.635s)
Adding erp5_ui_test business template ... (imported in 4.325s) done (10.910s)
Executing pending activities ... 749 558 92 12 120 1 done (66.455s)
Logout ... 
done (188.063s)
Ran Unit test of Performance
FF.F
======================================================================
FAIL: test_00_viewBarObject (testPerformance.TestPerformance), 
----------------------------------------------------------------------
Traceback (most recent call last):
  File "/usr/lib/erp5/lib/python/Testing/ZopeTestCase/profiler.py", line 98, in __call__
    testMethod()
  File "/home/buildbot/slave/parts/bot_perf/full.PERF/build/Products/ERP5Type/tests/testPerformance.py", line 164, in test_00_viewBarObject
    prefix='objective')
  File "/home/buildbot/slave/parts/bot_perf/full.PERF/build/Products/ERP5Type/tests/testPerformance.py", line 142, in checkViewBarObject
    '%.4f < %.4f < %.4f' % (min, req_time, max))
AssertionError: 0.1320 < 0.1504 < 0.1380

======================================================================
FAIL: test_01_viewBarModule (testPerformance.TestPerformance), 
----------------------------------------------------------------------
Traceback (most recent call last):
  File "/usr/lib/erp5/lib/python/Testing/ZopeTestCase/profiler.py", line 98, in __call__
    testMethod()
  File "/home/buildbot/slave/parts/bot_perf/full.PERF/build/Products/ERP5Type/tests/testPerformance.py", line 245, in test_01_viewBarModule
    'Create: %.4f < %.4f < %.4f' % (
AssertionError: Create: 0.0090 < 0.0112 < 0.0110

======================================================================
FAIL: test_viewProxyField (testPerformance.TestPerformance)
----------------------------------------------------------------------
Traceback (most recent call last):
  File "/usr/lib/erp5/lib/python/Testing/ZopeTestCase/profiler.py", line 98, in __call__
    testMethod()
  File "/home/buildbot/slave/parts/bot_perf/full.PERF/build/Products/ERP5Type/tests/testPerformance.py", line 282, in test_viewProxyField
    '%.4f < %.4f < %.4f' % (
AssertionError: 0.2150 < 0.2462 < 0.2350

----------------------------------------------------------------------
Ran 4 tests in 599.387s

FAILED (failures=3)

SOFTWARE_HOME: /usr/lib/erp5/lib/python
INSTANCE_HOME: /home/buildbot/slave/parts/bot_perf/full.PERF/build/unit_test
Cleaning static files ... 
objective time to view object form 0.1320 < 0.1508 < 0.1380

nb objects = 000100
	add = 0.0090 < 0.0113 < 0.0110
	tic = 0.0345 < 0.0462 < 0.0395
	view = 0.1550 < 0.1589 < 0.1950

nb objects = 000200
	add = 0.0090 < 0.0113 < 0.0110
	tic = 0.0345 < 0.0466 < 0.0395
	view = 0.1797 < 0.1540 < 0.2197

nb objects = 000300
	add = 0.0090 < 0.0112 < 0.0110
	tic = 0.0345 < 0.0450 < 0.0395
	view = 0.2044 < 0.1560 < 0.2444

nb objects = 000400
	add = 0.0090 < 0.0113 < 0.0110
	tic = 0.0345 < 0.0455 < 0.0395
	view = 0.2292 < 0.1578 < 0.2692

nb objects = 000500
	add = 0.0090 < 0.0113 < 0.0110
	tic = 0.0345 < 0.0452 < 0.0395
	view = 0.2539 < 0.1594 < 0.2939

nb objects = 000600
	add = 0.0090 < 0.0112 < 0.0110
	tic = 0.0345 < 0.0454 < 0.0395
	view = 0.2786 < 0.1614 < 0.3186

nb objects = 000700
	add = 0.0090 < 0.0113 < 0.0110
	tic = 0.0345 < 0.0454 < 0.0395
	view = 0.3033 < 0.1631 < 0.3433

nb objects = 000800
	add = 0.0090 < 0.0113 < 0.0110
	tic = 0.0345 < 0.0449 < 0.0395
	view = 0.3280 < 0.1648 < 0.3680

nb objects = 000900
	add = 0.0090 < 0.0112 < 0.0110
	tic = 0.0345 < 0.0451 < 0.0395
	view = 0.3528 < 0.1666 < 0.3928

nb objects = 001000
	add = 0.0090 < 0.0112 < 0.0110
	tic = 0.0345 < 0.0456 < 0.0395
	view = 0.3775 < 0.1680 < 0.4175

time to view object form with many lines 0.3000 < 0.3132 < 0.3200

time to view proxyfield form 0.2150 < 0.2477 < 0.2350


Loading Zope, please stand by ... done (1.220s)

Adding ERP5TypeTestCase user ... 
Adding erp5_portal_46b1242f30d521c53e744f4886ef0be0 ERP5 Site ... done (67.845s)
Running ZServer on port 55457
Adding erp5_base business template ... (imported in 16.725s) done (34.461s)
Adding erp5_ui_test business template ... (imported in 3.856s) done (10.471s)
Executing pending activities ... 749 558 92 12 120 1 done (66.235s)
Logout ... 
done (180.927s)
Ran Unit test of Performance
FF.F
======================================================================
FAIL: test_00_viewBarObject (testPerformance.TestPerformance), 
----------------------------------------------------------------------
Traceback (most recent call last):
  File "/usr/lib/erp5/lib/python/Testing/ZopeTestCase/profiler.py", line 98, in __call__
    testMethod()
  File "/home/buildbot/slave/parts/bot_perf/full.PERF/build/Products/ERP5Type/tests/testPerformance.py", line 164, in test_00_viewBarObject
    prefix='objective')
  File "/home/buildbot/slave/parts/bot_perf/full.PERF/build/Products/ERP5Type/tests/testPerformance.py", line 142, in checkViewBarObject
    '%.4f < %.4f < %.4f' % (min, req_time, max))
AssertionError: 0.1320 < 0.1508 < 0.1380

======================================================================
FAIL: test_01_viewBarModule (testPerformance.TestPerformance), 
----------------------------------------------------------------------
Traceback (most recent call last):
  File "/usr/lib/erp5/lib/python/Testing/ZopeTestCase/profiler.py", line 98, in __call__
    testMethod()
  File "/home/buildbot/slave/parts/bot_perf/full.PERF/build/Products/ERP5Type/tests/testPerformance.py", line 245, in test_01_viewBarModule
    'Create: %.4f < %.4f < %.4f' % (
AssertionError: Create: 0.0090 < 0.0113 < 0.0110

======================================================================
FAIL: test_viewProxyField (testPerformance.TestPerformance)
----------------------------------------------------------------------
Traceback (most recent call last):
  File "/usr/lib/erp5/lib/python/Testing/ZopeTestCase/profiler.py", line 98, in __call__
    testMethod()
  File "/home/buildbot/slave/parts/bot_perf/full.PERF/build/Products/ERP5Type/tests/testPerformance.py", line 282, in test_viewProxyField
    '%.4f < %.4f < %.4f' % (
AssertionError: 0.2150 < 0.2477 < 0.2350

----------------------------------------------------------------------
Ran 4 tests in 592.741s

FAILED (failures=3)


More information about the Erp5-report mailing list