[Erp5-report] PERF r29599: 12 Tests, 0 Errors, 9 Failures

nobody at svn.erp5.org nobody at svn.erp5.org
Tue Oct 13 15:32:03 CEST 2009


Test Suite: PERF
Revision: 29599
Result: FAIL

All tests: 12
Failures: 9
Errors: 0


The following tests failed:

  testPerformance                                    (3 failures)
   test_00_viewBarObject (testPerformance.TestPerformance), 
   test_01_viewBarModule (testPerformance.TestPerformance), 
   test_viewProxyField (testPerformance.TestPerformance)

  testPerformance                                    (3 failures)
   test_00_viewBarObject (testPerformance.TestPerformance), 
   test_01_viewBarModule (testPerformance.TestPerformance), 
   test_viewProxyField (testPerformance.TestPerformance)

  testPerformance                                    (3 failures)
   test_00_viewBarObject (testPerformance.TestPerformance), 
   test_01_viewBarModule (testPerformance.TestPerformance), 
   test_viewProxyField (testPerformance.TestPerformance)
-------------- next part --------------
SOFTWARE_HOME: /usr/lib/erp5/lib/python
INSTANCE_HOME: /home/buildbot/slave/parts/bot_perf/full.PERF/build/unit_test
Cleaning static files ... 
objective time to view object form 0.1320 < 0.1511 < 0.1380

nb objects = 000100
	add = 0.0090 < 0.0112 < 0.0110
	tic = 0.0345 < 0.0467 < 0.0395
	view = 0.1550 < 0.1596 < 0.1950

nb objects = 000200
	add = 0.0090 < 0.0113 < 0.0110
	tic = 0.0345 < 0.0469 < 0.0395
	view = 0.1797 < 0.1542 < 0.2197

nb objects = 000300
	add = 0.0090 < 0.0112 < 0.0110
	tic = 0.0345 < 0.0450 < 0.0395
	view = 0.2044 < 0.1562 < 0.2444

nb objects = 000400
	add = 0.0090 < 0.0112 < 0.0110
	tic = 0.0345 < 0.0456 < 0.0395
	view = 0.2292 < 0.1580 < 0.2692

nb objects = 000500
	add = 0.0090 < 0.0114 < 0.0110
	tic = 0.0345 < 0.0452 < 0.0395
	view = 0.2539 < 0.1597 < 0.2939

nb objects = 000600
	add = 0.0090 < 0.0112 < 0.0110
	tic = 0.0345 < 0.0452 < 0.0395
	view = 0.2786 < 0.1617 < 0.3186

nb objects = 000700
	add = 0.0090 < 0.0112 < 0.0110
	tic = 0.0345 < 0.0456 < 0.0395
	view = 0.3033 < 0.1630 < 0.3433

nb objects = 000800
	add = 0.0090 < 0.0112 < 0.0110
	tic = 0.0345 < 0.0452 < 0.0395
	view = 0.3280 < 0.1649 < 0.3680

nb objects = 000900
	add = 0.0090 < 0.0112 < 0.0110
	tic = 0.0345 < 0.0453 < 0.0395
	view = 0.3528 < 0.1664 < 0.3928

nb objects = 001000
	add = 0.0090 < 0.0112 < 0.0110
	tic = 0.0345 < 0.0454 < 0.0395
	view = 0.3775 < 0.1679 < 0.4175

time to view object form with many lines 0.3000 < 0.3130 < 0.3200

time to view proxyfield form 0.2150 < 0.2479 < 0.2350


Loading Zope, please stand by ... done (4.281s)

Adding ERP5TypeTestCase user ... 
Adding erp5_portal_46b1242f30d521c53e744f4886ef0be0 ERP5 Site ... done (83.295s)
Running ZServer on port 55168
Adding erp5_base business template ... (imported in 18.062s) done (35.859s)
Adding erp5_ui_test business template ... (imported in 6.036s) done (12.662s)
Executing pending activities ... 749 558 92 12 120 1 done (67.239s)
Logout ... 
done (201.055s)
Ran Unit test of Performance
FF.F
======================================================================
FAIL: test_00_viewBarObject (testPerformance.TestPerformance), 
----------------------------------------------------------------------
Traceback (most recent call last):
  File "/usr/lib/erp5/lib/python/Testing/ZopeTestCase/profiler.py", line 98, in __call__
    testMethod()
  File "/home/buildbot/slave/parts/bot_perf/full.PERF/build/Products/ERP5Type/tests/testPerformance.py", line 164, in test_00_viewBarObject
    prefix='objective')
  File "/home/buildbot/slave/parts/bot_perf/full.PERF/build/Products/ERP5Type/tests/testPerformance.py", line 142, in checkViewBarObject
    '%.4f < %.4f < %.4f' % (min, req_time, max))
AssertionError: 0.1320 < 0.1511 < 0.1380

======================================================================
FAIL: test_01_viewBarModule (testPerformance.TestPerformance), 
----------------------------------------------------------------------
Traceback (most recent call last):
  File "/usr/lib/erp5/lib/python/Testing/ZopeTestCase/profiler.py", line 98, in __call__
    testMethod()
  File "/home/buildbot/slave/parts/bot_perf/full.PERF/build/Products/ERP5Type/tests/testPerformance.py", line 245, in test_01_viewBarModule
    'Create: %.4f < %.4f < %.4f' % (
AssertionError: Create: 0.0090 < 0.0112 < 0.0110

======================================================================
FAIL: test_viewProxyField (testPerformance.TestPerformance)
----------------------------------------------------------------------
Traceback (most recent call last):
  File "/usr/lib/erp5/lib/python/Testing/ZopeTestCase/profiler.py", line 98, in __call__
    testMethod()
  File "/home/buildbot/slave/parts/bot_perf/full.PERF/build/Products/ERP5Type/tests/testPerformance.py", line 282, in test_viewProxyField
    '%.4f < %.4f < %.4f' % (
AssertionError: 0.2150 < 0.2479 < 0.2350

----------------------------------------------------------------------
Ran 4 tests in 613.328s

FAILED (failures=3)

SOFTWARE_HOME: /usr/lib/erp5/lib/python
INSTANCE_HOME: /home/buildbot/slave/parts/bot_perf/full.PERF/build/unit_test
Cleaning static files ... 
objective time to view object form 0.1320 < 0.1513 < 0.1380

nb objects = 000100
	add = 0.0090 < 0.0113 < 0.0110
	tic = 0.0345 < 0.0460 < 0.0395
	view = 0.1550 < 0.1596 < 0.1950

nb objects = 000200
	add = 0.0090 < 0.0113 < 0.0110
	tic = 0.0345 < 0.0461 < 0.0395
	view = 0.1797 < 0.1543 < 0.2197

nb objects = 000300
	add = 0.0090 < 0.0112 < 0.0110
	tic = 0.0345 < 0.0454 < 0.0395
	view = 0.2044 < 0.1565 < 0.2444

nb objects = 000400
	add = 0.0090 < 0.0113 < 0.0110
	tic = 0.0345 < 0.0452 < 0.0395
	view = 0.2292 < 0.1581 < 0.2692

nb objects = 000500
	add = 0.0090 < 0.0113 < 0.0110
	tic = 0.0345 < 0.0455 < 0.0395
	view = 0.2539 < 0.1594 < 0.2939

nb objects = 000600
	add = 0.0090 < 0.0112 < 0.0110
	tic = 0.0345 < 0.0454 < 0.0395
	view = 0.2786 < 0.1613 < 0.3186

nb objects = 000700
	add = 0.0090 < 0.0112 < 0.0110
	tic = 0.0345 < 0.0457 < 0.0395
	view = 0.3033 < 0.1628 < 0.3433

nb objects = 000800
	add = 0.0090 < 0.0114 < 0.0110
	tic = 0.0345 < 0.0452 < 0.0395
	view = 0.3280 < 0.1647 < 0.3680

nb objects = 000900
	add = 0.0090 < 0.0112 < 0.0110
	tic = 0.0345 < 0.0455 < 0.0395
	view = 0.3528 < 0.1661 < 0.3928

nb objects = 001000
	add = 0.0090 < 0.0113 < 0.0110
	tic = 0.0345 < 0.0452 < 0.0395
	view = 0.3775 < 0.1677 < 0.4175

time to view object form with many lines 0.3000 < 0.3146 < 0.3200

time to view proxyfield form 0.2150 < 0.2481 < 0.2350


Loading Zope, please stand by ... done (4.063s)

Adding ERP5TypeTestCase user ... 
Adding erp5_portal_46b1242f30d521c53e744f4886ef0be0 ERP5 Site ... done (72.594s)
Running ZServer on port 55217
Adding erp5_base business template ... (imported in 17.685s) done (35.613s)
Adding erp5_ui_test business template ... (imported in 4.452s) done (11.099s)
Executing pending activities ... 749 558 92 12 120 1 done (66.562s)
Logout ... 
done (187.715s)
Ran Unit test of Performance
FF.F
======================================================================
FAIL: test_00_viewBarObject (testPerformance.TestPerformance), 
----------------------------------------------------------------------
Traceback (most recent call last):
  File "/usr/lib/erp5/lib/python/Testing/ZopeTestCase/profiler.py", line 98, in __call__
    testMethod()
  File "/home/buildbot/slave/parts/bot_perf/full.PERF/build/Products/ERP5Type/tests/testPerformance.py", line 164, in test_00_viewBarObject
    prefix='objective')
  File "/home/buildbot/slave/parts/bot_perf/full.PERF/build/Products/ERP5Type/tests/testPerformance.py", line 142, in checkViewBarObject
    '%.4f < %.4f < %.4f' % (min, req_time, max))
AssertionError: 0.1320 < 0.1513 < 0.1380

======================================================================
FAIL: test_01_viewBarModule (testPerformance.TestPerformance), 
----------------------------------------------------------------------
Traceback (most recent call last):
  File "/usr/lib/erp5/lib/python/Testing/ZopeTestCase/profiler.py", line 98, in __call__
    testMethod()
  File "/home/buildbot/slave/parts/bot_perf/full.PERF/build/Products/ERP5Type/tests/testPerformance.py", line 245, in test_01_viewBarModule
    'Create: %.4f < %.4f < %.4f' % (
AssertionError: Create: 0.0090 < 0.0113 < 0.0110

======================================================================
FAIL: test_viewProxyField (testPerformance.TestPerformance)
----------------------------------------------------------------------
Traceback (most recent call last):
  File "/usr/lib/erp5/lib/python/Testing/ZopeTestCase/profiler.py", line 98, in __call__
    testMethod()
  File "/home/buildbot/slave/parts/bot_perf/full.PERF/build/Products/ERP5Type/tests/testPerformance.py", line 282, in test_viewProxyField
    '%.4f < %.4f < %.4f' % (
AssertionError: 0.2150 < 0.2481 < 0.2350

----------------------------------------------------------------------
Ran 4 tests in 600.523s

FAILED (failures=3)

SOFTWARE_HOME: /usr/lib/erp5/lib/python
INSTANCE_HOME: /home/buildbot/slave/parts/bot_perf/full.PERF/build/unit_test
Cleaning static files ... 
objective time to view object form 0.1320 < 0.1507 < 0.1380

nb objects = 000100
	add = 0.0090 < 0.0112 < 0.0110
	tic = 0.0345 < 0.0465 < 0.0395
	view = 0.1550 < 0.1591 < 0.1950

nb objects = 000200
	add = 0.0090 < 0.0113 < 0.0110
	tic = 0.0345 < 0.0465 < 0.0395
	view = 0.1797 < 0.1541 < 0.2197

nb objects = 000300
	add = 0.0090 < 0.0112 < 0.0110
	tic = 0.0345 < 0.0453 < 0.0395
	view = 0.2044 < 0.1562 < 0.2444

nb objects = 000400
	add = 0.0090 < 0.0112 < 0.0110
	tic = 0.0345 < 0.0458 < 0.0395
	view = 0.2292 < 0.1578 < 0.2692

nb objects = 000500
	add = 0.0090 < 0.0112 < 0.0110
	tic = 0.0345 < 0.0451 < 0.0395
	view = 0.2539 < 0.1595 < 0.2939

nb objects = 000600
	add = 0.0090 < 0.0112 < 0.0110
	tic = 0.0345 < 0.0453 < 0.0395
	view = 0.2786 < 0.1615 < 0.3186

nb objects = 000700
	add = 0.0090 < 0.0112 < 0.0110
	tic = 0.0345 < 0.0455 < 0.0395
	view = 0.3033 < 0.1632 < 0.3433

nb objects = 000800
	add = 0.0090 < 0.0112 < 0.0110
	tic = 0.0345 < 0.0452 < 0.0395
	view = 0.3280 < 0.1650 < 0.3680

nb objects = 000900
	add = 0.0090 < 0.0112 < 0.0110
	tic = 0.0345 < 0.0454 < 0.0395
	view = 0.3528 < 0.1665 < 0.3928

nb objects = 001000
	add = 0.0090 < 0.0112 < 0.0110
	tic = 0.0345 < 0.0453 < 0.0395
	view = 0.3775 < 0.1683 < 0.4175

time to view object form with many lines 0.3000 < 0.3130 < 0.3200

time to view proxyfield form 0.2150 < 0.2473 < 0.2350


Loading Zope, please stand by ... done (1.080s)

Adding ERP5TypeTestCase user ... 
Adding erp5_portal_46b1242f30d521c53e744f4886ef0be0 ERP5 Site ... done (68.748s)
Running ZServer on port 55025
Adding erp5_base business template ... (imported in 16.208s) done (33.965s)
Adding erp5_ui_test business template ... (imported in 3.876s) done (10.471s)
Executing pending activities ... 749 558 92 12 120 1 done (66.244s)
Logout ... 
done (181.314s)
Ran Unit test of Performance
FF.F
======================================================================
FAIL: test_00_viewBarObject (testPerformance.TestPerformance), 
----------------------------------------------------------------------
Traceback (most recent call last):
  File "/usr/lib/erp5/lib/python/Testing/ZopeTestCase/profiler.py", line 98, in __call__
    testMethod()
  File "/home/buildbot/slave/parts/bot_perf/full.PERF/build/Products/ERP5Type/tests/testPerformance.py", line 164, in test_00_viewBarObject
    prefix='objective')
  File "/home/buildbot/slave/parts/bot_perf/full.PERF/build/Products/ERP5Type/tests/testPerformance.py", line 142, in checkViewBarObject
    '%.4f < %.4f < %.4f' % (min, req_time, max))
AssertionError: 0.1320 < 0.1507 < 0.1380

======================================================================
FAIL: test_01_viewBarModule (testPerformance.TestPerformance), 
----------------------------------------------------------------------
Traceback (most recent call last):
  File "/usr/lib/erp5/lib/python/Testing/ZopeTestCase/profiler.py", line 98, in __call__
    testMethod()
  File "/home/buildbot/slave/parts/bot_perf/full.PERF/build/Products/ERP5Type/tests/testPerformance.py", line 245, in test_01_viewBarModule
    'Create: %.4f < %.4f < %.4f' % (
AssertionError: Create: 0.0090 < 0.0112 < 0.0110

======================================================================
FAIL: test_viewProxyField (testPerformance.TestPerformance)
----------------------------------------------------------------------
Traceback (most recent call last):
  File "/usr/lib/erp5/lib/python/Testing/ZopeTestCase/profiler.py", line 98, in __call__
    testMethod()
  File "/home/buildbot/slave/parts/bot_perf/full.PERF/build/Products/ERP5Type/tests/testPerformance.py", line 282, in test_viewProxyField
    '%.4f < %.4f < %.4f' % (
AssertionError: 0.2150 < 0.2473 < 0.2350

----------------------------------------------------------------------
Ran 4 tests in 593.497s

FAILED (failures=3)


More information about the Erp5-report mailing list