[Erp5-report] PERF r29033: 12 Tests, 0 Errors, 9 Failures

nobody at svn.erp5.org nobody at svn.erp5.org
Mon Sep 14 17:03:14 CEST 2009


Test Suite: PERF
Revision: 29033
Result: FAIL

All tests: 12
Failures: 9
Errors: 0


The following tests failed:

  testPerformance                                    (3 failures)
   test_00_viewBarObject (testPerformance.TestPerformance)
   test_01_viewBarModule (testPerformance.TestPerformance)
   test_02_viewFooObjectWithManyLines (testPerformance.TestPerformance)

  testPerformance                                    (3 failures)
   test_00_viewBarObject (testPerformance.TestPerformance)
   test_01_viewBarModule (testPerformance.TestPerformance)
   test_02_viewFooObjectWithManyLines (testPerformance.TestPerformance)

  testPerformance                                    (3 failures)
   test_00_viewBarObject (testPerformance.TestPerformance)
   test_01_viewBarModule (testPerformance.TestPerformance)
   test_02_viewFooObjectWithManyLines (testPerformance.TestPerformance)
-------------- next part --------------
SOFTWARE_HOME: /usr/lib/erp5/lib/python
INSTANCE_HOME: /home/buildbot/slave/parts/bot_perf/full.PERF/build/unit_test
Cleaning static files ... 
objective time to view object form 0.1320 < 0.1413 < 0.1380

nb objects = 000100
	add = 0.0090 < 0.0091 < 0.0110
	tic = 0.0345 < 0.0462 < 0.0395
	view = 0.1550 < 0.1533 < 0.1950

nb objects = 000200
	add = 0.0090 < 0.0091 < 0.0110
	tic = 0.0345 < 0.0466 < 0.0395
	view = 0.1797 < 0.1493 < 0.2197

nb objects = 000300
	add = 0.0090 < 0.0090 < 0.0110
	tic = 0.0345 < 0.0454 < 0.0395
	view = 0.2044 < 0.1511 < 0.2444

nb objects = 000400
	add = 0.0090 < 0.0091 < 0.0110
	tic = 0.0345 < 0.0457 < 0.0395
	view = 0.2292 < 0.1530 < 0.2692

nb objects = 000500
	add = 0.0090 < 0.0091 < 0.0110
	tic = 0.0345 < 0.0452 < 0.0395
	view = 0.2539 < 0.1551 < 0.2939

nb objects = 000600
	add = 0.0090 < 0.0090 < 0.0110
	tic = 0.0345 < 0.0451 < 0.0395
	view = 0.2786 < 0.1571 < 0.3186

nb objects = 000700
	add = 0.0090 < 0.0091 < 0.0110
	tic = 0.0345 < 0.0457 < 0.0395
	view = 0.3033 < 0.1589 < 0.3433

nb objects = 000800
	add = 0.0090 < 0.0090 < 0.0110
	tic = 0.0345 < 0.0455 < 0.0395
	view = 0.3280 < 0.1603 < 0.3680

nb objects = 000900
	add = 0.0090 < 0.0090 < 0.0110
	tic = 0.0345 < 0.0452 < 0.0395
	view = 0.3528 < 0.1621 < 0.3928

nb objects = 001000
	add = 0.0090 < 0.0090 < 0.0110
	tic = 0.0345 < 0.0454 < 0.0395
	view = 0.3775 < 0.1639 < 0.4175

time to view object form with many lines 0.3000 < 0.2910 < 0.3200

time to view proxyfield form 0.2150 < 0.2257 < 0.2350


Loading Zope, please stand by ... done (1.678s)

Adding ERP5TypeTestCase user ... 
Adding erp5_portal_46b1242f30d521c53e744f4886ef0be0 ERP5 Site ... done (77.307s)
Running ZServer on port 55172
Adding erp5_base business template ... (imported in 18.796s) done (32.354s)
Adding erp5_ui_test business template ... (imported in 6.211s) done (11.718s)
Executing pending activities ... 345 330 90 11 22 1 done (30.210s)
Logout ... 
done (152.711s)
Ran Unit test of Performance
FFF.
======================================================================
FAIL: test_00_viewBarObject (testPerformance.TestPerformance)
----------------------------------------------------------------------
Traceback (most recent call last):
  File "/usr/lib/erp5/lib/python/Testing/ZopeTestCase/profiler.py", line 98, in __call__
    testMethod()
  File "/home/buildbot/slave/parts/bot_perf/full.PERF/build/Products/ERP5Type/tests/testPerformance.py", line 164, in test_00_viewBarObject
    prefix='objective')
  File "/home/buildbot/slave/parts/bot_perf/full.PERF/build/Products/ERP5Type/tests/testPerformance.py", line 142, in checkViewBarObject
    '%.4f < %.4f < %.4f' % (min, req_time, max))
AssertionError: 0.1320 < 0.1413 < 0.1380

======================================================================
FAIL: test_01_viewBarModule (testPerformance.TestPerformance)
----------------------------------------------------------------------
Traceback (most recent call last):
  File "/usr/lib/erp5/lib/python/Testing/ZopeTestCase/profiler.py", line 98, in __call__
    testMethod()
  File "/home/buildbot/slave/parts/bot_perf/full.PERF/build/Products/ERP5Type/tests/testPerformance.py", line 241, in test_01_viewBarModule
    'View: %.4f < %.4f < %.4f' % (
AssertionError: View: 0.1550 < 0.1533 < 0.1950

======================================================================
FAIL: test_02_viewFooObjectWithManyLines (testPerformance.TestPerformance)
----------------------------------------------------------------------
Traceback (most recent call last):
  File "/usr/lib/erp5/lib/python/Testing/ZopeTestCase/profiler.py", line 98, in __call__
    testMethod()
  File "/home/buildbot/slave/parts/bot_perf/full.PERF/build/Products/ERP5Type/tests/testPerformance.py", line 315, in test_02_viewFooObjectWithManyLines
    '%.4f < %.4f < %.4f' % (
AssertionError: 0.3000 < 0.2910 < 0.3200

----------------------------------------------------------------------
Ran 4 tests in 552.111s

FAILED (failures=3)

SOFTWARE_HOME: /usr/lib/erp5/lib/python
INSTANCE_HOME: /home/buildbot/slave/parts/bot_perf/full.PERF/build/unit_test
Cleaning static files ... 
objective time to view object form 0.1320 < 0.1412 < 0.1380

nb objects = 000100
	add = 0.0090 < 0.0091 < 0.0110
	tic = 0.0345 < 0.0457 < 0.0395
	view = 0.1550 < 0.1539 < 0.1950

nb objects = 000200
	add = 0.0090 < 0.0091 < 0.0110
	tic = 0.0345 < 0.0462 < 0.0395
	view = 0.1797 < 0.1496 < 0.2197

nb objects = 000300
	add = 0.0090 < 0.0090 < 0.0110
	tic = 0.0345 < 0.0452 < 0.0395
	view = 0.2044 < 0.1517 < 0.2444

nb objects = 000400
	add = 0.0090 < 0.0090 < 0.0110
	tic = 0.0345 < 0.0454 < 0.0395
	view = 0.2292 < 0.1534 < 0.2692

nb objects = 000500
	add = 0.0090 < 0.0091 < 0.0110
	tic = 0.0345 < 0.0450 < 0.0395
	view = 0.2539 < 0.1551 < 0.2939

nb objects = 000600
	add = 0.0090 < 0.0090 < 0.0110
	tic = 0.0345 < 0.0453 < 0.0395
	view = 0.2786 < 0.1570 < 0.3186

nb objects = 000700
	add = 0.0090 < 0.0090 < 0.0110
	tic = 0.0345 < 0.0454 < 0.0395
	view = 0.3033 < 0.1588 < 0.3433

nb objects = 000800
	add = 0.0090 < 0.0091 < 0.0110
	tic = 0.0345 < 0.0453 < 0.0395
	view = 0.3280 < 0.1603 < 0.3680

nb objects = 000900
	add = 0.0090 < 0.0090 < 0.0110
	tic = 0.0345 < 0.0453 < 0.0395
	view = 0.3528 < 0.1620 < 0.3928

nb objects = 001000
	add = 0.0090 < 0.0090 < 0.0110
	tic = 0.0345 < 0.0453 < 0.0395
	view = 0.3775 < 0.1636 < 0.4175

time to view object form with many lines 0.3000 < 0.2916 < 0.3200

time to view proxyfield form 0.2150 < 0.2267 < 0.2350


Loading Zope, please stand by ... done (4.031s)

Adding ERP5TypeTestCase user ... 
Adding erp5_portal_46b1242f30d521c53e744f4886ef0be0 ERP5 Site ... done (67.594s)
Running ZServer on port 55028
Adding erp5_base business template ... (imported in 13.361s) done (26.798s)
Adding erp5_ui_test business template ... (imported in 4.111s) done (9.763s)
Executing pending activities ... 345 330 90 11 22 1 done (30.502s)
Logout ... 
done (135.687s)
Ran Unit test of Performance
FFF.
======================================================================
FAIL: test_00_viewBarObject (testPerformance.TestPerformance)
----------------------------------------------------------------------
Traceback (most recent call last):
  File "/usr/lib/erp5/lib/python/Testing/ZopeTestCase/profiler.py", line 98, in __call__
    testMethod()
  File "/home/buildbot/slave/parts/bot_perf/full.PERF/build/Products/ERP5Type/tests/testPerformance.py", line 164, in test_00_viewBarObject
    prefix='objective')
  File "/home/buildbot/slave/parts/bot_perf/full.PERF/build/Products/ERP5Type/tests/testPerformance.py", line 142, in checkViewBarObject
    '%.4f < %.4f < %.4f' % (min, req_time, max))
AssertionError: 0.1320 < 0.1412 < 0.1380

======================================================================
FAIL: test_01_viewBarModule (testPerformance.TestPerformance)
----------------------------------------------------------------------
Traceback (most recent call last):
  File "/usr/lib/erp5/lib/python/Testing/ZopeTestCase/profiler.py", line 98, in __call__
    testMethod()
  File "/home/buildbot/slave/parts/bot_perf/full.PERF/build/Products/ERP5Type/tests/testPerformance.py", line 241, in test_01_viewBarModule
    'View: %.4f < %.4f < %.4f' % (
AssertionError: View: 0.1550 < 0.1539 < 0.1950

======================================================================
FAIL: test_02_viewFooObjectWithManyLines (testPerformance.TestPerformance)
----------------------------------------------------------------------
Traceback (most recent call last):
  File "/usr/lib/erp5/lib/python/Testing/ZopeTestCase/profiler.py", line 98, in __call__
    testMethod()
  File "/home/buildbot/slave/parts/bot_perf/full.PERF/build/Products/ERP5Type/tests/testPerformance.py", line 315, in test_02_viewFooObjectWithManyLines
    '%.4f < %.4f < %.4f' % (
AssertionError: 0.3000 < 0.2916 < 0.3200

----------------------------------------------------------------------
Ran 4 tests in 535.276s

FAILED (failures=3)

SOFTWARE_HOME: /usr/lib/erp5/lib/python
INSTANCE_HOME: /home/buildbot/slave/parts/bot_perf/full.PERF/build/unit_test
Cleaning static files ... 
objective time to view object form 0.1320 < 0.1410 < 0.1380

nb objects = 000100
	add = 0.0090 < 0.0091 < 0.0110
	tic = 0.0345 < 0.0462 < 0.0395
	view = 0.1550 < 0.1532 < 0.1950

nb objects = 000200
	add = 0.0090 < 0.0092 < 0.0110
	tic = 0.0345 < 0.0466 < 0.0395
	view = 0.1797 < 0.1493 < 0.2197

nb objects = 000300
	add = 0.0090 < 0.0091 < 0.0110
	tic = 0.0345 < 0.0455 < 0.0395
	view = 0.2044 < 0.1513 < 0.2444

nb objects = 000400
	add = 0.0090 < 0.0091 < 0.0110
	tic = 0.0345 < 0.0456 < 0.0395
	view = 0.2292 < 0.1530 < 0.2692

nb objects = 000500
	add = 0.0090 < 0.0091 < 0.0110
	tic = 0.0345 < 0.0449 < 0.0395
	view = 0.2539 < 0.1547 < 0.2939

nb objects = 000600
	add = 0.0090 < 0.0091 < 0.0110
	tic = 0.0345 < 0.0456 < 0.0395
	view = 0.2786 < 0.1567 < 0.3186

nb objects = 000700
	add = 0.0090 < 0.0091 < 0.0110
	tic = 0.0345 < 0.0453 < 0.0395
	view = 0.3033 < 0.1585 < 0.3433

nb objects = 000800
	add = 0.0090 < 0.0091 < 0.0110
	tic = 0.0345 < 0.0452 < 0.0395
	view = 0.3280 < 0.1601 < 0.3680

nb objects = 000900
	add = 0.0090 < 0.0091 < 0.0110
	tic = 0.0345 < 0.0458 < 0.0395
	view = 0.3528 < 0.1618 < 0.3928

nb objects = 001000
	add = 0.0090 < 0.0090 < 0.0110
	tic = 0.0345 < 0.0456 < 0.0395
	view = 0.3775 < 0.1636 < 0.4175

time to view object form with many lines 0.3000 < 0.2907 < 0.3200

time to view proxyfield form 0.2150 < 0.2258 < 0.2350


Loading Zope, please stand by ... done (1.179s)

Adding ERP5TypeTestCase user ... 
Adding erp5_portal_46b1242f30d521c53e744f4886ef0be0 ERP5 Site ... done (61.048s)
Running ZServer on port 55114
Adding erp5_base business template ... (imported in 13.281s) done (26.776s)
Adding erp5_ui_test business template ... (imported in 4.117s) done (9.647s)
Executing pending activities ... 345 330 90 11 22 1 done (30.670s)
Logout ... 
done (129.160s)
Ran Unit test of Performance
FFF.
======================================================================
FAIL: test_00_viewBarObject (testPerformance.TestPerformance)
----------------------------------------------------------------------
Traceback (most recent call last):
  File "/usr/lib/erp5/lib/python/Testing/ZopeTestCase/profiler.py", line 98, in __call__
    testMethod()
  File "/home/buildbot/slave/parts/bot_perf/full.PERF/build/Products/ERP5Type/tests/testPerformance.py", line 164, in test_00_viewBarObject
    prefix='objective')
  File "/home/buildbot/slave/parts/bot_perf/full.PERF/build/Products/ERP5Type/tests/testPerformance.py", line 142, in checkViewBarObject
    '%.4f < %.4f < %.4f' % (min, req_time, max))
AssertionError: 0.1320 < 0.1410 < 0.1380

======================================================================
FAIL: test_01_viewBarModule (testPerformance.TestPerformance)
----------------------------------------------------------------------
Traceback (most recent call last):
  File "/usr/lib/erp5/lib/python/Testing/ZopeTestCase/profiler.py", line 98, in __call__
    testMethod()
  File "/home/buildbot/slave/parts/bot_perf/full.PERF/build/Products/ERP5Type/tests/testPerformance.py", line 241, in test_01_viewBarModule
    'View: %.4f < %.4f < %.4f' % (
AssertionError: View: 0.1550 < 0.1532 < 0.1950

======================================================================
FAIL: test_02_viewFooObjectWithManyLines (testPerformance.TestPerformance)
----------------------------------------------------------------------
Traceback (most recent call last):
  File "/usr/lib/erp5/lib/python/Testing/ZopeTestCase/profiler.py", line 98, in __call__
    testMethod()
  File "/home/buildbot/slave/parts/bot_perf/full.PERF/build/Products/ERP5Type/tests/testPerformance.py", line 315, in test_02_viewFooObjectWithManyLines
    '%.4f < %.4f < %.4f' % (
AssertionError: 0.3000 < 0.2907 < 0.3200

----------------------------------------------------------------------
Ran 4 tests in 527.984s

FAILED (failures=3)


More information about the Erp5-report mailing list