[Erp5-report] PERF r27846: 12 Tests, 0 Errors, 9 Failures

nobody at svn.erp5.org nobody at svn.erp5.org
Wed Jul 1 14:29:59 CEST 2009


Test Suite: PERF
Revision: 27846
Result: FAIL

All tests: 12
Failures: 9
Errors: 0


The following tests failed:

  testPerformance                                    (3 failures)
   test_00_viewBarObject (testPerformance.TestPerformance)
   test_01_viewBarModule (testPerformance.TestPerformance)
   test_02_viewFooObjectWithManyLines (testPerformance.TestPerformance)

  testPerformance                                    (3 failures)
   test_00_viewBarObject (testPerformance.TestPerformance)
   test_01_viewBarModule (testPerformance.TestPerformance)
   test_02_viewFooObjectWithManyLines (testPerformance.TestPerformance)

  testPerformance                                    (3 failures)
   test_00_viewBarObject (testPerformance.TestPerformance)
   test_01_viewBarModule (testPerformance.TestPerformance)
   test_02_viewFooObjectWithManyLines (testPerformance.TestPerformance)
-------------- next part --------------
SOFTWARE_HOME: /usr/lib/erp5/lib/python
INSTANCE_HOME: /home/buildbot/slave/parts/bot_perf/full.PERF/build/unit_test
objective time to view object form 0.1320 < 0.1399 < 0.1380

nb objects = 000100
	add = 0.0090 < 0.0096 < 0.0110
	tic = 0.0345 < 0.0463 < 0.0395
	view = 0.1550 < 0.1535 < 0.1950

nb objects = 000200
	add = 0.0090 < 0.0096 < 0.0110
	tic = 0.0345 < 0.0470 < 0.0395
	view = 0.1797 < 0.1498 < 0.2197

nb objects = 000300
	add = 0.0090 < 0.0096 < 0.0110
	tic = 0.0345 < 0.0456 < 0.0395
	view = 0.2044 < 0.1519 < 0.2444

nb objects = 000400
	add = 0.0090 < 0.0096 < 0.0110
	tic = 0.0345 < 0.0458 < 0.0395
	view = 0.2292 < 0.1538 < 0.2692

nb objects = 000500
	add = 0.0090 < 0.0097 < 0.0110
	tic = 0.0345 < 0.0458 < 0.0395
	view = 0.2539 < 0.1554 < 0.2939

nb objects = 000600
	add = 0.0090 < 0.0095 < 0.0110
	tic = 0.0345 < 0.0458 < 0.0395
	view = 0.2786 < 0.1575 < 0.3186

nb objects = 000700
	add = 0.0090 < 0.0096 < 0.0110
	tic = 0.0345 < 0.0456 < 0.0395
	view = 0.3033 < 0.1591 < 0.3433

nb objects = 000800
	add = 0.0090 < 0.0096 < 0.0110
	tic = 0.0345 < 0.0456 < 0.0395
	view = 0.3280 < 0.1606 < 0.3680

nb objects = 000900
	add = 0.0090 < 0.0096 < 0.0110
	tic = 0.0345 < 0.0459 < 0.0395
	view = 0.3528 < 0.1622 < 0.3928

nb objects = 001000
	add = 0.0090 < 0.0096 < 0.0110
	tic = 0.0345 < 0.0458 < 0.0395
	view = 0.3775 < 0.1637 < 0.4175

time to view object form with many lines 0.3000 < 0.2919 < 0.3200

time to view proxyfield form 0.2150 < 0.2257 < 0.2350


Loading Zope, please stand by ... done (3.414s)
/usr/lib/erp5/lib/python/Products/ZMailIn/__init__.py:25: DeprecationWarning: This will be removed in ZODB 3.6:
   use transaction.get() instead of get_transaction().
   transaction.commit() is a shortcut spelling of transaction.get().commit(),
   and transaction.abort() of transaction.get().abort().
  get_transaction().note('Added GlobalZMailInCatalog')
/usr/lib/erp5/lib/python/Products/ZMailIn/__init__.py:26: DeprecationWarning: This will be removed in ZODB 3.6:
   use transaction.get() instead of get_transaction().
   transaction.commit() is a shortcut spelling of transaction.get().commit(),
   and transaction.abort() of transaction.get().abort().
  get_transaction().commit()
/usr/lib/erp5/lib/python/Products/CMFMailIn/__init__.py:38: DeprecationWarning: The product_name parameter of ToolInit is deprecated and will be ignored in CMF1.6: CMFMailIn
  product_name='CMFMailIn', icon='tool.gif',
/home/buildbot/slave/parts/bot_perf/full.PERF/build/unit_test/Products/CMFActivity/ActivityTool.py:36: DeprecationWarning: The module, 'Products.CMFCore.CMFCorePermissions' is a deprecated compatiblity alias for 'Products.CMFCore.permissions';  please use the new module instead.
  from Products.CMFCore import CMFCorePermissions

Adding ERP5TypeTestCase user ... 
Adding erp5_portal_46b1242f30d521c53e744f4886ef0be0 ERP5 Site ... /usr/lib/erp5/lib/python/Products/PluginRegistry/PluginRegistry.py:111: DeprecationWarning: isImplementedBy has been renamed to providedBy
  if not plugin_type.isImplementedBy(plugin):
/home/buildbot/slave/parts/bot_perf/full.PERF/build/unit_test/Products/ERP5Type/Base.py:288: DeprecationWarning: Global function clearCache() is deprecated. Use portal_caches.clearCache() instead.
  clearCache()
done (78.178s)
Adding erp5_base business template ... (imported in 20.711s) done (32.958s)
Adding erp5_ui_test business template ... (imported in 7.122s) done (12.385s)
Executing pending activities ... 331 316 86 11 21 1 done (29.883s)
Logout ... 
done (154.468s)
Ran Unit test of Performance
FFF.
======================================================================
FAIL: test_00_viewBarObject (testPerformance.TestPerformance)
----------------------------------------------------------------------
Traceback (most recent call last):
  File "/usr/lib/erp5/lib/python/Testing/ZopeTestCase/profiler.py", line 98, in __call__
    testMethod()
  File "/home/buildbot/slave/parts/bot_perf/full.PERF/build/Products/ERP5Type/tests/testPerformance.py", line 164, in test_00_viewBarObject
    prefix='objective')
  File "/home/buildbot/slave/parts/bot_perf/full.PERF/build/Products/ERP5Type/tests/testPerformance.py", line 142, in checkViewBarObject
    '%.4f < %.4f < %.4f' % (min, req_time, max))
AssertionError: 0.1320 < 0.1399 < 0.1380

======================================================================
FAIL: test_01_viewBarModule (testPerformance.TestPerformance)
----------------------------------------------------------------------
Traceback (most recent call last):
  File "/usr/lib/erp5/lib/python/Testing/ZopeTestCase/profiler.py", line 98, in __call__
    testMethod()
  File "/home/buildbot/slave/parts/bot_perf/full.PERF/build/Products/ERP5Type/tests/testPerformance.py", line 241, in test_01_viewBarModule
    'View: %.4f < %.4f < %.4f' % (
AssertionError: View: 0.1550 < 0.1535 < 0.1950

======================================================================
FAIL: test_02_viewFooObjectWithManyLines (testPerformance.TestPerformance)
----------------------------------------------------------------------
Traceback (most recent call last):
  File "/usr/lib/erp5/lib/python/Testing/ZopeTestCase/profiler.py", line 98, in __call__
    testMethod()
  File "/home/buildbot/slave/parts/bot_perf/full.PERF/build/Products/ERP5Type/tests/testPerformance.py", line 315, in test_02_viewFooObjectWithManyLines
    '%.4f < %.4f < %.4f' % (
AssertionError: 0.3000 < 0.2919 < 0.3200

----------------------------------------------------------------------
Ran 4 tests in 555.588s

FAILED (failures=3)

SOFTWARE_HOME: /usr/lib/erp5/lib/python
INSTANCE_HOME: /home/buildbot/slave/parts/bot_perf/full.PERF/build/unit_test
objective time to view object form 0.1320 < 0.1406 < 0.1380

nb objects = 000100
	add = 0.0090 < 0.0096 < 0.0110
	tic = 0.0345 < 0.0464 < 0.0395
	view = 0.1550 < 0.1537 < 0.1950

nb objects = 000200
	add = 0.0090 < 0.0096 < 0.0110
	tic = 0.0345 < 0.0471 < 0.0395
	view = 0.1797 < 0.1497 < 0.2197

nb objects = 000300
	add = 0.0090 < 0.0095 < 0.0110
	tic = 0.0345 < 0.0461 < 0.0395
	view = 0.2044 < 0.1519 < 0.2444

nb objects = 000400
	add = 0.0090 < 0.0095 < 0.0110
	tic = 0.0345 < 0.0459 < 0.0395
	view = 0.2292 < 0.1539 < 0.2692

nb objects = 000500
	add = 0.0090 < 0.0096 < 0.0110
	tic = 0.0345 < 0.0462 < 0.0395
	view = 0.2539 < 0.1557 < 0.2939

nb objects = 000600
	add = 0.0090 < 0.0096 < 0.0110
	tic = 0.0345 < 0.0462 < 0.0395
	view = 0.2786 < 0.1576 < 0.3186

nb objects = 000700
	add = 0.0090 < 0.0096 < 0.0110
	tic = 0.0345 < 0.0458 < 0.0395
	view = 0.3033 < 0.1592 < 0.3433

nb objects = 000800
	add = 0.0090 < 0.0096 < 0.0110
	tic = 0.0345 < 0.0458 < 0.0395
	view = 0.3280 < 0.1607 < 0.3680

nb objects = 000900
	add = 0.0090 < 0.0095 < 0.0110
	tic = 0.0345 < 0.0463 < 0.0395
	view = 0.3528 < 0.1623 < 0.3928

nb objects = 001000
	add = 0.0090 < 0.0095 < 0.0110
	tic = 0.0345 < 0.0457 < 0.0395
	view = 0.3775 < 0.1640 < 0.4175

time to view object form with many lines 0.3000 < 0.2928 < 0.3200

time to view proxyfield form 0.2150 < 0.2265 < 0.2350


Loading Zope, please stand by ... done (6.449s)
/usr/lib/erp5/lib/python/Products/ZMailIn/__init__.py:25: DeprecationWarning: This will be removed in ZODB 3.6:
   use transaction.get() instead of get_transaction().
   transaction.commit() is a shortcut spelling of transaction.get().commit(),
   and transaction.abort() of transaction.get().abort().
  get_transaction().note('Added GlobalZMailInCatalog')
/usr/lib/erp5/lib/python/Products/ZMailIn/__init__.py:26: DeprecationWarning: This will be removed in ZODB 3.6:
   use transaction.get() instead of get_transaction().
   transaction.commit() is a shortcut spelling of transaction.get().commit(),
   and transaction.abort() of transaction.get().abort().
  get_transaction().commit()
/usr/lib/erp5/lib/python/Products/CMFMailIn/__init__.py:38: DeprecationWarning: The product_name parameter of ToolInit is deprecated and will be ignored in CMF1.6: CMFMailIn
  product_name='CMFMailIn', icon='tool.gif',
/home/buildbot/slave/parts/bot_perf/full.PERF/build/unit_test/Products/CMFActivity/ActivityTool.py:36: DeprecationWarning: The module, 'Products.CMFCore.CMFCorePermissions' is a deprecated compatiblity alias for 'Products.CMFCore.permissions';  please use the new module instead.
  from Products.CMFCore import CMFCorePermissions

Adding ERP5TypeTestCase user ... 
Adding erp5_portal_46b1242f30d521c53e744f4886ef0be0 ERP5 Site ... /usr/lib/erp5/lib/python/Products/PluginRegistry/PluginRegistry.py:111: DeprecationWarning: isImplementedBy has been renamed to providedBy
  if not plugin_type.isImplementedBy(plugin):
/home/buildbot/slave/parts/bot_perf/full.PERF/build/unit_test/Products/ERP5Type/Base.py:288: DeprecationWarning: Global function clearCache() is deprecated. Use portal_caches.clearCache() instead.
  clearCache()
done (71.734s)
Adding erp5_base business template ... (imported in 16.863s) done (29.135s)
Adding erp5_ui_test business template ... (imported in 4.127s) done (9.458s)
Executing pending activities ... 331 316 86 11 21 1 done (29.515s)
Logout ... 
done (140.814s)
Ran Unit test of Performance
FFF.
======================================================================
FAIL: test_00_viewBarObject (testPerformance.TestPerformance)
----------------------------------------------------------------------
Traceback (most recent call last):
  File "/usr/lib/erp5/lib/python/Testing/ZopeTestCase/profiler.py", line 98, in __call__
    testMethod()
  File "/home/buildbot/slave/parts/bot_perf/full.PERF/build/Products/ERP5Type/tests/testPerformance.py", line 164, in test_00_viewBarObject
    prefix='objective')
  File "/home/buildbot/slave/parts/bot_perf/full.PERF/build/Products/ERP5Type/tests/testPerformance.py", line 142, in checkViewBarObject
    '%.4f < %.4f < %.4f' % (min, req_time, max))
AssertionError: 0.1320 < 0.1406 < 0.1380

======================================================================
FAIL: test_01_viewBarModule (testPerformance.TestPerformance)
----------------------------------------------------------------------
Traceback (most recent call last):
  File "/usr/lib/erp5/lib/python/Testing/ZopeTestCase/profiler.py", line 98, in __call__
    testMethod()
  File "/home/buildbot/slave/parts/bot_perf/full.PERF/build/Products/ERP5Type/tests/testPerformance.py", line 241, in test_01_viewBarModule
    'View: %.4f < %.4f < %.4f' % (
AssertionError: View: 0.1550 < 0.1537 < 0.1950

======================================================================
FAIL: test_02_viewFooObjectWithManyLines (testPerformance.TestPerformance)
----------------------------------------------------------------------
Traceback (most recent call last):
  File "/usr/lib/erp5/lib/python/Testing/ZopeTestCase/profiler.py", line 98, in __call__
    testMethod()
  File "/home/buildbot/slave/parts/bot_perf/full.PERF/build/Products/ERP5Type/tests/testPerformance.py", line 315, in test_02_viewFooObjectWithManyLines
    '%.4f < %.4f < %.4f' % (
AssertionError: 0.3000 < 0.2928 < 0.3200

----------------------------------------------------------------------
Ran 4 tests in 542.516s

FAILED (failures=3)

SOFTWARE_HOME: /usr/lib/erp5/lib/python
INSTANCE_HOME: /home/buildbot/slave/parts/bot_perf/full.PERF/build/unit_test
objective time to view object form 0.1320 < 0.1409 < 0.1380

nb objects = 000100
	add = 0.0090 < 0.0096 < 0.0110
	tic = 0.0345 < 0.0466 < 0.0395
	view = 0.1550 < 0.1539 < 0.1950

nb objects = 000200
	add = 0.0090 < 0.0096 < 0.0110
	tic = 0.0345 < 0.0469 < 0.0395
	view = 0.1797 < 0.1499 < 0.2197

nb objects = 000300
	add = 0.0090 < 0.0096 < 0.0110
	tic = 0.0345 < 0.0460 < 0.0395
	view = 0.2044 < 0.1519 < 0.2444

nb objects = 000400
	add = 0.0090 < 0.0096 < 0.0110
	tic = 0.0345 < 0.0459 < 0.0395
	view = 0.2292 < 0.1537 < 0.2692

nb objects = 000500
	add = 0.0090 < 0.0096 < 0.0110
	tic = 0.0345 < 0.0461 < 0.0395
	view = 0.2539 < 0.1554 < 0.2939

nb objects = 000600
	add = 0.0090 < 0.0096 < 0.0110
	tic = 0.0345 < 0.0460 < 0.0395
	view = 0.2786 < 0.1573 < 0.3186

nb objects = 000700
	add = 0.0090 < 0.0096 < 0.0110
	tic = 0.0345 < 0.0462 < 0.0395
	view = 0.3033 < 0.1589 < 0.3433

nb objects = 000800
	add = 0.0090 < 0.0096 < 0.0110
	tic = 0.0345 < 0.0462 < 0.0395
	view = 0.3280 < 0.1609 < 0.3680

nb objects = 000900
	add = 0.0090 < 0.0096 < 0.0110
	tic = 0.0345 < 0.0459 < 0.0395
	view = 0.3528 < 0.1623 < 0.3928

nb objects = 001000
	add = 0.0090 < 0.0096 < 0.0110
	tic = 0.0345 < 0.0458 < 0.0395
	view = 0.3775 < 0.1641 < 0.4175

time to view object form with many lines 0.3000 < 0.2931 < 0.3200

time to view proxyfield form 0.2150 < 0.2263 < 0.2350


Loading Zope, please stand by ... done (2.370s)
/usr/lib/erp5/lib/python/Products/ZMailIn/__init__.py:25: DeprecationWarning: This will be removed in ZODB 3.6:
   use transaction.get() instead of get_transaction().
   transaction.commit() is a shortcut spelling of transaction.get().commit(),
   and transaction.abort() of transaction.get().abort().
  get_transaction().note('Added GlobalZMailInCatalog')
/usr/lib/erp5/lib/python/Products/ZMailIn/__init__.py:26: DeprecationWarning: This will be removed in ZODB 3.6:
   use transaction.get() instead of get_transaction().
   transaction.commit() is a shortcut spelling of transaction.get().commit(),
   and transaction.abort() of transaction.get().abort().
  get_transaction().commit()
/usr/lib/erp5/lib/python/Products/CMFMailIn/__init__.py:38: DeprecationWarning: The product_name parameter of ToolInit is deprecated and will be ignored in CMF1.6: CMFMailIn
  product_name='CMFMailIn', icon='tool.gif',
/home/buildbot/slave/parts/bot_perf/full.PERF/build/unit_test/Products/CMFActivity/ActivityTool.py:36: DeprecationWarning: The module, 'Products.CMFCore.CMFCorePermissions' is a deprecated compatiblity alias for 'Products.CMFCore.permissions';  please use the new module instead.
  from Products.CMFCore import CMFCorePermissions

Adding ERP5TypeTestCase user ... 
Adding erp5_portal_46b1242f30d521c53e744f4886ef0be0 ERP5 Site ... /usr/lib/erp5/lib/python/Products/PluginRegistry/PluginRegistry.py:111: DeprecationWarning: isImplementedBy has been renamed to providedBy
  if not plugin_type.isImplementedBy(plugin):
/home/buildbot/slave/parts/bot_perf/full.PERF/build/unit_test/Products/ERP5Type/Base.py:288: DeprecationWarning: Global function clearCache() is deprecated. Use portal_caches.clearCache() instead.
  clearCache()
done (61.195s)
Adding erp5_base business template ... (imported in 15.485s) done (27.742s)
Adding erp5_ui_test business template ... (imported in 4.094s) done (9.583s)
Executing pending activities ... 331 316 86 11 21 1 done (29.331s)
Logout ... 
done (128.803s)
Ran Unit test of Performance
FFF.
======================================================================
FAIL: test_00_viewBarObject (testPerformance.TestPerformance)
----------------------------------------------------------------------
Traceback (most recent call last):
  File "/usr/lib/erp5/lib/python/Testing/ZopeTestCase/profiler.py", line 98, in __call__
    testMethod()
  File "/home/buildbot/slave/parts/bot_perf/full.PERF/build/Products/ERP5Type/tests/testPerformance.py", line 164, in test_00_viewBarObject
    prefix='objective')
  File "/home/buildbot/slave/parts/bot_perf/full.PERF/build/Products/ERP5Type/tests/testPerformance.py", line 142, in checkViewBarObject
    '%.4f < %.4f < %.4f' % (min, req_time, max))
AssertionError: 0.1320 < 0.1409 < 0.1380

======================================================================
FAIL: test_01_viewBarModule (testPerformance.TestPerformance)
----------------------------------------------------------------------
Traceback (most recent call last):
  File "/usr/lib/erp5/lib/python/Testing/ZopeTestCase/profiler.py", line 98, in __call__
    testMethod()
  File "/home/buildbot/slave/parts/bot_perf/full.PERF/build/Products/ERP5Type/tests/testPerformance.py", line 241, in test_01_viewBarModule
    'View: %.4f < %.4f < %.4f' % (
AssertionError: View: 0.1550 < 0.1539 < 0.1950

======================================================================
FAIL: test_02_viewFooObjectWithManyLines (testPerformance.TestPerformance)
----------------------------------------------------------------------
Traceback (most recent call last):
  File "/usr/lib/erp5/lib/python/Testing/ZopeTestCase/profiler.py", line 98, in __call__
    testMethod()
  File "/home/buildbot/slave/parts/bot_perf/full.PERF/build/Products/ERP5Type/tests/testPerformance.py", line 315, in test_02_viewFooObjectWithManyLines
    '%.4f < %.4f < %.4f' % (
AssertionError: 0.3000 < 0.2931 < 0.3200

----------------------------------------------------------------------
Ran 4 tests in 530.590s

FAILED (failures=3)


More information about the Erp5-report mailing list