[Erp5-report] PERF r26643: 12 Tests, 0 Errors, 7 Failures

nobody at svn.erp5.org nobody at svn.erp5.org
Mon Apr 27 10:43:06 CEST 2009


Test Suite: PERF
Revision: 26643
Result: FAIL

All tests: 12
Failures: 7
Errors: 0


The following tests failed:

  testPerformance                                    (3 failures)
   test_00_viewBarObject (testPerformance.TestPerformance)
   test_01_viewBarModule (testPerformance.TestPerformance)
   test_02_viewFooObjectWithManyLines (testPerformance.TestPerformance)

  testPerformance                                    (2 failures)
   test_00_viewBarObject (testPerformance.TestPerformance)
   test_01_viewBarModule (testPerformance.TestPerformance)

  testPerformance                                    (2 failures)
   test_00_viewBarObject (testPerformance.TestPerformance)
   test_01_viewBarModule (testPerformance.TestPerformance)
-------------- next part --------------
SOFTWARE_HOME: /usr/lib/erp5/lib/python
INSTANCE_HOME: /home/buildbot/slave/parts/bot_perf/full.PERF/build/unit_test
objective time to view object form 0.1320 < 0.1396 < 0.1380

nb objects = 000100
	add = 0.0090 < 0.0101 < 0.0110
	tic = 0.0345 < 0.0467 < 0.0395
	view = 0.1550 < 0.1816 < 0.1950

nb objects = 000200
	add = 0.0090 < 0.0102 < 0.0110
	tic = 0.0345 < 0.0469 < 0.0395
	view = 0.1797 < 0.2073 < 0.2197

nb objects = 000300
	add = 0.0090 < 0.0101 < 0.0110
	tic = 0.0345 < 0.0462 < 0.0395
	view = 0.2044 < 0.2388 < 0.2444

nb objects = 000400
	add = 0.0090 < 0.0100 < 0.0110
	tic = 0.0345 < 0.0464 < 0.0395
	view = 0.2292 < 0.2705 < 0.2692

nb objects = 000500
	add = 0.0090 < 0.0102 < 0.0110
	tic = 0.0345 < 0.0457 < 0.0395
	view = 0.2539 < 0.3014 < 0.2939

nb objects = 000600
	add = 0.0090 < 0.0100 < 0.0110
	tic = 0.0345 < 0.0460 < 0.0395
	view = 0.2786 < 0.3329 < 0.3186

nb objects = 000700
	add = 0.0090 < 0.0100 < 0.0110
	tic = 0.0345 < 0.0457 < 0.0395
	view = 0.3033 < 0.3652 < 0.3433

nb objects = 000800
	add = 0.0090 < 0.0100 < 0.0110
	tic = 0.0345 < 0.0463 < 0.0395
	view = 0.3280 < 0.3962 < 0.3680

nb objects = 000900
	add = 0.0090 < 0.0100 < 0.0110
	tic = 0.0345 < 0.0463 < 0.0395
	view = 0.3528 < 0.4267 < 0.3928

nb objects = 001000
	add = 0.0090 < 0.0100 < 0.0110
	tic = 0.0345 < 0.0465 < 0.0395
	view = 0.3775 < 0.4609 < 0.4175

time to view object form with many lines 0.3000 < 0.3222 < 0.3200

time to view proxyfield form 0.2150 < 0.2255 < 0.2350


Loading Zope, please stand by ... done (1.864s)

Adding ERP5TypeTestCase user ... 
Adding erp5_portal_46b1242f30d521c53e744f4886ef0be0 ERP5 Site ... done (47.831s)
Adding erp5_base business template ... (imported in 13.874s) done (26.191s)
Adding erp5_ui_test business template ... (imported in 3.975s) done (9.214s)
Executing pending activities ... 325 310 83 11 22 1 done (26.880s)
Logout ... 
done (110.974s)
Ran Unit test of Performance
FFF.
======================================================================
FAIL: test_00_viewBarObject (testPerformance.TestPerformance)
----------------------------------------------------------------------
Traceback (most recent call last):
  File "/usr/lib/erp5/lib/python/Testing/ZopeTestCase/profiler.py", line 98, in __call__
    testMethod()
  File "/home/buildbot/slave/parts/bot_perf/full.PERF/build/Products/ERP5Type/tests/testPerformance.py", line 163, in test_00_viewBarObject
    prefix='objective')
  File "/home/buildbot/slave/parts/bot_perf/full.PERF/build/Products/ERP5Type/tests/testPerformance.py", line 141, in checkViewBarObject
    '%.4f < %.4f < %.4f' % (min, req_time, max))
AssertionError: 0.1320 < 0.1396 < 0.1380

======================================================================
FAIL: test_01_viewBarModule (testPerformance.TestPerformance)
----------------------------------------------------------------------
Traceback (most recent call last):
  File "/usr/lib/erp5/lib/python/Testing/ZopeTestCase/profiler.py", line 98, in __call__
    testMethod()
  File "/home/buildbot/slave/parts/bot_perf/full.PERF/build/Products/ERP5Type/tests/testPerformance.py", line 247, in test_01_viewBarModule
    'Tic: %.4f < %.4f < %.4f' % (
AssertionError: Tic: 0.0345 < 0.0467 < 0.0395

======================================================================
FAIL: test_02_viewFooObjectWithManyLines (testPerformance.TestPerformance)
----------------------------------------------------------------------
Traceback (most recent call last):
  File "/usr/lib/erp5/lib/python/Testing/ZopeTestCase/profiler.py", line 98, in __call__
    testMethod()
  File "/home/buildbot/slave/parts/bot_perf/full.PERF/build/Products/ERP5Type/tests/testPerformance.py", line 314, in test_02_viewFooObjectWithManyLines
    '%.4f < %.4f < %.4f' % (
AssertionError: 0.3000 < 0.3222 < 0.3200

----------------------------------------------------------------------
Ran 4 tests in 676.343s

FAILED (failures=3)

SOFTWARE_HOME: /usr/lib/erp5/lib/python
INSTANCE_HOME: /home/buildbot/slave/parts/bot_perf/full.PERF/build/unit_test
objective time to view object form 0.1320 < 0.1389 < 0.1380

nb objects = 000100
	add = 0.0090 < 0.0100 < 0.0110
	tic = 0.0345 < 0.0463 < 0.0395
	view = 0.1550 < 0.1807 < 0.1950

nb objects = 000200
	add = 0.0090 < 0.0100 < 0.0110
	tic = 0.0345 < 0.0466 < 0.0395
	view = 0.1797 < 0.2066 < 0.2197

nb objects = 000300
	add = 0.0090 < 0.0100 < 0.0110
	tic = 0.0345 < 0.0459 < 0.0395
	view = 0.2044 < 0.2375 < 0.2444

nb objects = 000400
	add = 0.0090 < 0.0099 < 0.0110
	tic = 0.0345 < 0.0455 < 0.0395
	view = 0.2292 < 0.2695 < 0.2692

nb objects = 000500
	add = 0.0090 < 0.0100 < 0.0110
	tic = 0.0345 < 0.0456 < 0.0395
	view = 0.2539 < 0.3006 < 0.2939

nb objects = 000600
	add = 0.0090 < 0.0099 < 0.0110
	tic = 0.0345 < 0.0459 < 0.0395
	view = 0.2786 < 0.3311 < 0.3186

nb objects = 000700
	add = 0.0090 < 0.0099 < 0.0110
	tic = 0.0345 < 0.0457 < 0.0395
	view = 0.3033 < 0.3628 < 0.3433

nb objects = 000800
	add = 0.0090 < 0.0100 < 0.0110
	tic = 0.0345 < 0.0460 < 0.0395
	view = 0.3280 < 0.3938 < 0.3680

nb objects = 000900
	add = 0.0090 < 0.0099 < 0.0110
	tic = 0.0345 < 0.0457 < 0.0395
	view = 0.3528 < 0.4249 < 0.3928

nb objects = 001000
	add = 0.0090 < 0.0099 < 0.0110
	tic = 0.0345 < 0.0461 < 0.0395
	view = 0.3775 < 0.4587 < 0.4175

time to view object form with many lines 0.3000 < 0.3193 < 0.3200

time to view proxyfield form 0.2150 < 0.2236 < 0.2350


Loading Zope, please stand by ... done (2.894s)

Adding ERP5TypeTestCase user ... 
Adding erp5_portal_46b1242f30d521c53e744f4886ef0be0 ERP5 Site ... done (48.333s)
Adding erp5_base business template ... (imported in 13.571s) done (25.856s)
Adding erp5_ui_test business template ... (imported in 3.813s) done (9.031s)
Executing pending activities ... 325 310 83 11 22 1 done (26.539s)
Logout ... 
done (110.610s)
Ran Unit test of Performance
FF..
======================================================================
FAIL: test_00_viewBarObject (testPerformance.TestPerformance)
----------------------------------------------------------------------
Traceback (most recent call last):
  File "/usr/lib/erp5/lib/python/Testing/ZopeTestCase/profiler.py", line 98, in __call__
    testMethod()
  File "/home/buildbot/slave/parts/bot_perf/full.PERF/build/Products/ERP5Type/tests/testPerformance.py", line 163, in test_00_viewBarObject
    prefix='objective')
  File "/home/buildbot/slave/parts/bot_perf/full.PERF/build/Products/ERP5Type/tests/testPerformance.py", line 141, in checkViewBarObject
    '%.4f < %.4f < %.4f' % (min, req_time, max))
AssertionError: 0.1320 < 0.1389 < 0.1380

======================================================================
FAIL: test_01_viewBarModule (testPerformance.TestPerformance)
----------------------------------------------------------------------
Traceback (most recent call last):
  File "/usr/lib/erp5/lib/python/Testing/ZopeTestCase/profiler.py", line 98, in __call__
    testMethod()
  File "/home/buildbot/slave/parts/bot_perf/full.PERF/build/Products/ERP5Type/tests/testPerformance.py", line 247, in test_01_viewBarModule
    'Tic: %.4f < %.4f < %.4f' % (
AssertionError: Tic: 0.0345 < 0.0463 < 0.0395

----------------------------------------------------------------------
Ran 4 tests in 673.223s

FAILED (failures=2)

SOFTWARE_HOME: /usr/lib/erp5/lib/python
INSTANCE_HOME: /home/buildbot/slave/parts/bot_perf/full.PERF/build/unit_test
objective time to view object form 0.1320 < 0.1384 < 0.1380

nb objects = 000100
	add = 0.0090 < 0.0100 < 0.0110
	tic = 0.0345 < 0.0460 < 0.0395
	view = 0.1550 < 0.1805 < 0.1950

nb objects = 000200
	add = 0.0090 < 0.0102 < 0.0110
	tic = 0.0345 < 0.0464 < 0.0395
	view = 0.1797 < 0.2062 < 0.2197

nb objects = 000300
	add = 0.0090 < 0.0099 < 0.0110
	tic = 0.0345 < 0.0459 < 0.0395
	view = 0.2044 < 0.2374 < 0.2444

nb objects = 000400
	add = 0.0090 < 0.0099 < 0.0110
	tic = 0.0345 < 0.0457 < 0.0395
	view = 0.2292 < 0.2691 < 0.2692

nb objects = 000500
	add = 0.0090 < 0.0099 < 0.0110
	tic = 0.0345 < 0.0455 < 0.0395
	view = 0.2539 < 0.3006 < 0.2939

nb objects = 000600
	add = 0.0090 < 0.0099 < 0.0110
	tic = 0.0345 < 0.0458 < 0.0395
	view = 0.2786 < 0.3312 < 0.3186

nb objects = 000700
	add = 0.0090 < 0.0099 < 0.0110
	tic = 0.0345 < 0.0454 < 0.0395
	view = 0.3033 < 0.3632 < 0.3433

nb objects = 000800
	add = 0.0090 < 0.0099 < 0.0110
	tic = 0.0345 < 0.0459 < 0.0395
	view = 0.3280 < 0.3934 < 0.3680

nb objects = 000900
	add = 0.0090 < 0.0099 < 0.0110
	tic = 0.0345 < 0.0459 < 0.0395
	view = 0.3528 < 0.4242 < 0.3928

nb objects = 001000
	add = 0.0090 < 0.0099 < 0.0110
	tic = 0.0345 < 0.0459 < 0.0395
	view = 0.3775 < 0.4587 < 0.4175

time to view object form with many lines 0.3000 < 0.3188 < 0.3200

time to view proxyfield form 0.2150 < 0.2240 < 0.2350


Loading Zope, please stand by ... done (1.869s)

Adding ERP5TypeTestCase user ... 
Adding erp5_portal_46b1242f30d521c53e744f4886ef0be0 ERP5 Site ... done (46.436s)
Adding erp5_base business template ... (imported in 13.485s) done (25.754s)
Adding erp5_ui_test business template ... (imported in 3.804s) done (9.124s)
Executing pending activities ... 325 310 83 11 22 1 done (26.687s)
Logout ... 
done (108.833s)
Ran Unit test of Performance
FF..
======================================================================
FAIL: test_00_viewBarObject (testPerformance.TestPerformance)
----------------------------------------------------------------------
Traceback (most recent call last):
  File "/usr/lib/erp5/lib/python/Testing/ZopeTestCase/profiler.py", line 98, in __call__
    testMethod()
  File "/home/buildbot/slave/parts/bot_perf/full.PERF/build/Products/ERP5Type/tests/testPerformance.py", line 163, in test_00_viewBarObject
    prefix='objective')
  File "/home/buildbot/slave/parts/bot_perf/full.PERF/build/Products/ERP5Type/tests/testPerformance.py", line 141, in checkViewBarObject
    '%.4f < %.4f < %.4f' % (min, req_time, max))
AssertionError: 0.1320 < 0.1384 < 0.1380

======================================================================
FAIL: test_01_viewBarModule (testPerformance.TestPerformance)
----------------------------------------------------------------------
Traceback (most recent call last):
  File "/usr/lib/erp5/lib/python/Testing/ZopeTestCase/profiler.py", line 98, in __call__
    testMethod()
  File "/home/buildbot/slave/parts/bot_perf/full.PERF/build/Products/ERP5Type/tests/testPerformance.py", line 247, in test_01_viewBarModule
    'Tic: %.4f < %.4f < %.4f' % (
AssertionError: Tic: 0.0345 < 0.0460 < 0.0395

----------------------------------------------------------------------
Ran 4 tests in 671.023s

FAILED (failures=2)


More information about the Erp5-report mailing list