[Erp5-report] PERF r26176: 12 Tests, 0 Errors, 9 Failures

nobody at svn.erp5.org nobody at svn.erp5.org
Fri Mar 27 09:26:55 CET 2009


Test Suite: PERF
Revision: 26176
Result: FAIL

All tests: 12
Failures: 9
Errors: 0


The following tests failed:

  testPerformance                                    (3 failures)
   test_00_viewBarObject (testPerformance.TestPerformance)
   test_01_viewBarModule (testPerformance.TestPerformance)
   test_02_viewFooObjectWithManyLines (testPerformance.TestPerformance)

  testPerformance                                    (3 failures)
   test_00_viewBarObject (testPerformance.TestPerformance)
   test_01_viewBarModule (testPerformance.TestPerformance)
   test_02_viewFooObjectWithManyLines (testPerformance.TestPerformance)

  testPerformance                                    (3 failures)
   test_00_viewBarObject (testPerformance.TestPerformance)
   test_01_viewBarModule (testPerformance.TestPerformance)
   test_02_viewFooObjectWithManyLines (testPerformance.TestPerformance)
-------------- next part --------------
SOFTWARE_HOME: /usr/lib/erp5/lib/python
INSTANCE_HOME: /home/buildbot/slave/parts/bot_perf/full.PERF/build/unit_test
['', '/usr/lib/erp5/lib/python', '/usr/lib/erp5', '/usr/lib64/ooo-3.0_64/basis-link/program', '/usr/lib/python24.zip', '/usr/lib64/python2.4', '/usr/lib64/python2.4/plat-linux2', '/usr/lib64/python2.4/lib-tk', '/usr/lib64/python2.4/lib-dynload', '/usr/lib64/python2.4/site-packages', '/usr/lib64/python2.4/site-packages/Numeric', '/usr/lib64/python2.4/site-packages/PIL', '/usr/lib/python2.4/site-packages', '/usr/lib/python2.4/site-packages/Numeric', '/usr/lib/erp5/bin']
objective time to view object form 0.1320 < 0.1437 < 0.1380

nb objects = 000100
	add = 0.0090 < 0.0100 < 0.0110
	tic = 0.0345 < 0.0459 < 0.0395
	view = 0.1550 < 0.1887 < 0.1950

nb objects = 000200
	add = 0.0090 < 0.0100 < 0.0110
	tic = 0.0345 < 0.0461 < 0.0395
	view = 0.1797 < 0.2136 < 0.2197

nb objects = 000300
	add = 0.0090 < 0.0099 < 0.0110
	tic = 0.0345 < 0.0452 < 0.0395
	view = 0.2044 < 0.2438 < 0.2444

nb objects = 000400
	add = 0.0090 < 0.0099 < 0.0110
	tic = 0.0345 < 0.0456 < 0.0395
	view = 0.2292 < 0.2744 < 0.2692

nb objects = 000500
	add = 0.0090 < 0.0102 < 0.0110
	tic = 0.0345 < 0.0453 < 0.0395
	view = 0.2539 < 0.3047 < 0.2939

nb objects = 000600
	add = 0.0090 < 0.0099 < 0.0110
	tic = 0.0345 < 0.0453 < 0.0395
	view = 0.2786 < 0.3345 < 0.3186

nb objects = 000700
	add = 0.0090 < 0.0099 < 0.0110
	tic = 0.0345 < 0.0457 < 0.0395
	view = 0.3033 < 0.3646 < 0.3433

nb objects = 000800
	add = 0.0090 < 0.0099 < 0.0110
	tic = 0.0345 < 0.0455 < 0.0395
	view = 0.3280 < 0.3949 < 0.3680

nb objects = 000900
	add = 0.0090 < 0.0099 < 0.0110
	tic = 0.0345 < 0.0452 < 0.0395
	view = 0.3528 < 0.4244 < 0.3928

nb objects = 001000
	add = 0.0090 < 0.0099 < 0.0110
	tic = 0.0345 < 0.0457 < 0.0395
	view = 0.3775 < 0.4563 < 0.4175

time to view object form with many lines 0.3000 < 0.3265 < 0.3200

time to view proxyfield form 0.2150 < 0.2325 < 0.2350


Loading Zope, please stand by ... done (2.222s)

Adding ERP5TypeTestCase user ... 
Adding erp5_portal_46b1242f30d521c53e744f4886ef0be0 ERP5 Site ... done (53.772s)
Adding erp5_base business template ... (imported in 13.848s) done (25.553s)
Adding erp5_ui_test business template ... (imported in 4.170s) done (9.394s)
Executing pending activities ... 319 304 80 11 22 1 done (24.920s)
Logout ... 
done (114.527s)
Ran Unit test of Performance
FFF.
======================================================================
FAIL: test_00_viewBarObject (testPerformance.TestPerformance)
----------------------------------------------------------------------
Traceback (most recent call last):
  File "/usr/lib/erp5/lib/python/Testing/ZopeTestCase/profiler.py", line 98, in __call__
    testMethod()
  File "/home/buildbot/slave/parts/bot_perf/full.PERF/build/Products/ERP5Type/tests/testPerformance.py", line 163, in test_00_viewBarObject
    prefix='objective')
  File "/home/buildbot/slave/parts/bot_perf/full.PERF/build/Products/ERP5Type/tests/testPerformance.py", line 141, in checkViewBarObject
    '%.4f < %.4f < %.4f' % (min, req_time, max))
AssertionError: 0.1320 < 0.1437 < 0.1380

======================================================================
FAIL: test_01_viewBarModule (testPerformance.TestPerformance)
----------------------------------------------------------------------
Traceback (most recent call last):
  File "/usr/lib/erp5/lib/python/Testing/ZopeTestCase/profiler.py", line 98, in __call__
    testMethod()
  File "/home/buildbot/slave/parts/bot_perf/full.PERF/build/Products/ERP5Type/tests/testPerformance.py", line 247, in test_01_viewBarModule
    'Tic: %.4f < %.4f < %.4f' % (
AssertionError: Tic: 0.0345 < 0.0459 < 0.0395

======================================================================
FAIL: test_02_viewFooObjectWithManyLines (testPerformance.TestPerformance)
----------------------------------------------------------------------
Traceback (most recent call last):
  File "/usr/lib/erp5/lib/python/Testing/ZopeTestCase/profiler.py", line 98, in __call__
    testMethod()
  File "/home/buildbot/slave/parts/bot_perf/full.PERF/build/Products/ERP5Type/tests/testPerformance.py", line 314, in test_02_viewFooObjectWithManyLines
    '%.4f < %.4f < %.4f' % (
AssertionError: 0.3000 < 0.3265 < 0.3200

----------------------------------------------------------------------
Ran 4 tests in 649.436s

FAILED (failures=3)

SOFTWARE_HOME: /usr/lib/erp5/lib/python
INSTANCE_HOME: /home/buildbot/slave/parts/bot_perf/full.PERF/build/unit_test
['', '/usr/lib/erp5/lib/python', '/usr/lib/erp5', '/usr/lib64/ooo-3.0_64/basis-link/program', '/usr/lib/python24.zip', '/usr/lib64/python2.4', '/usr/lib64/python2.4/plat-linux2', '/usr/lib64/python2.4/lib-tk', '/usr/lib64/python2.4/lib-dynload', '/usr/lib64/python2.4/site-packages', '/usr/lib64/python2.4/site-packages/Numeric', '/usr/lib64/python2.4/site-packages/PIL', '/usr/lib/python2.4/site-packages', '/usr/lib/python2.4/site-packages/Numeric', '/usr/lib/erp5/bin']
objective time to view object form 0.1320 < 0.1439 < 0.1380

nb objects = 000100
	add = 0.0090 < 0.0100 < 0.0110
	tic = 0.0345 < 0.0458 < 0.0395
	view = 0.1550 < 0.1893 < 0.1950

nb objects = 000200
	add = 0.0090 < 0.0100 < 0.0110
	tic = 0.0345 < 0.0465 < 0.0395
	view = 0.1797 < 0.2141 < 0.2197

nb objects = 000300
	add = 0.0090 < 0.0099 < 0.0110
	tic = 0.0345 < 0.0450 < 0.0395
	view = 0.2044 < 0.2448 < 0.2444

nb objects = 000400
	add = 0.0090 < 0.0100 < 0.0110
	tic = 0.0345 < 0.0459 < 0.0395
	view = 0.2292 < 0.2758 < 0.2692

nb objects = 000500
	add = 0.0090 < 0.0100 < 0.0110
	tic = 0.0345 < 0.0461 < 0.0395
	view = 0.2539 < 0.3055 < 0.2939

nb objects = 000600
	add = 0.0090 < 0.0100 < 0.0110
	tic = 0.0345 < 0.0455 < 0.0395
	view = 0.2786 < 0.3364 < 0.3186

nb objects = 000700
	add = 0.0090 < 0.0100 < 0.0110
	tic = 0.0345 < 0.0455 < 0.0395
	view = 0.3033 < 0.3661 < 0.3433

nb objects = 000800
	add = 0.0090 < 0.0100 < 0.0110
	tic = 0.0345 < 0.0454 < 0.0395
	view = 0.3280 < 0.3958 < 0.3680

nb objects = 000900
	add = 0.0090 < 0.0100 < 0.0110
	tic = 0.0345 < 0.0453 < 0.0395
	view = 0.3528 < 0.4260 < 0.3928

nb objects = 001000
	add = 0.0090 < 0.0100 < 0.0110
	tic = 0.0345 < 0.0461 < 0.0395
	view = 0.3775 < 0.4583 < 0.4175

time to view object form with many lines 0.3000 < 0.3274 < 0.3200

time to view proxyfield form 0.2150 < 0.2335 < 0.2350


Loading Zope, please stand by ... done (4.301s)

Adding ERP5TypeTestCase user ... 
Adding erp5_portal_46b1242f30d521c53e744f4886ef0be0 ERP5 Site ... done (47.904s)
Adding erp5_base business template ... (imported in 13.822s) done (25.505s)
Adding erp5_ui_test business template ... (imported in 4.182s) done (9.432s)
Executing pending activities ... 319 304 80 11 22 1 done (24.940s)
Logout ... 
done (108.641s)
Ran Unit test of Performance
FFF.
======================================================================
FAIL: test_00_viewBarObject (testPerformance.TestPerformance)
----------------------------------------------------------------------
Traceback (most recent call last):
  File "/usr/lib/erp5/lib/python/Testing/ZopeTestCase/profiler.py", line 98, in __call__
    testMethod()
  File "/home/buildbot/slave/parts/bot_perf/full.PERF/build/Products/ERP5Type/tests/testPerformance.py", line 163, in test_00_viewBarObject
    prefix='objective')
  File "/home/buildbot/slave/parts/bot_perf/full.PERF/build/Products/ERP5Type/tests/testPerformance.py", line 141, in checkViewBarObject
    '%.4f < %.4f < %.4f' % (min, req_time, max))
AssertionError: 0.1320 < 0.1439 < 0.1380

======================================================================
FAIL: test_01_viewBarModule (testPerformance.TestPerformance)
----------------------------------------------------------------------
Traceback (most recent call last):
  File "/usr/lib/erp5/lib/python/Testing/ZopeTestCase/profiler.py", line 98, in __call__
    testMethod()
  File "/home/buildbot/slave/parts/bot_perf/full.PERF/build/Products/ERP5Type/tests/testPerformance.py", line 247, in test_01_viewBarModule
    'Tic: %.4f < %.4f < %.4f' % (
AssertionError: Tic: 0.0345 < 0.0458 < 0.0395

======================================================================
FAIL: test_02_viewFooObjectWithManyLines (testPerformance.TestPerformance)
----------------------------------------------------------------------
Traceback (most recent call last):
  File "/usr/lib/erp5/lib/python/Testing/ZopeTestCase/profiler.py", line 98, in __call__
    testMethod()
  File "/home/buildbot/slave/parts/bot_perf/full.PERF/build/Products/ERP5Type/tests/testPerformance.py", line 314, in test_02_viewFooObjectWithManyLines
    '%.4f < %.4f < %.4f' % (
AssertionError: 0.3000 < 0.3274 < 0.3200

----------------------------------------------------------------------
Ran 4 tests in 645.039s

FAILED (failures=3)

SOFTWARE_HOME: /usr/lib/erp5/lib/python
INSTANCE_HOME: /home/buildbot/slave/parts/bot_perf/full.PERF/build/unit_test
['', '/usr/lib/erp5/lib/python', '/usr/lib/erp5', '/usr/lib64/ooo-3.0_64/basis-link/program', '/usr/lib/python24.zip', '/usr/lib64/python2.4', '/usr/lib64/python2.4/plat-linux2', '/usr/lib64/python2.4/lib-tk', '/usr/lib64/python2.4/lib-dynload', '/usr/lib64/python2.4/site-packages', '/usr/lib64/python2.4/site-packages/Numeric', '/usr/lib64/python2.4/site-packages/PIL', '/usr/lib/python2.4/site-packages', '/usr/lib/python2.4/site-packages/Numeric', '/usr/lib/erp5/bin']
objective time to view object form 0.1320 < 0.1446 < 0.1380

nb objects = 000100
	add = 0.0090 < 0.0101 < 0.0110
	tic = 0.0345 < 0.0465 < 0.0395
	view = 0.1550 < 0.1899 < 0.1950

nb objects = 000200
	add = 0.0090 < 0.0103 < 0.0110
	tic = 0.0345 < 0.0468 < 0.0395
	view = 0.1797 < 0.2149 < 0.2197

nb objects = 000300
	add = 0.0090 < 0.0100 < 0.0110
	tic = 0.0345 < 0.0456 < 0.0395
	view = 0.2044 < 0.2452 < 0.2444

nb objects = 000400
	add = 0.0090 < 0.0100 < 0.0110
	tic = 0.0345 < 0.0462 < 0.0395
	view = 0.2292 < 0.2770 < 0.2692

nb objects = 000500
	add = 0.0090 < 0.0100 < 0.0110
	tic = 0.0345 < 0.0455 < 0.0395
	view = 0.2539 < 0.3057 < 0.2939

nb objects = 000600
	add = 0.0090 < 0.0100 < 0.0110
	tic = 0.0345 < 0.0460 < 0.0395
	view = 0.2786 < 0.3359 < 0.3186

nb objects = 000700
	add = 0.0090 < 0.0100 < 0.0110
	tic = 0.0345 < 0.0457 < 0.0395
	view = 0.3033 < 0.3670 < 0.3433

nb objects = 000800
	add = 0.0090 < 0.0100 < 0.0110
	tic = 0.0345 < 0.0458 < 0.0395
	view = 0.3280 < 0.3978 < 0.3680

nb objects = 000900
	add = 0.0090 < 0.0100 < 0.0110
	tic = 0.0345 < 0.0461 < 0.0395
	view = 0.3528 < 0.4278 < 0.3928

nb objects = 001000
	add = 0.0090 < 0.0100 < 0.0110
	tic = 0.0345 < 0.0461 < 0.0395
	view = 0.3775 < 0.4596 < 0.4175

time to view object form with many lines 0.3000 < 0.3284 < 0.3200

time to view proxyfield form 0.2150 < 0.2341 < 0.2350


Loading Zope, please stand by ... done (2.100s)

Adding ERP5TypeTestCase user ... 
Adding erp5_portal_46b1242f30d521c53e744f4886ef0be0 ERP5 Site ... done (46.013s)
Adding erp5_base business template ... (imported in 12.972s) done (24.658s)
Adding erp5_ui_test business template ... (imported in 4.082s) done (9.334s)
Executing pending activities ... 319 304 80 11 22 1 done (24.854s)
Logout ... 
done (105.737s)
Ran Unit test of Performance
FFF.
======================================================================
FAIL: test_00_viewBarObject (testPerformance.TestPerformance)
----------------------------------------------------------------------
Traceback (most recent call last):
  File "/usr/lib/erp5/lib/python/Testing/ZopeTestCase/profiler.py", line 98, in __call__
    testMethod()
  File "/home/buildbot/slave/parts/bot_perf/full.PERF/build/Products/ERP5Type/tests/testPerformance.py", line 163, in test_00_viewBarObject
    prefix='objective')
  File "/home/buildbot/slave/parts/bot_perf/full.PERF/build/Products/ERP5Type/tests/testPerformance.py", line 141, in checkViewBarObject
    '%.4f < %.4f < %.4f' % (min, req_time, max))
AssertionError: 0.1320 < 0.1446 < 0.1380

======================================================================
FAIL: test_01_viewBarModule (testPerformance.TestPerformance)
----------------------------------------------------------------------
Traceback (most recent call last):
  File "/usr/lib/erp5/lib/python/Testing/ZopeTestCase/profiler.py", line 98, in __call__
    testMethod()
  File "/home/buildbot/slave/parts/bot_perf/full.PERF/build/Products/ERP5Type/tests/testPerformance.py", line 247, in test_01_viewBarModule
    'Tic: %.4f < %.4f < %.4f' % (
AssertionError: Tic: 0.0345 < 0.0465 < 0.0395

======================================================================
FAIL: test_02_viewFooObjectWithManyLines (testPerformance.TestPerformance)
----------------------------------------------------------------------
Traceback (most recent call last):
  File "/usr/lib/erp5/lib/python/Testing/ZopeTestCase/profiler.py", line 98, in __call__
    testMethod()
  File "/home/buildbot/slave/parts/bot_perf/full.PERF/build/Products/ERP5Type/tests/testPerformance.py", line 314, in test_02_viewFooObjectWithManyLines
    '%.4f < %.4f < %.4f' % (
AssertionError: 0.3000 < 0.3284 < 0.3200

----------------------------------------------------------------------
Ran 4 tests in 643.425s

FAILED (failures=3)


More information about the Erp5-report mailing list