[Erp5-report] PERF r25897: 12 Tests, 0 Errors, 3 Failures

nobody at svn.erp5.org nobody at svn.erp5.org
Thu Mar 5 23:25:13 CET 2009


Test Suite: PERF
Revision: 25897
Result: FAIL

All tests: 12
Failures: 3
Errors: 0


The following tests failed:

  testPerformance                                    (1 failures)
   test_01_viewBarModule (testPerformance.TestPerformance)

  testPerformance                                    (1 failures)
   test_01_viewBarModule (testPerformance.TestPerformance)

  testPerformance                                    (1 failures)
   test_01_viewBarModule (testPerformance.TestPerformance)
-------------- next part --------------
SOFTWARE_HOME: /usr/lib/erp5/lib/python
INSTANCE_HOME: /home/buildbot/buildbot_slave/full.PERF/build/unit_test
objective time to view object form 0.1320 < 0.1360 < 0.1380

nb objects = 000100
	add = 0.0090 < 0.0095 < 0.0110
	tic = 0.0345 < 0.0445 < 0.0395
	view = 0.1550 < 0.1795 < 0.1950

nb objects = 000200
	add = 0.0090 < 0.0095 < 0.0110
	tic = 0.0345 < 0.0453 < 0.0395
	view = 0.1797 < 0.2032 < 0.2197

nb objects = 000300
	add = 0.0090 < 0.0094 < 0.0110
	tic = 0.0345 < 0.0435 < 0.0395
	view = 0.2044 < 0.2323 < 0.2444

nb objects = 000400
	add = 0.0090 < 0.0094 < 0.0110
	tic = 0.0345 < 0.0440 < 0.0395
	view = 0.2292 < 0.2614 < 0.2692

nb objects = 000500
	add = 0.0090 < 0.0097 < 0.0110
	tic = 0.0345 < 0.0441 < 0.0395
	view = 0.2539 < 0.2909 < 0.2939

nb objects = 000600
	add = 0.0090 < 0.0094 < 0.0110
	tic = 0.0345 < 0.0441 < 0.0395
	view = 0.2786 < 0.3205 < 0.3186

nb objects = 000700
	add = 0.0090 < 0.0095 < 0.0110
	tic = 0.0345 < 0.0442 < 0.0395
	view = 0.3033 < 0.3490 < 0.3433

nb objects = 000800
	add = 0.0090 < 0.0095 < 0.0110
	tic = 0.0345 < 0.0438 < 0.0395
	view = 0.3280 < 0.3780 < 0.3680

nb objects = 000900
	add = 0.0090 < 0.0094 < 0.0110
	tic = 0.0345 < 0.0439 < 0.0395
	view = 0.3528 < 0.4061 < 0.3928

nb objects = 001000
	add = 0.0090 < 0.0094 < 0.0110
	tic = 0.0345 < 0.0442 < 0.0395
	view = 0.3775 < 0.4363 < 0.4175

time to view object form with many lines 0.3000 < 0.3123 < 0.3200

time to view proxyfield form 0.2150 < 0.2224 < 0.2350


Loading Zope, please stand by ... done (1.769s)

Adding ERP5TypeTestCase user ... 
Adding erp5_portal_46b1242f30d521c53e744f4886ef0be0 ERP5 Site ... done (44.788s)
Adding erp5_base business template ... (imported in 23.670s) done (35.487s)
Adding erp5_ui_test business template ... (imported in 5.742s) done (10.763s)
Executing pending activities ... 317 302 80 11 22 1 done (23.930s)
Logout ... 
done (115.837s)
Ran Unit test of Performance
.F..
======================================================================
FAIL: test_01_viewBarModule (testPerformance.TestPerformance)
----------------------------------------------------------------------
Traceback (most recent call last):
  File "/usr/lib/erp5/lib/python/Testing/ZopeTestCase/profiler.py", line 98, in __call__
    testMethod()
  File "/home/buildbot/buildbot_slave/full.PERF/build/Products/ERP5Type/tests/testPerformance.py", line 247, in test_01_viewBarModule
    'Tic: %.4f < %.4f < %.4f' % (
AssertionError: Tic: 0.0345 < 0.0445 < 0.0395

----------------------------------------------------------------------
Ran 4 tests in 628.836s

FAILED (failures=1)

SOFTWARE_HOME: /usr/lib/erp5/lib/python
INSTANCE_HOME: /home/buildbot/buildbot_slave/full.PERF/build/unit_test
objective time to view object form 0.1320 < 0.1354 < 0.1380

nb objects = 000100
	add = 0.0090 < 0.0095 < 0.0110
	tic = 0.0345 < 0.0446 < 0.0395
	view = 0.1550 < 0.1791 < 0.1950

nb objects = 000200
	add = 0.0090 < 0.0097 < 0.0110
	tic = 0.0345 < 0.0450 < 0.0395
	view = 0.1797 < 0.2033 < 0.2197

nb objects = 000300
	add = 0.0090 < 0.0094 < 0.0110
	tic = 0.0345 < 0.0438 < 0.0395
	view = 0.2044 < 0.2324 < 0.2444

nb objects = 000400
	add = 0.0090 < 0.0094 < 0.0110
	tic = 0.0345 < 0.0441 < 0.0395
	view = 0.2292 < 0.2617 < 0.2692

nb objects = 000500
	add = 0.0090 < 0.0095 < 0.0110
	tic = 0.0345 < 0.0442 < 0.0395
	view = 0.2539 < 0.2903 < 0.2939

nb objects = 000600
	add = 0.0090 < 0.0094 < 0.0110
	tic = 0.0345 < 0.0440 < 0.0395
	view = 0.2786 < 0.3192 < 0.3186

nb objects = 000700
	add = 0.0090 < 0.0094 < 0.0110
	tic = 0.0345 < 0.0438 < 0.0395
	view = 0.3033 < 0.3485 < 0.3433

nb objects = 000800
	add = 0.0090 < 0.0094 < 0.0110
	tic = 0.0345 < 0.0442 < 0.0395
	view = 0.3280 < 0.3780 < 0.3680

nb objects = 000900
	add = 0.0090 < 0.0094 < 0.0110
	tic = 0.0345 < 0.0440 < 0.0395
	view = 0.3528 < 0.4052 < 0.3928

nb objects = 001000
	add = 0.0090 < 0.0094 < 0.0110
	tic = 0.0345 < 0.0434 < 0.0395
	view = 0.3775 < 0.4341 < 0.4175

time to view object form with many lines 0.3000 < 0.3104 < 0.3200

time to view proxyfield form 0.2150 < 0.2210 < 0.2350


Loading Zope, please stand by ... done (3.569s)

Adding ERP5TypeTestCase user ... 
Adding erp5_portal_46b1242f30d521c53e744f4886ef0be0 ERP5 Site ... done (43.609s)
Adding erp5_base business template ... (imported in 13.530s) done (25.277s)
Adding erp5_ui_test business template ... (imported in 3.656s) done (8.587s)
Executing pending activities ... 317 302 80 11 22 1 done (23.652s)
Logout ... 
done (101.948s)
Ran Unit test of Performance
.F..
======================================================================
FAIL: test_01_viewBarModule (testPerformance.TestPerformance)
----------------------------------------------------------------------
Traceback (most recent call last):
  File "/usr/lib/erp5/lib/python/Testing/ZopeTestCase/profiler.py", line 98, in __call__
    testMethod()
  File "/home/buildbot/buildbot_slave/full.PERF/build/Products/ERP5Type/tests/testPerformance.py", line 247, in test_01_viewBarModule
    'Tic: %.4f < %.4f < %.4f' % (
AssertionError: Tic: 0.0345 < 0.0446 < 0.0395

----------------------------------------------------------------------
Ran 4 tests in 614.059s

FAILED (failures=1)

SOFTWARE_HOME: /usr/lib/erp5/lib/python
INSTANCE_HOME: /home/buildbot/buildbot_slave/full.PERF/build/unit_test
objective time to view object form 0.1320 < 0.1367 < 0.1380

nb objects = 000100
	add = 0.0090 < 0.0096 < 0.0110
	tic = 0.0345 < 0.0444 < 0.0395
	view = 0.1550 < 0.1802 < 0.1950

nb objects = 000200
	add = 0.0090 < 0.0096 < 0.0110
	tic = 0.0345 < 0.0450 < 0.0395
	view = 0.1797 < 0.2047 < 0.2197

nb objects = 000300
	add = 0.0090 < 0.0095 < 0.0110
	tic = 0.0345 < 0.0446 < 0.0395
	view = 0.2044 < 0.2338 < 0.2444

nb objects = 000400
	add = 0.0090 < 0.0095 < 0.0110
	tic = 0.0345 < 0.0442 < 0.0395
	view = 0.2292 < 0.2636 < 0.2692

nb objects = 000500
	add = 0.0090 < 0.0096 < 0.0110
	tic = 0.0345 < 0.0442 < 0.0395
	view = 0.2539 < 0.2921 < 0.2939

nb objects = 000600
	add = 0.0090 < 0.0095 < 0.0110
	tic = 0.0345 < 0.0446 < 0.0395
	view = 0.2786 < 0.3213 < 0.3186

nb objects = 000700
	add = 0.0090 < 0.0096 < 0.0110
	tic = 0.0345 < 0.0444 < 0.0395
	view = 0.3033 < 0.3514 < 0.3433

nb objects = 000800
	add = 0.0090 < 0.0096 < 0.0110
	tic = 0.0345 < 0.0441 < 0.0395
	view = 0.3280 < 0.3802 < 0.3680

nb objects = 000900
	add = 0.0090 < 0.0095 < 0.0110
	tic = 0.0345 < 0.0446 < 0.0395
	view = 0.3528 < 0.4091 < 0.3928

nb objects = 001000
	add = 0.0090 < 0.0095 < 0.0110
	tic = 0.0345 < 0.0444 < 0.0395
	view = 0.3775 < 0.4392 < 0.4175

time to view object form with many lines 0.3000 < 0.3134 < 0.3200

time to view proxyfield form 0.2150 < 0.2231 < 0.2350


Loading Zope, please stand by ... done (1.644s)

Adding ERP5TypeTestCase user ... 
Adding erp5_portal_46b1242f30d521c53e744f4886ef0be0 ERP5 Site ... done (44.368s)
Adding erp5_base business template ... (imported in 13.192s) done (25.001s)
Adding erp5_ui_test business template ... (imported in 3.650s) done (8.588s)
Executing pending activities ... 317 302 80 11 22 1 done (23.878s)
Logout ... 
done (102.658s)
Ran Unit test of Performance
.F..
======================================================================
FAIL: test_01_viewBarModule (testPerformance.TestPerformance)
----------------------------------------------------------------------
Traceback (most recent call last):
  File "/usr/lib/erp5/lib/python/Testing/ZopeTestCase/profiler.py", line 98, in __call__
    testMethod()
  File "/home/buildbot/buildbot_slave/full.PERF/build/Products/ERP5Type/tests/testPerformance.py", line 247, in test_01_viewBarModule
    'Tic: %.4f < %.4f < %.4f' % (
AssertionError: Tic: 0.0345 < 0.0444 < 0.0395

----------------------------------------------------------------------
Ran 4 tests in 618.833s

FAILED (failures=1)


More information about the Erp5-report mailing list