[Erp5-report] PERF r25625: 12 Tests, 0 Errors, 3 Failures

nobody at svn.erp5.org nobody at svn.erp5.org
Thu Feb 19 17:46:29 CET 2009


Test Suite: PERF
Revision: 25625
Result: FAIL

All tests: 12
Failures: 3
Errors: 0


The following tests failed:

  testPerformance                                    (1 failures)
   test_01_viewBarModule (testPerformance.TestPerformance)

  testPerformance                                    (1 failures)
   test_01_viewBarModule (testPerformance.TestPerformance)

  testPerformance                                    (1 failures)
   test_01_viewBarModule (testPerformance.TestPerformance)
-------------- next part --------------
SOFTWARE_HOME: /usr/lib/erp5/lib/python
INSTANCE_HOME: /home/buildbot/buildbot_slave/full.PERF/build/unit_test
objective time to view object form 0.1320 < 0.1352 < 0.1380

nb objects = 000100
	add = 0.0090 < 0.0094 < 0.0110
	tic = 0.0345 < 0.0439 < 0.0395
	view = 0.1550 < 0.1745 < 0.1950

nb objects = 000200
	add = 0.0090 < 0.0094 < 0.0110
	tic = 0.0345 < 0.0447 < 0.0395
	view = 0.1797 < 0.1982 < 0.2197

nb objects = 000300
	add = 0.0090 < 0.0093 < 0.0110
	tic = 0.0345 < 0.0438 < 0.0395
	view = 0.2044 < 0.2272 < 0.2444

nb objects = 000400
	add = 0.0090 < 0.0093 < 0.0110
	tic = 0.0345 < 0.0438 < 0.0395
	view = 0.2292 < 0.2567 < 0.2692

nb objects = 000500
	add = 0.0090 < 0.0094 < 0.0110
	tic = 0.0345 < 0.0441 < 0.0395
	view = 0.2539 < 0.2851 < 0.2939

nb objects = 000600
	add = 0.0090 < 0.0093 < 0.0110
	tic = 0.0345 < 0.0437 < 0.0395
	view = 0.2786 < 0.3145 < 0.3186

nb objects = 000700
	add = 0.0090 < 0.0094 < 0.0110
	tic = 0.0345 < 0.0442 < 0.0395
	view = 0.3033 < 0.3441 < 0.3433

nb objects = 000800
	add = 0.0090 < 0.0094 < 0.0110
	tic = 0.0345 < 0.0436 < 0.0395
	view = 0.3280 < 0.3724 < 0.3680

nb objects = 000900
	add = 0.0090 < 0.0094 < 0.0110
	tic = 0.0345 < 0.0436 < 0.0395
	view = 0.3528 < 0.4025 < 0.3928

nb objects = 001000
	add = 0.0090 < 0.0093 < 0.0110
	tic = 0.0345 < 0.0441 < 0.0395
	view = 0.3775 < 0.4320 < 0.4175

time to view object form with many lines 0.3000 < 0.3105 < 0.3200

time to view proxyfield form 0.2150 < 0.2211 < 0.2350


Loading Zope, please stand by ... done (1.659s)

Adding ERP5TypeTestCase user ... 
Adding erp5_portal_46b1242f30d521c53e744f4886ef0be0 ERP5 Site ... done (53.712s)
Adding erp5_base business template ... (imported in 14.757s) done (27.785s)
Adding erp5_ui_test business template ... (imported in 3.861s) done (8.734s)
Executing pending activities ... 313 298 80 11 22 1 done (23.624s)
Logout ... 
done (114.667s)
Ran Unit test of Performance
.F..
======================================================================
FAIL: test_01_viewBarModule (testPerformance.TestPerformance)
----------------------------------------------------------------------
Traceback (most recent call last):
  File "/usr/lib/erp5/lib/python/Testing/ZopeTestCase/profiler.py", line 98, in __call__
    testMethod()
  File "/home/buildbot/buildbot_slave/full.PERF/build/Products/ERP5Type/tests/testPerformance.py", line 247, in test_01_viewBarModule
    'Tic: %.4f < %.4f < %.4f' % (
AssertionError: Tic: 0.0345 < 0.0439 < 0.0395

----------------------------------------------------------------------
Ran 4 tests in 621.886s

FAILED (failures=1)

SOFTWARE_HOME: /usr/lib/erp5/lib/python
INSTANCE_HOME: /home/buildbot/buildbot_slave/full.PERF/build/unit_test
objective time to view object form 0.1320 < 0.1362 < 0.1380

nb objects = 000100
	add = 0.0090 < 0.0096 < 0.0110
	tic = 0.0345 < 0.0447 < 0.0395
	view = 0.1550 < 0.1759 < 0.1950

nb objects = 000200
	add = 0.0090 < 0.0095 < 0.0110
	tic = 0.0345 < 0.0449 < 0.0395
	view = 0.1797 < 0.2002 < 0.2197

nb objects = 000300
	add = 0.0090 < 0.0095 < 0.0110
	tic = 0.0345 < 0.0440 < 0.0395
	view = 0.2044 < 0.2287 < 0.2444

nb objects = 000400
	add = 0.0090 < 0.0095 < 0.0110
	tic = 0.0345 < 0.0446 < 0.0395
	view = 0.2292 < 0.2586 < 0.2692

nb objects = 000500
	add = 0.0090 < 0.0095 < 0.0110
	tic = 0.0345 < 0.0443 < 0.0395
	view = 0.2539 < 0.2881 < 0.2939

nb objects = 000600
	add = 0.0090 < 0.0095 < 0.0110
	tic = 0.0345 < 0.0439 < 0.0395
	view = 0.2786 < 0.3175 < 0.3186

nb objects = 000700
	add = 0.0090 < 0.0095 < 0.0110
	tic = 0.0345 < 0.0440 < 0.0395
	view = 0.3033 < 0.3470 < 0.3433

nb objects = 000800
	add = 0.0090 < 0.0095 < 0.0110
	tic = 0.0345 < 0.0443 < 0.0395
	view = 0.3280 < 0.3733 < 0.3680

nb objects = 000900
	add = 0.0090 < 0.0095 < 0.0110
	tic = 0.0345 < 0.0438 < 0.0395
	view = 0.3528 < 0.4045 < 0.3928

nb objects = 001000
	add = 0.0090 < 0.0095 < 0.0110
	tic = 0.0345 < 0.0437 < 0.0395
	view = 0.3775 < 0.4335 < 0.4175

time to view object form with many lines 0.3000 < 0.3123 < 0.3200

time to view proxyfield form 0.2150 < 0.2223 < 0.2350


Loading Zope, please stand by ... done (1.767s)

Adding ERP5TypeTestCase user ... 
Adding erp5_portal_46b1242f30d521c53e744f4886ef0be0 ERP5 Site ... done (44.114s)
Adding erp5_base business template ... (imported in 13.555s) done (24.966s)
Adding erp5_ui_test business template ... (imported in 3.873s) done (8.766s)
Executing pending activities ... 313 298 80 11 22 1 done (23.680s)
Logout ... 
done (102.332s)
Ran Unit test of Performance
.F..
======================================================================
FAIL: test_01_viewBarModule (testPerformance.TestPerformance)
----------------------------------------------------------------------
Traceback (most recent call last):
  File "/usr/lib/erp5/lib/python/Testing/ZopeTestCase/profiler.py", line 98, in __call__
    testMethod()
  File "/home/buildbot/buildbot_slave/full.PERF/build/Products/ERP5Type/tests/testPerformance.py", line 247, in test_01_viewBarModule
    'Tic: %.4f < %.4f < %.4f' % (
AssertionError: Tic: 0.0345 < 0.0447 < 0.0395

----------------------------------------------------------------------
Ran 4 tests in 612.690s

FAILED (failures=1)

SOFTWARE_HOME: /usr/lib/erp5/lib/python
INSTANCE_HOME: /home/buildbot/buildbot_slave/full.PERF/build/unit_test
objective time to view object form 0.1320 < 0.1352 < 0.1380

nb objects = 000100
	add = 0.0090 < 0.0094 < 0.0110
	tic = 0.0345 < 0.0441 < 0.0395
	view = 0.1550 < 0.1748 < 0.1950

nb objects = 000200
	add = 0.0090 < 0.0094 < 0.0110
	tic = 0.0345 < 0.0453 < 0.0395
	view = 0.1797 < 0.1987 < 0.2197

nb objects = 000300
	add = 0.0090 < 0.0094 < 0.0110
	tic = 0.0345 < 0.0441 < 0.0395
	view = 0.2044 < 0.2275 < 0.2444

nb objects = 000400
	add = 0.0090 < 0.0094 < 0.0110
	tic = 0.0345 < 0.0435 < 0.0395
	view = 0.2292 < 0.2573 < 0.2692

nb objects = 000500
	add = 0.0090 < 0.0095 < 0.0110
	tic = 0.0345 < 0.0436 < 0.0395
	view = 0.2539 < 0.2858 < 0.2939

nb objects = 000600
	add = 0.0090 < 0.0094 < 0.0110
	tic = 0.0345 < 0.0435 < 0.0395
	view = 0.2786 < 0.3151 < 0.3186

nb objects = 000700
	add = 0.0090 < 0.0094 < 0.0110
	tic = 0.0345 < 0.0439 < 0.0395
	view = 0.3033 < 0.3453 < 0.3433

nb objects = 000800
	add = 0.0090 < 0.0095 < 0.0110
	tic = 0.0345 < 0.0437 < 0.0395
	view = 0.3280 < 0.3727 < 0.3680

nb objects = 000900
	add = 0.0090 < 0.0094 < 0.0110
	tic = 0.0345 < 0.0434 < 0.0395
	view = 0.3528 < 0.4017 < 0.3928

nb objects = 001000
	add = 0.0090 < 0.0093 < 0.0110
	tic = 0.0345 < 0.0441 < 0.0395
	view = 0.3775 < 0.4321 < 0.4175

time to view object form with many lines 0.3000 < 0.3107 < 0.3200

time to view proxyfield form 0.2150 < 0.2214 < 0.2350


Loading Zope, please stand by ... done (1.654s)

Adding ERP5TypeTestCase user ... 
Adding erp5_portal_46b1242f30d521c53e744f4886ef0be0 ERP5 Site ... done (43.638s)
Adding erp5_base business template ... (imported in 12.739s) done (24.090s)
Adding erp5_ui_test business template ... (imported in 3.879s) done (8.751s)
Executing pending activities ... 313 298 80 11 22 1 done (23.425s)
Logout ... 
done (100.713s)
Ran Unit test of Performance
.F..
======================================================================
FAIL: test_01_viewBarModule (testPerformance.TestPerformance)
----------------------------------------------------------------------
Traceback (most recent call last):
  File "/usr/lib/erp5/lib/python/Testing/ZopeTestCase/profiler.py", line 98, in __call__
    testMethod()
  File "/home/buildbot/buildbot_slave/full.PERF/build/Products/ERP5Type/tests/testPerformance.py", line 247, in test_01_viewBarModule
    'Tic: %.4f < %.4f < %.4f' % (
AssertionError: Tic: 0.0345 < 0.0441 < 0.0395

----------------------------------------------------------------------
Ran 4 tests in 608.268s

FAILED (failures=1)


More information about the Erp5-report mailing list