[Erp5-report] ERP5 r24904: 2310 Tests, 0 Errors, 8 Failures

nobody at svn.erp5.org nobody at svn.erp5.org
Tue Dec 16 21:33:26 CET 2008


Test Suite: ERP5
Revision: 24904
Result: FAIL

All tests: 2310
Failures: 8
Errors: 0


The following tests failed:

  testTradeReports                                   (1 failures)
   testStockReport (testTradeReports.TestTradeReports)

  testSQLCachedWorklist                              (1 failures)
   test_02_related_key (testSQLCachedWorklist.TestSQLCachedWorklist)

  testERP5Catalog                                    (5 failures)
   test_SearchedStringIsNotStripped (testERP5Catalog.TestERP5Catalog)
   test_SubDocumentsWithAcquireLocalRoleSecurityIndexing (testERP5Catalog.TestERP5Catalog)
   test_complex_query (testERP5Catalog.TestERP5Catalog)
   test_multipleRelatedKeyDoMultipleJoins (testERP5Catalog.TestERP5Catalog)
   test_sortOnRelatedKeyWithUnsetRelation (testERP5Catalog.TestERP5Catalog)

  testCMFCategory                                    (1 failures)
   test_getSingleCategoryAcquiredMembershipListOnParent (testCMFCategory.TestCMFCategory)
-------------- next part --------------

FAIL: testStockReport (testTradeReports.TestTradeReports)
----------------------------------------------------------------------
Traceback (most recent call last):
  File "/usr/lib/erp5/lib/python/Testing/ZopeTestCase/profiler.py", line 98, in __call__
    testMethod()
  File "/home/buildbot/buildbot_slave/full.ERP5/build/unit_test/Products/ERP5/tests/testTradeReports.py", line 626, in testStockReport
    self.assertEquals(1, len(data_line_list))
AssertionError: 1 != 0



FAIL: test_02_related_key (testSQLCachedWorklist.TestSQLCachedWorklist)
----------------------------------------------------------------------
Traceback (most recent call last):
  File "/usr/lib/erp5/lib/python/Testing/ZopeTestCase/profiler.py", line 98, in __call__
    testMethod()
  File "/home/buildbot/buildbot_slave/full.ERP5/build/unit_test/Products/ERP5/tests/testWorklist.py", line 367, in test_02_related_key
    result = workflow_tool.listActions(object=document)
  File "/home/buildbot/buildbot_slave/full.ERP5/build/unit_test/Products/ERP5Type/patches/WorkflowTool.py", line 554, in WorkflowTool_listActions
    actions.extend(_getWorklistActionList())
  File "/home/buildbot/buildbot_slave/full.ERP5/build/unit_test/Products/ERP5Type/Cache.py", line 202, in __call__
    value = cache_factory(
  File "/home/buildbot/buildbot_slave/full.ERP5/build/unit_test/Products/ERP5Type/Cache.py", line 109, in __call__
    value = callable_object(*args, **kwd)
  File "/home/buildbot/buildbot_slave/full.ERP5/build/unit_test/Products/ERP5Type/patches/WorkflowTool.py", line 520, in _getWorklistActionList
    src__=src__)
  File "/usr/lib/erp5/lib/python/Shared/DC/Scripts/Bindings.py", line 311, in __call__
    return self._bindAndExec(args, kw, None)
  File "/usr/lib/erp5/lib/python/Shared/DC/Scripts/Bindings.py", line 348, in _bindAndExec
    return self._exec(bound_data, args, kw)
  File "/home/buildbot/buildbot_slave/full.ERP5/build/unit_test/Products/ERP5Type/tests/ERP5TypeTestCase.py", line 999, in _exec
    return PythonScript_exec(self, *args)
  File "/usr/lib/erp5/lib/python/Products/PythonScripts/PythonScript.py", line 324, in _exec
    result = f(*args, **kw)
  File "Script (Python)", line 15, in Base_getCountFromWorklistTable
  File "/usr/lib/erp5/lib/python/Shared/DC/Scripts/Bindings.py", line 311, in __call__
    return self._bindAndExec(args, kw, None)
  File "/usr/lib/erp5/lib/python/Shared/DC/Scripts/Bindings.py", line 348, in _bindAndExec
    return self._exec(bound_data, args, kw)
  File "/home/buildbot/buildbot_slave/full.ERP5/build/unit_test/Products/ERP5Type/tests/ERP5TypeTestCase.py", line 999, in _exec
    return PythonScript_exec(self, *args)
  File "/usr/lib/erp5/lib/python/Products/PythonScripts/PythonScript.py", line 324, in _exec
    result = f(*args, **kw)
  File "Script (Python)", line 1, in Base_refreshWorklistTableContent
  File "/home/buildbot/buildbot_slave/full.ERP5/build/unit_test/Products/ERP5Type/patches/WorkflowTool.py", line 594, in WorkflowTool_refreshWorklistCache
    assert criterion_id in table_column_id_set
AssertionError



FAIL: test_SearchedStringIsNotStripped (testERP5Catalog.TestERP5Catalog)
----------------------------------------------------------------------
Traceback (most recent call last):
  File "/usr/lib/erp5/lib/python/Testing/ZopeTestCase/profiler.py", line 98, in __call__
    testMethod()
  File "/home/buildbot/buildbot_slave/full.ERP5/build/unit_test/Products/ERP5Catalog/tests/testERP5Catalog.py", line 2715, in test_SearchedStringIsNotStripped
    compareSet(' foo', [second_doc])
  File "/home/buildbot/buildbot_slave/full.ERP5/build/unit_test/Products/ERP5Catalog/tests/testERP5Catalog.py", line 2713, in compareSet
    self.assertSameSet(document_list, [x.getObject() for x in result])
  File "/home/buildbot/buildbot_slave/full.ERP5/build/unit_test/Products/ERP5Type/tests/ERP5TypeTestCase.py", line 558, in failIfDifferentSet
    self.failUnless(i in b, msg)
AssertionError: [<Organisation at /erp5_portal_87898169f8a6babfe15e14cbf4d59bab/organisation_module/90>] != [<Organisation at /erp5_portal_87898169f8a6babfe15e14cbf4d59bab/organisation_module/89>]



FAIL: test_SubDocumentsWithAcquireLocalRoleSecurityIndexing (testERP5Catalog.TestERP5Catalog)
----------------------------------------------------------------------
Traceback (most recent call last):
  File "/usr/lib/erp5/lib/python/Testing/ZopeTestCase/profiler.py", line 98, in __call__
    testMethod()
  File "/home/buildbot/buildbot_slave/full.ERP5/build/unit_test/Products/ERP5Catalog/tests/testERP5Catalog.py", line 1974, in test_SubDocumentsWithAcquireLocalRoleSecurityIndexing
    self.assertSameSet([obj, ], [x.getObject() for x in result])
  File "/home/buildbot/buildbot_slave/full.ERP5/build/unit_test/Products/ERP5Type/tests/ERP5TypeTestCase.py", line 558, in failIfDifferentSet
    self.failUnless(i in b, msg)
AssertionError: [<Url at /erp5_portal_87898169f8a6babfe15e14cbf4d59bab/organisation_module/92/1>] != []



FAIL: test_complex_query (testERP5Catalog.TestERP5Catalog)
----------------------------------------------------------------------
Traceback (most recent call last):
  File "/usr/lib/erp5/lib/python/Testing/ZopeTestCase/profiler.py", line 98, in __call__
    testMethod()
  File "/home/buildbot/buildbot_slave/full.ERP5/build/unit_test/Products/ERP5Catalog/tests/testERP5Catalog.py", line 2261, in test_complex_query
    self.assertEqual(len(catalog(query=query)), 3)
AssertionError: 2 != 3



FAIL: test_multipleRelatedKeyDoMultipleJoins (testERP5Catalog.TestERP5Catalog)
----------------------------------------------------------------------
Traceback (most recent call last):
  File "/usr/lib/erp5/lib/python/Testing/ZopeTestCase/profiler.py", line 98, in __call__
    testMethod()
  File "/home/buildbot/buildbot_slave/full.ERP5/build/unit_test/Products/ERP5Catalog/tests/testERP5Catalog.py", line 2821, in test_multipleRelatedKeyDoMultipleJoins
    operator='AND'))
  File "/home/buildbot/buildbot_slave/full.ERP5/build/unit_test/Products/ERP5Catalog/tests/testERP5Catalog.py", line 2779, in check
    '%s:\nExpected: %r\nGot: %r' % (description,
  File "/home/buildbot/buildbot_slave/full.ERP5/build/unit_test/Products/ERP5Type/tests/ERP5TypeTestCase.py", line 558, in failIfDifferentSet
    self.failUnless(i in b, msg)
AssertionError: site_reference="foo" AND site_description="bar":
Expected: ['object_1', 'object_12', 'object_13', 'object_14', 'object_23']
Got: ['object_14', 'object_13', 'object_12', 'object_1']



FAIL: test_sortOnRelatedKeyWithUnsetRelation (testERP5Catalog.TestERP5Catalog)
----------------------------------------------------------------------
Traceback (most recent call last):
  File "/usr/lib/erp5/lib/python/Testing/ZopeTestCase/profiler.py", line 98, in __call__
    testMethod()
  File "/home/buildbot/buildbot_slave/full.ERP5/build/unit_test/Products/ERP5Catalog/tests/testERP5Catalog.py", line 2756, in test_sortOnRelatedKeyWithUnsetRelation
    len(person_module.searchFolder(sort_on=[('subordination_title', 'ascending')])))
AssertionError: 2 != 1



FAIL: test_getSingleCategoryAcquiredMembershipListOnParent (testCMFCategory.TestCMFCategory)
----------------------------------------------------------------------
Traceback (most recent call last):
  File "/usr/lib/erp5/lib/python/Testing/ZopeTestCase/profiler.py", line 98, in __call__
    testMethod()
  File "/home/buildbot/buildbot_slave/full.ERP5/build/unit_test/Products/CMFCategory/tests/testCMFCategory.py", line 973, in test_getSingleCategoryAcquiredMembershipListOnParent
    portal_type='Person Module'))
AssertionError: ['person_module'] != [<Folder at /erp5_portal_375fd2e06bb46325945c05a27d83aefb/person_module>]



More information about the Erp5-report mailing list