[Erp5-report] ERP5 r24736: 12 Tests, 0 Errors, 12 Failures

nobody at nexedi.com nobody at nexedi.com
Fri Nov 28 13:08:18 CET 2008


Date : 2008-11-28

Revision: 24736
Ran Unit test of Performance
Ran 4 tests in 2007.226s
FAILED (failures=4)

Ran Unit test of Performance
Ran 4 tests in 2008.158s
FAILED (failures=4)

Ran Unit test of Performance
Ran 4 tests in 2011.379s
FAILED (failures=4)

-------------- next part --------------
SOFTWARE_HOME: /mnt/erp5_cd/zope28/lib/python
INSTANCE_HOME: /mnt/erp5_cd/zope/unit_test
Loading Zope, please stand by .../mnt/erp5_cd/zope/unit_test/lib/python/psyco.py:3: UserWarning: psyco is disabled !
  warnings.warn('psyco is disabled !')
/mnt/erp5_cd/zope28/lib/python/Products/CMFMailIn/__init__.py:16: DeprecationWarning: The module, 'Products.CMFCore.CMFCorePermissions' is a deprecated compatiblity alias for 'Products.CMFCore.permissions';  please use the new module instead.
  from Products.CMFCore import utils, CMFCorePermissions
 done (7.259s)

Adding ERP5TypeTestCase user ... 
Adding erp5_portal_46b1242f30d521c53e744f4886ef0be0 ERP5 Site ... done (140.220s)
Adding erp5_base business template ... (imported in 40.080s) done (72.766s)
Adding erp5_ui_test business template ... (imported in 13.367s) done (27.029s)
Executing pending activities ... 299 284 73 11 22 1 done (76.056s)
Logout ... 
done (318.782s)
Ran Unit test of Performance
objective time to view object form 0.1120 < 0.4439 < 0.1220

Fnb objects = 000100
	add = 0.0070 < 0.0321 < 0.0090
	tic = 0.0260 < 0.1227 < 0.0355
	view = 0.1250 < 0.5683 < 0.1750

Ftime to view object form with many lines 0.2740 < 1.0422 < 0.2940

Ftime to view proxyfield form 0.1990 < 0.7324 < 0.2200

F
======================================================================
FAIL: test_00_viewBarObject (testPerformance.TestPerformance)
----------------------------------------------------------------------
Traceback (most recent call last):
  File "/mnt/erp5_cd/zope28/lib/python/Testing/ZopeTestCase/profiler.py", line 98, in __call__
    testMethod()
  File "/mnt/erp5_cd/zope/Products/ERP5Type/tests/testPerformance.py", line 163, in test_00_viewBarObject
    prefix='objective')
  File "/mnt/erp5_cd/zope/Products/ERP5Type/tests/testPerformance.py", line 141, in checkViewBarObject
    '%.4f < %.4f < %.4f' % (min, req_time, max))
AssertionError: 0.1120 < 0.4439 < 0.1220

======================================================================
FAIL: test_01_viewBarModule (testPerformance.TestPerformance)
----------------------------------------------------------------------
Traceback (most recent call last):
  File "/mnt/erp5_cd/zope28/lib/python/Testing/ZopeTestCase/profiler.py", line 98, in __call__
    testMethod()
  File "/mnt/erp5_cd/zope/Products/ERP5Type/tests/testPerformance.py", line 231, in test_01_viewBarModule
    'View: %.4f < %.4f < %.4f' % (
AssertionError: View: 0.1250 < 0.5683 < 0.1750

======================================================================
FAIL: test_02_viewFooObjectWithManyLines (testPerformance.TestPerformance)
----------------------------------------------------------------------
Traceback (most recent call last):
  File "/mnt/erp5_cd/zope28/lib/python/Testing/ZopeTestCase/profiler.py", line 98, in __call__
    testMethod()
  File "/mnt/erp5_cd/zope/Products/ERP5Type/tests/testPerformance.py", line 305, in test_02_viewFooObjectWithManyLines
    '%.4f < %.4f < %.4f' % (
AssertionError: 0.2740 < 1.0422 < 0.2940

======================================================================
FAIL: test_viewProxyField (testPerformance.TestPerformance)
----------------------------------------------------------------------
Traceback (most recent call last):
  File "/mnt/erp5_cd/zope28/lib/python/Testing/ZopeTestCase/profiler.py", line 98, in __call__
    testMethod()
  File "/mnt/erp5_cd/zope/Products/ERP5Type/tests/testPerformance.py", line 272, in test_viewProxyField
    '%.4f < %.4f < %.4f' % (
AssertionError: 0.1990 < 0.7324 < 0.2200

----------------------------------------------------------------------
Ran 4 tests in 2007.226s

FAILED (failures=4)
SOFTWARE_HOME: /mnt/erp5_cd/zope28/lib/python
INSTANCE_HOME: /mnt/erp5_cd/zope/unit_test
Loading Zope, please stand by .../mnt/erp5_cd/zope/unit_test/lib/python/psyco.py:3: UserWarning: psyco is disabled !
  warnings.warn('psyco is disabled !')
/mnt/erp5_cd/zope28/lib/python/Products/CMFMailIn/__init__.py:16: DeprecationWarning: The module, 'Products.CMFCore.CMFCorePermissions' is a deprecated compatiblity alias for 'Products.CMFCore.permissions';  please use the new module instead.
  from Products.CMFCore import utils, CMFCorePermissions
 done (21.811s)

Adding ERP5TypeTestCase user ... 
Adding erp5_portal_46b1242f30d521c53e744f4886ef0be0 ERP5 Site ... done (140.506s)
Adding erp5_base business template ... (imported in 40.105s) done (72.819s)
Adding erp5_ui_test business template ... (imported in 13.327s) done (27.010s)
Executing pending activities ... 299 284 73 11 22 1 done (75.901s)
Logout ... 
done (318.936s)
Ran Unit test of Performance
objective time to view object form 0.1120 < 0.4430 < 0.1220

Fnb objects = 000100
	add = 0.0070 < 0.0331 < 0.0090
	tic = 0.0260 < 0.1234 < 0.0355
	view = 0.1250 < 0.5683 < 0.1750

Ftime to view object form with many lines 0.2740 < 1.0456 < 0.2940

Ftime to view proxyfield form 0.1990 < 0.7342 < 0.2200

F
======================================================================
FAIL: test_00_viewBarObject (testPerformance.TestPerformance)
----------------------------------------------------------------------
Traceback (most recent call last):
  File "/mnt/erp5_cd/zope28/lib/python/Testing/ZopeTestCase/profiler.py", line 98, in __call__
    testMethod()
  File "/mnt/erp5_cd/zope/Products/ERP5Type/tests/testPerformance.py", line 163, in test_00_viewBarObject
    prefix='objective')
  File "/mnt/erp5_cd/zope/Products/ERP5Type/tests/testPerformance.py", line 141, in checkViewBarObject
    '%.4f < %.4f < %.4f' % (min, req_time, max))
AssertionError: 0.1120 < 0.4430 < 0.1220

======================================================================
FAIL: test_01_viewBarModule (testPerformance.TestPerformance)
----------------------------------------------------------------------
Traceback (most recent call last):
  File "/mnt/erp5_cd/zope28/lib/python/Testing/ZopeTestCase/profiler.py", line 98, in __call__
    testMethod()
  File "/mnt/erp5_cd/zope/Products/ERP5Type/tests/testPerformance.py", line 231, in test_01_viewBarModule
    'View: %.4f < %.4f < %.4f' % (
AssertionError: View: 0.1250 < 0.5683 < 0.1750

======================================================================
FAIL: test_02_viewFooObjectWithManyLines (testPerformance.TestPerformance)
----------------------------------------------------------------------
Traceback (most recent call last):
  File "/mnt/erp5_cd/zope28/lib/python/Testing/ZopeTestCase/profiler.py", line 98, in __call__
    testMethod()
  File "/mnt/erp5_cd/zope/Products/ERP5Type/tests/testPerformance.py", line 305, in test_02_viewFooObjectWithManyLines
    '%.4f < %.4f < %.4f' % (
AssertionError: 0.2740 < 1.0456 < 0.2940

======================================================================
FAIL: test_viewProxyField (testPerformance.TestPerformance)
----------------------------------------------------------------------
Traceback (most recent call last):
  File "/mnt/erp5_cd/zope28/lib/python/Testing/ZopeTestCase/profiler.py", line 98, in __call__
    testMethod()
  File "/mnt/erp5_cd/zope/Products/ERP5Type/tests/testPerformance.py", line 272, in test_viewProxyField
    '%.4f < %.4f < %.4f' % (
AssertionError: 0.1990 < 0.7342 < 0.2200

----------------------------------------------------------------------
Ran 4 tests in 2008.158s

FAILED (failures=4)
SOFTWARE_HOME: /mnt/erp5_cd/zope28/lib/python
INSTANCE_HOME: /mnt/erp5_cd/zope/unit_test
Loading Zope, please stand by .../mnt/erp5_cd/zope/unit_test/lib/python/psyco.py:3: UserWarning: psyco is disabled !
  warnings.warn('psyco is disabled !')
/mnt/erp5_cd/zope28/lib/python/Products/CMFMailIn/__init__.py:16: DeprecationWarning: The module, 'Products.CMFCore.CMFCorePermissions' is a deprecated compatiblity alias for 'Products.CMFCore.permissions';  please use the new module instead.
  from Products.CMFCore import utils, CMFCorePermissions
 done (13.875s)

Adding ERP5TypeTestCase user ... 
Adding erp5_portal_46b1242f30d521c53e744f4886ef0be0 ERP5 Site ... done (140.497s)
Adding erp5_base business template ... (imported in 40.241s) done (72.977s)
Adding erp5_ui_test business template ... (imported in 13.277s) done (27.110s)
Executing pending activities ... 299 284 73 11 22 1 done (76.527s)
Logout ... 
done (319.838s)
Ran Unit test of Performance
objective time to view object form 0.1120 < 0.4440 < 0.1220

Fnb objects = 000100
	add = 0.0070 < 0.0321 < 0.0090
	tic = 0.0260 < 0.1223 < 0.0355
	view = 0.1250 < 0.5691 < 0.1750

Ftime to view object form with many lines 0.2740 < 1.0477 < 0.2940

Ftime to view proxyfield form 0.1990 < 0.7371 < 0.2200

F
======================================================================
FAIL: test_00_viewBarObject (testPerformance.TestPerformance)
----------------------------------------------------------------------
Traceback (most recent call last):
  File "/mnt/erp5_cd/zope28/lib/python/Testing/ZopeTestCase/profiler.py", line 98, in __call__
    testMethod()
  File "/mnt/erp5_cd/zope/Products/ERP5Type/tests/testPerformance.py", line 163, in test_00_viewBarObject
    prefix='objective')
  File "/mnt/erp5_cd/zope/Products/ERP5Type/tests/testPerformance.py", line 141, in checkViewBarObject
    '%.4f < %.4f < %.4f' % (min, req_time, max))
AssertionError: 0.1120 < 0.4440 < 0.1220

======================================================================
FAIL: test_01_viewBarModule (testPerformance.TestPerformance)
----------------------------------------------------------------------
Traceback (most recent call last):
  File "/mnt/erp5_cd/zope28/lib/python/Testing/ZopeTestCase/profiler.py", line 98, in __call__
    testMethod()
  File "/mnt/erp5_cd/zope/Products/ERP5Type/tests/testPerformance.py", line 231, in test_01_viewBarModule
    'View: %.4f < %.4f < %.4f' % (
AssertionError: View: 0.1250 < 0.5691 < 0.1750

======================================================================
FAIL: test_02_viewFooObjectWithManyLines (testPerformance.TestPerformance)
----------------------------------------------------------------------
Traceback (most recent call last):
  File "/mnt/erp5_cd/zope28/lib/python/Testing/ZopeTestCase/profiler.py", line 98, in __call__
    testMethod()
  File "/mnt/erp5_cd/zope/Products/ERP5Type/tests/testPerformance.py", line 305, in test_02_viewFooObjectWithManyLines
    '%.4f < %.4f < %.4f' % (
AssertionError: 0.2740 < 1.0477 < 0.2940

======================================================================
FAIL: test_viewProxyField (testPerformance.TestPerformance)
----------------------------------------------------------------------
Traceback (most recent call last):
  File "/mnt/erp5_cd/zope28/lib/python/Testing/ZopeTestCase/profiler.py", line 98, in __call__
    testMethod()
  File "/mnt/erp5_cd/zope/Products/ERP5Type/tests/testPerformance.py", line 272, in test_viewProxyField
    '%.4f < %.4f < %.4f' % (
AssertionError: 0.1990 < 0.7371 < 0.2200

----------------------------------------------------------------------
Ran 4 tests in 2011.379s

FAILED (failures=4)


More information about the Erp5-report mailing list