[Erp5-report] ERP5 r23720: 9 Tests, 0 Errors, 6 Failures

nobody at nexedi.com nobody at nexedi.com
Sat Sep 20 15:54:07 CEST 2008


Date : 2008-09-20

Revision: 23720
Ran Unit test of Performance
Ran 3 tests in 457.834s
FAILED (failures=2)

Ran Unit test of Performance
Ran 3 tests in 448.132s
FAILED (failures=2)

Ran Unit test of Performance
Ran 3 tests in 445.351s
FAILED (failures=2)

-------------- next part --------------
SOFTWARE_HOME: /initrd/loopfs/usr/lib/zope/lib/python
INSTANCE_HOME: /mnt/erp5_cd/zope/unit_test
Loading Zope, please stand by ./usr/lib/python2.4/whrandom.py:38: DeprecationWarning: the whrandom module is deprecated; please use the random module
  DeprecationWarning)
../mnt/erp5_cd/zope/unit_test/lib/python/psyco.py:3: UserWarning: psyco is disabled !
  warnings.warn('psyco is disabled !')
/usr/lib/zope/lib/python/Products/CMFMailIn/__init__.py:16: DeprecationWarning: The module, 'Products.CMFCore.CMFCorePermissions' is a deprecated compatiblity alias for 'Products.CMFCore.permissions';  please use the new module instead.
  from Products.CMFCore import utils, CMFCorePermissions
 done (6.487s)

Adding ERP5TypeTestCase user ... 
Adding erp5_portal_46b1242f30d521c53e744f4886ef0be0 ERP5 Site ... ERROR:PortalTransforms:Cannot register transform w3m_dump, using BrokenTransform: Error
 Unable to find binary "w3m" in /usr/local/bin:/bin:/usr/bin:/usr/X11R6/bin:/usr/lib/qt3//bin:/usr/lib/qt3//bin:/mnt/erp5_cd/odfpy
ERROR:PortalTransforms:Cannot register transform w3m_dump, using BrokenTransform: Error
 Unable to find binary "w3m" in /usr/local/bin:/bin:/usr/bin:/usr/X11R6/bin:/usr/lib/qt3//bin:/usr/lib/qt3//bin:/mnt/erp5_cd/odfpy
done (32.016s)
Adding erp5_base business template ... (imported in 17.091s) done (23.062s)
Adding erp5_ui_test business template ... (imported in 4.811s) done (8.012s)
Executing pending activities ... 292 276 72 9 15 1 done (17.579s)
Logout ... 
done (81.382s)
Ran Unit test of Performance
objective time to view object form 0.1120 < 0.1231 < 0.1220

Fnb objects = 000100
	add = 0.0070 < 0.0085 < 0.0090
	tic = 0.0260 < 0.0345 < 0.0355
	view = 0.1250 < 0.1571 < 0.1750

nb objects = 000200
	add = 0.0070 < 0.0085 < 0.0090
	tic = 0.0260 < 0.0349 < 0.0355
	view = 0.1497 < 0.1745 < 0.1997

nb objects = 000300
	add = 0.0070 < 0.0085 < 0.0090
	tic = 0.0260 < 0.0347 < 0.0355
	view = 0.1744 < 0.1942 < 0.2244

nb objects = 000400
	add = 0.0070 < 0.0085 < 0.0090
	tic = 0.0260 < 0.0344 < 0.0355
	view = 0.1992 < 0.2173 < 0.2492

nb objects = 000500
	add = 0.0070 < 0.0085 < 0.0090
	tic = 0.0260 < 0.0346 < 0.0355
	view = 0.2239 < 0.2396 < 0.2739

nb objects = 000600
	add = 0.0070 < 0.0085 < 0.0090
	tic = 0.0260 < 0.0347 < 0.0355
	view = 0.2486 < 0.2621 < 0.2986

nb objects = 000700
	add = 0.0070 < 0.0085 < 0.0090
	tic = 0.0260 < 0.0345 < 0.0355
	view = 0.2733 < 0.2852 < 0.3233

nb objects = 000800
	add = 0.0070 < 0.0085 < 0.0090
	tic = 0.0260 < 0.0345 < 0.0355
	view = 0.2980 < 0.3080 < 0.3480

nb objects = 000900
	add = 0.0070 < 0.0085 < 0.0090
	tic = 0.0260 < 0.0348 < 0.0355
	view = 0.3228 < 0.3297 < 0.3728

nb objects = 001000
	add = 0.0070 < 0.0085 < 0.0090
	tic = 0.0260 < 0.0346 < 0.0355
	view = 0.3475 < 0.3534 < 0.3975

.time to view proxyfield form 0.2390 < 0.2490 < 0.2490

F
======================================================================
FAIL: test_00_viewBarObject (testPerformance.TestPerformance)
----------------------------------------------------------------------
Traceback (most recent call last):
  File "/usr/lib/zope/lib/python/Testing/ZopeTestCase/profiler.py", line 80, in __call__
    testMethod()
  File "/mnt/erp5_cd/zope/Products/ERP5Type/tests/testPerformance.py", line 143, in test_00_viewBarObject
    prefix='objective')
  File "/mnt/erp5_cd/zope/Products/ERP5Type/tests/testPerformance.py", line 131, in checkViewBarObject
    '%.4f < %.4f < %.4f' % (min, req_time, max))
AssertionError: 0.1120 < 0.1231 < 0.1220

======================================================================
FAIL: test_viewProxyField (testPerformance.TestPerformance)
----------------------------------------------------------------------
Traceback (most recent call last):
  File "/usr/lib/zope/lib/python/Testing/ZopeTestCase/profiler.py", line 80, in __call__
    testMethod()
  File "/mnt/erp5_cd/zope/Products/ERP5Type/tests/testPerformance.py", line 250, in test_viewProxyField
    '%.4f < %.4f < %.4f' % (
AssertionError: 0.2390 < 0.2490 < 0.2490

----------------------------------------------------------------------
Ran 3 tests in 457.834s

FAILED (failures=2)
SOFTWARE_HOME: /initrd/loopfs/usr/lib/zope/lib/python
INSTANCE_HOME: /mnt/erp5_cd/zope/unit_test
Loading Zope, please stand by ./usr/lib/python2.4/whrandom.py:38: DeprecationWarning: the whrandom module is deprecated; please use the random module
  DeprecationWarning)
../mnt/erp5_cd/zope/unit_test/lib/python/psyco.py:3: UserWarning: psyco is disabled !
  warnings.warn('psyco is disabled !')
/usr/lib/zope/lib/python/Products/CMFMailIn/__init__.py:16: DeprecationWarning: The module, 'Products.CMFCore.CMFCorePermissions' is a deprecated compatiblity alias for 'Products.CMFCore.permissions';  please use the new module instead.
  from Products.CMFCore import utils, CMFCorePermissions
 done (7.582s)

Adding ERP5TypeTestCase user ... 
Adding erp5_portal_46b1242f30d521c53e744f4886ef0be0 ERP5 Site ... ERROR:PortalTransforms:Cannot register transform w3m_dump, using BrokenTransform: Error
 Unable to find binary "w3m" in /usr/local/bin:/bin:/usr/bin:/usr/X11R6/bin:/usr/lib/qt3//bin:/usr/lib/qt3//bin:/mnt/erp5_cd/odfpy
ERROR:PortalTransforms:Cannot register transform w3m_dump, using BrokenTransform: Error
 Unable to find binary "w3m" in /usr/local/bin:/bin:/usr/bin:/usr/X11R6/bin:/usr/lib/qt3//bin:/usr/lib/qt3//bin:/mnt/erp5_cd/odfpy
done (28.148s)
Adding erp5_base business template ... (imported in 9.661s) done (15.664s)
Adding erp5_ui_test business template ... (imported in 3.709s) done (6.933s)
Executing pending activities ... 292 276 72 9 15 1 done (17.892s)
Logout ... 
done (69.322s)
Ran Unit test of Performance
objective time to view object form 0.1120 < 0.1231 < 0.1220

Fnb objects = 000100
	add = 0.0070 < 0.0086 < 0.0090
	tic = 0.0260 < 0.0348 < 0.0355
	view = 0.1250 < 0.1578 < 0.1750

nb objects = 000200
	add = 0.0070 < 0.0086 < 0.0090
	tic = 0.0260 < 0.0353 < 0.0355
	view = 0.1497 < 0.1751 < 0.1997

nb objects = 000300
	add = 0.0070 < 0.0086 < 0.0090
	tic = 0.0260 < 0.0350 < 0.0355
	view = 0.1744 < 0.1948 < 0.2244

nb objects = 000400
	add = 0.0070 < 0.0086 < 0.0090
	tic = 0.0260 < 0.0349 < 0.0355
	view = 0.1992 < 0.2181 < 0.2492

nb objects = 000500
	add = 0.0070 < 0.0086 < 0.0090
	tic = 0.0260 < 0.0353 < 0.0355
	view = 0.2239 < 0.2411 < 0.2739

nb objects = 000600
	add = 0.0070 < 0.0087 < 0.0090
	tic = 0.0260 < 0.0351 < 0.0355
	view = 0.2486 < 0.2637 < 0.2986

nb objects = 000700
	add = 0.0070 < 0.0086 < 0.0090
	tic = 0.0260 < 0.0353 < 0.0355
	view = 0.2733 < 0.2867 < 0.3233

nb objects = 000800
	add = 0.0070 < 0.0086 < 0.0090
	tic = 0.0260 < 0.0350 < 0.0355
	view = 0.2980 < 0.3093 < 0.3480

nb objects = 000900
	add = 0.0070 < 0.0086 < 0.0090
	tic = 0.0260 < 0.0353 < 0.0355
	view = 0.3228 < 0.3317 < 0.3728

nb objects = 001000
	add = 0.0070 < 0.0086 < 0.0090
	tic = 0.0260 < 0.0353 < 0.0355
	view = 0.3475 < 0.3546 < 0.3975

.time to view proxyfield form 0.2390 < 0.2495 < 0.2490

F
======================================================================
FAIL: test_00_viewBarObject (testPerformance.TestPerformance)
----------------------------------------------------------------------
Traceback (most recent call last):
  File "/usr/lib/zope/lib/python/Testing/ZopeTestCase/profiler.py", line 80, in __call__
    testMethod()
  File "/mnt/erp5_cd/zope/Products/ERP5Type/tests/testPerformance.py", line 143, in test_00_viewBarObject
    prefix='objective')
  File "/mnt/erp5_cd/zope/Products/ERP5Type/tests/testPerformance.py", line 131, in checkViewBarObject
    '%.4f < %.4f < %.4f' % (min, req_time, max))
AssertionError: 0.1120 < 0.1231 < 0.1220

======================================================================
FAIL: test_viewProxyField (testPerformance.TestPerformance)
----------------------------------------------------------------------
Traceback (most recent call last):
  File "/usr/lib/zope/lib/python/Testing/ZopeTestCase/profiler.py", line 80, in __call__
    testMethod()
  File "/mnt/erp5_cd/zope/Products/ERP5Type/tests/testPerformance.py", line 250, in test_viewProxyField
    '%.4f < %.4f < %.4f' % (
AssertionError: 0.2390 < 0.2495 < 0.2490

----------------------------------------------------------------------
Ran 3 tests in 448.132s

FAILED (failures=2)
SOFTWARE_HOME: /initrd/loopfs/usr/lib/zope/lib/python
INSTANCE_HOME: /mnt/erp5_cd/zope/unit_test
Loading Zope, please stand by ./usr/lib/python2.4/whrandom.py:38: DeprecationWarning: the whrandom module is deprecated; please use the random module
  DeprecationWarning)
../mnt/erp5_cd/zope/unit_test/lib/python/psyco.py:3: UserWarning: psyco is disabled !
  warnings.warn('psyco is disabled !')
/usr/lib/zope/lib/python/Products/CMFMailIn/__init__.py:16: DeprecationWarning: The module, 'Products.CMFCore.CMFCorePermissions' is a deprecated compatiblity alias for 'Products.CMFCore.permissions';  please use the new module instead.
  from Products.CMFCore import utils, CMFCorePermissions
 done (1.698s)

Adding ERP5TypeTestCase user ... 
Adding erp5_portal_46b1242f30d521c53e744f4886ef0be0 ERP5 Site ... ERROR:PortalTransforms:Cannot register transform w3m_dump, using BrokenTransform: Error
 Unable to find binary "w3m" in /usr/local/bin:/bin:/usr/bin:/usr/X11R6/bin:/usr/lib/qt3//bin:/usr/lib/qt3//bin:/mnt/erp5_cd/odfpy
ERROR:PortalTransforms:Cannot register transform w3m_dump, using BrokenTransform: Error
 Unable to find binary "w3m" in /usr/local/bin:/bin:/usr/bin:/usr/X11R6/bin:/usr/lib/qt3//bin:/usr/lib/qt3//bin:/mnt/erp5_cd/odfpy
done (27.331s)
Adding erp5_base business template ... (imported in 9.622s) done (15.592s)
Adding erp5_ui_test business template ... (imported in 3.690s) done (6.902s)
Executing pending activities ... 292 276 72 9 15 1 done (18.223s)
Logout ... 
done (68.721s)
Ran Unit test of Performance
objective time to view object form 0.1120 < 0.1231 < 0.1220

Fnb objects = 000100
	add = 0.0070 < 0.0086 < 0.0090
	tic = 0.0260 < 0.0349 < 0.0355
	view = 0.1250 < 0.1571 < 0.1750

nb objects = 000200
	add = 0.0070 < 0.0085 < 0.0090
	tic = 0.0260 < 0.0352 < 0.0355
	view = 0.1497 < 0.1745 < 0.1997

nb objects = 000300
	add = 0.0070 < 0.0086 < 0.0090
	tic = 0.0260 < 0.0348 < 0.0355
	view = 0.1744 < 0.1935 < 0.2244

nb objects = 000400
	add = 0.0070 < 0.0086 < 0.0090
	tic = 0.0260 < 0.0350 < 0.0355
	view = 0.1992 < 0.2169 < 0.2492

nb objects = 000500
	add = 0.0070 < 0.0086 < 0.0090
	tic = 0.0260 < 0.0352 < 0.0355
	view = 0.2239 < 0.2395 < 0.2739

nb objects = 000600
	add = 0.0070 < 0.0085 < 0.0090
	tic = 0.0260 < 0.0347 < 0.0355
	view = 0.2486 < 0.2618 < 0.2986

nb objects = 000700
	add = 0.0070 < 0.0086 < 0.0090
	tic = 0.0260 < 0.0350 < 0.0355
	view = 0.2733 < 0.2853 < 0.3233

nb objects = 000800
	add = 0.0070 < 0.0086 < 0.0090
	tic = 0.0260 < 0.0348 < 0.0355
	view = 0.2980 < 0.3073 < 0.3480

nb objects = 000900
	add = 0.0070 < 0.0085 < 0.0090
	tic = 0.0260 < 0.0350 < 0.0355
	view = 0.3228 < 0.3297 < 0.3728

nb objects = 001000
	add = 0.0070 < 0.0086 < 0.0090
	tic = 0.0260 < 0.0347 < 0.0355
	view = 0.3475 < 0.3530 < 0.3975

.time to view proxyfield form 0.2390 < 0.2496 < 0.2490

F
======================================================================
FAIL: test_00_viewBarObject (testPerformance.TestPerformance)
----------------------------------------------------------------------
Traceback (most recent call last):
  File "/usr/lib/zope/lib/python/Testing/ZopeTestCase/profiler.py", line 80, in __call__
    testMethod()
  File "/mnt/erp5_cd/zope/Products/ERP5Type/tests/testPerformance.py", line 143, in test_00_viewBarObject
    prefix='objective')
  File "/mnt/erp5_cd/zope/Products/ERP5Type/tests/testPerformance.py", line 131, in checkViewBarObject
    '%.4f < %.4f < %.4f' % (min, req_time, max))
AssertionError: 0.1120 < 0.1231 < 0.1220

======================================================================
FAIL: test_viewProxyField (testPerformance.TestPerformance)
----------------------------------------------------------------------
Traceback (most recent call last):
  File "/usr/lib/zope/lib/python/Testing/ZopeTestCase/profiler.py", line 80, in __call__
    testMethod()
  File "/mnt/erp5_cd/zope/Products/ERP5Type/tests/testPerformance.py", line 250, in test_viewProxyField
    '%.4f < %.4f < %.4f' % (
AssertionError: 0.2390 < 0.2496 < 0.2490

----------------------------------------------------------------------
Ran 3 tests in 445.351s

FAILED (failures=2)


More information about the Erp5-report mailing list