[Erp5-report] ERP5 r22929: 9 Tests, 0 Errors, 1 Failures

nobody at nexedi.com nobody at nexedi.com
Thu Aug 7 16:07:44 CEST 2008


Date : 2008-08-07

Revision: 22929
Ran Unit test of Performance
Ran 3 tests in 462.715s
FAILED (failures=1)

Ran Unit test of Performance
Ran 3 tests in 461.225s
OK

Ran Unit test of Performance
Ran 3 tests in 461.492s
OK

-------------- next part --------------
SOFTWARE_HOME: /initrd/loopfs/usr/lib/zope/lib/python
INSTANCE_HOME: /mnt/erp5_cd/zope/unit_test
Loading Zope, please stand by ./usr/lib/python2.4/whrandom.py:38: DeprecationWarning: the whrandom module is deprecated; please use the random module
  DeprecationWarning)
../mnt/erp5_cd/zope/unit_test/lib/python/psyco.py:3: UserWarning: psyco is disabled !
  warnings.warn('psyco is disabled !')
/usr/lib/zope/lib/python/Products/CMFMailIn/__init__.py:16: DeprecationWarning: The module, 'Products.CMFCore.CMFCorePermissions' is a deprecated compatiblity alias for 'Products.CMFCore.permissions';  please use the new module instead.
  from Products.CMFCore import utils, CMFCorePermissions
 done (2.301s)

Adding ERP5TypeTestCase user ... 
Adding erp5_portal_46b1242f30d521c53e744f4886ef0be0 ERP5 Site ... ERROR:PortalTransforms:Cannot register transform w3m_dump, using BrokenTransform: Error
 Unable to find binary "w3m" in /usr/local/bin:/bin:/usr/bin:/usr/X11R6/bin:/usr/lib/qt3//bin:/usr/lib/qt3//bin:/mnt/erp5_cd/odfpy
ERROR:PortalTransforms:Cannot register transform w3m_dump, using BrokenTransform: Error
 Unable to find binary "w3m" in /usr/local/bin:/bin:/usr/bin:/usr/X11R6/bin:/usr/lib/qt3//bin:/usr/lib/qt3//bin:/mnt/erp5_cd/odfpy
done (30.185s)
Adding erp5_base business template ... (imported in 7.439s) done (12.564s)
Adding erp5_ui_test business template ... (imported in 3.766s) done (7.283s)
Executing pending activities ... 555 299 70 9 15 1 done (35.361s)
Logout ... 
done (86.476s)
Ran Unit test of Performance
objective time to view object form 0.1120 < 0.1219 < 0.1220

.nb objects = 000100
	add = 0.0070 < 0.0086 < 0.0090
	tic = 0.0260 < 0.0348 < 0.0355
	view = 0.1250 < 0.1556 < 0.1750

nb objects = 000200
	add = 0.0070 < 0.0085 < 0.0090
	tic = 0.0260 < 0.0354 < 0.0355
	view = 0.1497 < 0.1729 < 0.1997

nb objects = 000300
	add = 0.0070 < 0.0086 < 0.0090
	tic = 0.0260 < 0.0348 < 0.0355
	view = 0.1744 < 0.1931 < 0.2244

nb objects = 000400
	add = 0.0070 < 0.0086 < 0.0090
	tic = 0.0260 < 0.0349 < 0.0355
	view = 0.1992 < 0.2162 < 0.2492

nb objects = 000500
	add = 0.0070 < 0.0086 < 0.0090
	tic = 0.0260 < 0.0352 < 0.0355
	view = 0.2239 < 0.2389 < 0.2739

nb objects = 000600
	add = 0.0070 < 0.0086 < 0.0090
	tic = 0.0260 < 0.0350 < 0.0355
	view = 0.2486 < 0.2616 < 0.2986

nb objects = 000700
	add = 0.0070 < 0.0085 < 0.0090
	tic = 0.0260 < 0.0350 < 0.0355
	view = 0.2733 < 0.2847 < 0.3233

nb objects = 000800
	add = 0.0070 < 0.0086 < 0.0090
	tic = 0.0260 < 0.0349 < 0.0355
	view = 0.2980 < 0.3072 < 0.3480

nb objects = 000900
	add = 0.0070 < 0.0086 < 0.0090
	tic = 0.0260 < 0.0354 < 0.0355
	view = 0.3228 < 0.3295 < 0.3728

nb objects = 001000
	add = 0.0070 < 0.0085 < 0.0090
	tic = 0.0260 < 0.0349 < 0.0355
	view = 0.3475 < 0.3526 < 0.3975

.time to view proxyfield form 0.2390 < 0.2495 < 0.2490

F
======================================================================
FAIL: test_viewProxyField (testPerformance.TestPerformance)
----------------------------------------------------------------------
Traceback (most recent call last):
  File "/usr/lib/zope/lib/python/Testing/ZopeTestCase/profiler.py", line 80, in __call__
    testMethod()
  File "/mnt/erp5_cd/zope/Products/ERP5Type/tests/testPerformance.py", line 250, in test_viewProxyField
    '%.4f < %.4f < %.4f' % (
AssertionError: 0.2390 < 0.2495 < 0.2490

----------------------------------------------------------------------
Ran 3 tests in 462.715s

FAILED (failures=1)
SOFTWARE_HOME: /initrd/loopfs/usr/lib/zope/lib/python
INSTANCE_HOME: /mnt/erp5_cd/zope/unit_test
Loading Zope, please stand by ./usr/lib/python2.4/whrandom.py:38: DeprecationWarning: the whrandom module is deprecated; please use the random module
  DeprecationWarning)
../mnt/erp5_cd/zope/unit_test/lib/python/psyco.py:3: UserWarning: psyco is disabled !
  warnings.warn('psyco is disabled !')
/usr/lib/zope/lib/python/Products/CMFMailIn/__init__.py:16: DeprecationWarning: The module, 'Products.CMFCore.CMFCorePermissions' is a deprecated compatiblity alias for 'Products.CMFCore.permissions';  please use the new module instead.
  from Products.CMFCore import utils, CMFCorePermissions
 done (2.418s)

Adding ERP5TypeTestCase user ... 
Adding erp5_portal_46b1242f30d521c53e744f4886ef0be0 ERP5 Site ... ERROR:PortalTransforms:Cannot register transform w3m_dump, using BrokenTransform: Error
 Unable to find binary "w3m" in /usr/local/bin:/bin:/usr/bin:/usr/X11R6/bin:/usr/lib/qt3//bin:/usr/lib/qt3//bin:/mnt/erp5_cd/odfpy
ERROR:PortalTransforms:Cannot register transform w3m_dump, using BrokenTransform: Error
 Unable to find binary "w3m" in /usr/local/bin:/bin:/usr/bin:/usr/X11R6/bin:/usr/lib/qt3//bin:/usr/lib/qt3//bin:/mnt/erp5_cd/odfpy
done (29.991s)
Adding erp5_base business template ... (imported in 7.419s) done (12.525s)
Adding erp5_ui_test business template ... (imported in 3.776s) done (7.280s)
Executing pending activities ... 555 299 70 9 15 1 done (33.993s)
Logout ... 
done (84.600s)
Ran Unit test of Performance
objective time to view object form 0.1120 < 0.1215 < 0.1220

.nb objects = 000100
	add = 0.0070 < 0.0086 < 0.0090
	tic = 0.0260 < 0.0352 < 0.0355
	view = 0.1250 < 0.1558 < 0.1750

nb objects = 000200
	add = 0.0070 < 0.0085 < 0.0090
	tic = 0.0260 < 0.0353 < 0.0355
	view = 0.1497 < 0.1733 < 0.1997

nb objects = 000300
	add = 0.0070 < 0.0085 < 0.0090
	tic = 0.0260 < 0.0352 < 0.0355
	view = 0.1744 < 0.1933 < 0.2244

nb objects = 000400
	add = 0.0070 < 0.0086 < 0.0090
	tic = 0.0260 < 0.0350 < 0.0355
	view = 0.1992 < 0.2165 < 0.2492

nb objects = 000500
	add = 0.0070 < 0.0086 < 0.0090
	tic = 0.0260 < 0.0352 < 0.0355
	view = 0.2239 < 0.2389 < 0.2739

nb objects = 000600
	add = 0.0070 < 0.0085 < 0.0090
	tic = 0.0260 < 0.0349 < 0.0355
	view = 0.2486 < 0.2616 < 0.2986

nb objects = 000700
	add = 0.0070 < 0.0085 < 0.0090
	tic = 0.0260 < 0.0351 < 0.0355
	view = 0.2733 < 0.2851 < 0.3233

nb objects = 000800
	add = 0.0070 < 0.0086 < 0.0090
	tic = 0.0260 < 0.0353 < 0.0355
	view = 0.2980 < 0.3080 < 0.3480

nb objects = 000900
	add = 0.0070 < 0.0086 < 0.0090
	tic = 0.0260 < 0.0350 < 0.0355
	view = 0.3228 < 0.3305 < 0.3728

nb objects = 001000
	add = 0.0070 < 0.0085 < 0.0090
	tic = 0.0260 < 0.0349 < 0.0355
	view = 0.3475 < 0.3539 < 0.3975

.time to view proxyfield form 0.2390 < 0.2480 < 0.2490

.
----------------------------------------------------------------------
Ran 3 tests in 461.225s

OK
SOFTWARE_HOME: /initrd/loopfs/usr/lib/zope/lib/python
INSTANCE_HOME: /mnt/erp5_cd/zope/unit_test
Loading Zope, please stand by ./usr/lib/python2.4/whrandom.py:38: DeprecationWarning: the whrandom module is deprecated; please use the random module
  DeprecationWarning)
../mnt/erp5_cd/zope/unit_test/lib/python/psyco.py:3: UserWarning: psyco is disabled !
  warnings.warn('psyco is disabled !')
/usr/lib/zope/lib/python/Products/CMFMailIn/__init__.py:16: DeprecationWarning: The module, 'Products.CMFCore.CMFCorePermissions' is a deprecated compatiblity alias for 'Products.CMFCore.permissions';  please use the new module instead.
  from Products.CMFCore import utils, CMFCorePermissions
 done (1.682s)

Adding ERP5TypeTestCase user ... 
Adding erp5_portal_46b1242f30d521c53e744f4886ef0be0 ERP5 Site ... ERROR:PortalTransforms:Cannot register transform w3m_dump, using BrokenTransform: Error
 Unable to find binary "w3m" in /usr/local/bin:/bin:/usr/bin:/usr/X11R6/bin:/usr/lib/qt3//bin:/usr/lib/qt3//bin:/mnt/erp5_cd/odfpy
ERROR:PortalTransforms:Cannot register transform w3m_dump, using BrokenTransform: Error
 Unable to find binary "w3m" in /usr/local/bin:/bin:/usr/bin:/usr/X11R6/bin:/usr/lib/qt3//bin:/usr/lib/qt3//bin:/mnt/erp5_cd/odfpy
done (29.941s)
Adding erp5_base business template ... (imported in 7.445s) done (12.574s)
Adding erp5_ui_test business template ... (imported in 3.797s) done (7.307s)
Executing pending activities ... 555 299 70 9 15 1 done (33.919s)
Logout ... 
done (84.555s)
Ran Unit test of Performance
objective time to view object form 0.1120 < 0.1217 < 0.1220

.nb objects = 000100
	add = 0.0070 < 0.0088 < 0.0090
	tic = 0.0260 < 0.0353 < 0.0355
	view = 0.1250 < 0.1559 < 0.1750

nb objects = 000200
	add = 0.0070 < 0.0086 < 0.0090
	tic = 0.0260 < 0.0353 < 0.0355
	view = 0.1497 < 0.1731 < 0.1997

nb objects = 000300
	add = 0.0070 < 0.0086 < 0.0090
	tic = 0.0260 < 0.0350 < 0.0355
	view = 0.1744 < 0.1935 < 0.2244

nb objects = 000400
	add = 0.0070 < 0.0086 < 0.0090
	tic = 0.0260 < 0.0352 < 0.0355
	view = 0.1992 < 0.2165 < 0.2492

nb objects = 000500
	add = 0.0070 < 0.0086 < 0.0090
	tic = 0.0260 < 0.0350 < 0.0355
	view = 0.2239 < 0.2393 < 0.2739

nb objects = 000600
	add = 0.0070 < 0.0086 < 0.0090
	tic = 0.0260 < 0.0350 < 0.0355
	view = 0.2486 < 0.2624 < 0.2986

nb objects = 000700
	add = 0.0070 < 0.0086 < 0.0090
	tic = 0.0260 < 0.0353 < 0.0355
	view = 0.2733 < 0.2850 < 0.3233

nb objects = 000800
	add = 0.0070 < 0.0086 < 0.0090
	tic = 0.0260 < 0.0351 < 0.0355
	view = 0.2980 < 0.3084 < 0.3480

nb objects = 000900
	add = 0.0070 < 0.0086 < 0.0090
	tic = 0.0260 < 0.0353 < 0.0355
	view = 0.3228 < 0.3308 < 0.3728

nb objects = 001000
	add = 0.0070 < 0.0086 < 0.0090
	tic = 0.0260 < 0.0349 < 0.0355
	view = 0.3475 < 0.3541 < 0.3975

.time to view proxyfield form 0.2390 < 0.2486 < 0.2490

.
----------------------------------------------------------------------
Ran 3 tests in 461.492s

OK


More information about the Erp5-report mailing list