[Erp5-report] ERP5_z28 r19567: 1361 Tests, 5 Errors, 39 Failures

nobody at svn.erp5.org nobody at svn.erp5.org
Fri Feb 29 10:50:45 CET 2008


Test Suite: ERP5_z28
Revision: 19567
Result: FAIL

All tests: 1361
Failures: 39
Errors: 5


The following tests failed:

  testXHTML                                          (3 errors)
   testApparel ComponentResource_viewDefaultSupplyLine (testXHTML.TestXHTML)
   testApparel FabricResource_viewDefaultSupplyLine (testXHTML.TestXHTML)
   testApparel ModelResource_viewDefaultSupplyLine (testXHTML.TestXHTML)

  testAccountingRules                                (10 failures)
   Simple Invoice.
   Same test as SimpleInvoice but directly confirm the invoice
   Simple Invoice, 2 lines.
   Simple Invoice, 2 cells.
   Add a new line then updateAppliedRule.
   Tests that editing a line updates simulation correctly
   Tests that removing a line updates simulation correctly
   Tests that replacing a line by cells updates simulation correctly
   Tests that updating an applied rule many times doesn't break the
   Multiple lines invoice.

  testDomainTool                                     (2 failures)
   test_01_SearchPredidateListWithNoTest (testDomainTool.TestDomainTool)
   test_02_SearchPredidateListWithTest (testDomainTool.TestDomainTool)

  testProductionOrder                                (3 failures)
   test_01_testProductionSimulationExpand (testProductionOrder.TestProductionOrder)
   test_02_testSourcingSimulationExpand (testProductionOrder.TestProductionOrder)
   test_03_testIndustrialPhase (testProductionOrder.TestProductionOrder)

  testInvoice                                        (1 failures, 16 errors)
   test_invoice_transaction_line_resource (testInvoice.TestInvoice)
   test_01_SimpleInvoice (testInvoice.TestInvoice)
   test_02_TwoInvoicesFromTwoPackingList (testInvoice.TestInvoice)
   test_03_InvoiceEditAndInvoiceRule (testInvoice.TestInvoice)
   test_05_InvoiceEditPackingListLine (testInvoice.TestInvoice)
   test_06_InvoiceDeletePackingListLine (testInvoice.TestInvoice)
   test_07_InvoiceAddPackingListLine (testInvoice.TestInvoice)
   test_08_InvoiceDecreaseQuantity (testInvoice.TestInvoice)
   test_09_InvoiceChangeStartDateFail (testInvoice.TestInvoice)
   test_09b_InvoiceChangeStartDateSucceed (testInvoice.TestInvoice)
   test_10_AcceptDecisionOnPackingList (testInvoice.TestInvoice)
   test_11_AcceptDecisionOnPackingListAndInvoice (testInvoice.TestInvoice)
   test_12_SplitPackingListAndAcceptInvoice (testInvoice.TestInvoice)
   test_13_SplitAndDeferInvoice (testInvoice.TestInvoice)
   test_14_AcceptDecisionOnInvoice (testInvoice.TestInvoice)
   test_16_ManuallyAddedMovements (testInvoice.TestInvoice)
   test_17_ManuallyAddedWrongMovements (testInvoice.TestInvoice)

  testInvoiceVAT                                     (4 failures)
   Test VAT for an invoice that cames from a packing list with two
   Test VAT for an invoice that cames from a packing list with two
   Test VAT for a simple invoice created directly.
   Test VAT for a simple invoice created directly; empty lines should not

  testERP5Type                                       (1 failures)
   test_translated_accessors (testERP5Type.TestERP5Type)

  testDms                                            (1 failures)
   test_08_EmbeddedDocumentState (testDms.TestDocument)

  testERP5Catalog                                    (1 failures)
   test_complex_query (testERP5Catalog.TestERP5Catalog)

  testDeferredConnection                             (1 failures)
   test_02_disconnectionRobustness (testDeferredConnection.TestDeferredConnection)

  testERP5SyncMLVCard                                (1 errors)
   test_05_basicVCardSynchronization (testERP5SyncMLVCard.TestERP5SyncMLVCard)
-------------- next part --------------

ERROR: testApparel ComponentResource_viewDefaultSupplyLine (testXHTML.TestXHTML)
----------------------------------------------------------------------
Traceback (most recent call last):
  File "/usr/lib/erp5/lib/python/Testing/ZopeTestCase/profiler.py", line 98, in __call__
    testMethod()
  File "/home/buildbot/buildbot_slave/full.Zelenium/build/unit_test/Products/ERP5/tests/testXHTML.py", line 156, in testMethod
    view = getattr(content, view_name)
AttributeError: Resource_viewDefaultSupplyLine



ERROR: testApparel FabricResource_viewDefaultSupplyLine (testXHTML.TestXHTML)
----------------------------------------------------------------------
Traceback (most recent call last):
  File "/usr/lib/erp5/lib/python/Testing/ZopeTestCase/profiler.py", line 98, in __call__
    testMethod()
  File "/home/buildbot/buildbot_slave/full.Zelenium/build/unit_test/Products/ERP5/tests/testXHTML.py", line 156, in testMethod
    view = getattr(content, view_name)
AttributeError: Resource_viewDefaultSupplyLine



ERROR: testApparel ModelResource_viewDefaultSupplyLine (testXHTML.TestXHTML)
----------------------------------------------------------------------
Traceback (most recent call last):
  File "/usr/lib/erp5/lib/python/Testing/ZopeTestCase/profiler.py", line 98, in __call__
    testMethod()
  File "/home/buildbot/buildbot_slave/full.Zelenium/build/unit_test/Products/ERP5/tests/testXHTML.py", line 156, in testMethod
    view = getattr(content, view_name)
AttributeError: Resource_viewDefaultSupplyLine



FAIL: Simple Invoice.
----------------------------------------------------------------------
Traceback (most recent call last):
  File "/usr/lib/erp5/lib/python/Testing/ZopeTestCase/profiler.py", line 98, in __call__
    testMethod()
  File "/home/buildbot/buildbot_slave/full.Zelenium/build/unit_test/Products/ERP5/tests/testAccountingRules.py", line 1463, in test_04_SimpleInvoice
    self.playSequence("""
  File "/home/buildbot/buildbot_slave/full.Zelenium/build/unit_test/Products/ERP5/tests/testAccountingRules.py", line 102, in playSequence
    sequence_list.play(self, quiet=quiet)
  File "/home/buildbot/buildbot_slave/full.Zelenium/build/unit_test/Products/ERP5Type/tests/Sequence.py", line 166, in play
    sequence.play(context, sequence_number=i, quiet=quiet)
  File "/home/buildbot/buildbot_slave/full.Zelenium/build/unit_test/Products/ERP5Type/tests/Sequence.py", line 113, in play
    step.play(context, sequence=self, quiet=quiet)
    Current Sequence:
      CreateAccounts
      CreateEntities
      CreateCurrencies
      CreateProducts
      CreateSaleInvoiceTransactionRule
      UpdateSaleInvoiceTransactionRuleMatrix
      ValidateSaleInvoiceTransaction
      CreateNotebookFranceCell
      Tic
      ClearSimulation
      ClearAccountingModule
      CreateSimpleSaleInvoice
      PlanInvoice
      Tic
    > CheckFirstRuleIsApplied
      CheckPaymentRuleIsApplied
      ConfirmInvoice
      Tic
      CheckAccountingLinesCoherantWithSimulation
  File "/home/buildbot/buildbot_slave/full.Zelenium/build/unit_test/Products/ERP5Type/tests/Sequence.py", line 99, in play
    method(sequence=sequence)
  File "/home/buildbot/buildbot_slave/full.Zelenium/build/unit_test/Products/ERP5/tests/testAccountingRules.py", line 1080, in stepCheckFirstRuleIsApplied
    self.assertEquals( len(applied_rule_list), 1)
AssertionError: 0 != 1



FAIL: Same test as SimpleInvoice but directly confirm the invoice
----------------------------------------------------------------------
Traceback (most recent call last):
  File "/usr/lib/erp5/lib/python/Testing/ZopeTestCase/profiler.py", line 98, in __call__
    testMethod()
  File "/home/buildbot/buildbot_slave/full.Zelenium/build/unit_test/Products/ERP5/tests/testAccountingRules.py", line 1495, in test_04b_SimpleInvoiceConfirm
    self.playSequence("""
  File "/home/buildbot/buildbot_slave/full.Zelenium/build/unit_test/Products/ERP5/tests/testAccountingRules.py", line 102, in playSequence
    sequence_list.play(self, quiet=quiet)
  File "/home/buildbot/buildbot_slave/full.Zelenium/build/unit_test/Products/ERP5Type/tests/Sequence.py", line 166, in play
    sequence.play(context, sequence_number=i, quiet=quiet)
  File "/home/buildbot/buildbot_slave/full.Zelenium/build/unit_test/Products/ERP5Type/tests/Sequence.py", line 113, in play
    step.play(context, sequence=self, quiet=quiet)
    Current Sequence:
      CreateAccounts
      CreateEntities
      CreateCurrencies
      CreateProducts
      CreateSaleInvoiceTransactionRule
      UpdateSaleInvoiceTransactionRuleMatrix
      ValidateSaleInvoiceTransaction
      CreateNotebookFranceCell
      Tic
      ClearSimulation
      ClearAccountingModule
      CreateSimpleSaleInvoice
      ConfirmInvoice
      Tic
    > CheckAccountingLinesCreatedForSimpleInvoice
      RebuildAndCheckNothingIsCreated
  File "/home/buildbot/buildbot_slave/full.Zelenium/build/unit_test/Products/ERP5Type/tests/Sequence.py", line 99, in play
    method(sequence=sequence)
  File "/home/buildbot/buildbot_slave/full.Zelenium/build/unit_test/Products/ERP5/tests/testAccountingRules.py", line 1277, in stepCheckAccountingLinesCreatedForSimpleInvoice
    self.assertEquals(len(invoice_transaction_line_list), 3)
AssertionError: 0 != 3



FAIL: Simple Invoice, 2 lines.
----------------------------------------------------------------------
Traceback (most recent call last):
  File "/usr/lib/erp5/lib/python/Testing/ZopeTestCase/profiler.py", line 98, in __call__
    testMethod()
  File "/home/buildbot/buildbot_slave/full.Zelenium/build/unit_test/Products/ERP5/tests/testAccountingRules.py", line 1526, in test_04c_SimpleInvoiceTwoLines
    self.playSequence("""
  File "/home/buildbot/buildbot_slave/full.Zelenium/build/unit_test/Products/ERP5/tests/testAccountingRules.py", line 102, in playSequence
    sequence_list.play(self, quiet=quiet)
  File "/home/buildbot/buildbot_slave/full.Zelenium/build/unit_test/Products/ERP5Type/tests/Sequence.py", line 166, in play
    sequence.play(context, sequence_number=i, quiet=quiet)
  File "/home/buildbot/buildbot_slave/full.Zelenium/build/unit_test/Products/ERP5Type/tests/Sequence.py", line 113, in play
    step.play(context, sequence=self, quiet=quiet)
    Current Sequence:
      CreateAccounts
      CreateEntities
      CreateCurrencies
      CreateProducts
      CreateSaleInvoiceTransactionRule
      UpdateSaleInvoiceTransactionRuleMatrix
      ValidateSaleInvoiceTransaction
      CreateNotebookFranceCell
      Tic
      ClearSimulation
      ClearAccountingModule
      CreateSimpleSaleInvoiceTwoLines
      ConfirmInvoice
      Tic
    > CheckAccountingLinesCreatedForSimpleInvoice
      RebuildAndCheckNothingIsCreated
  File "/home/buildbot/buildbot_slave/full.Zelenium/build/unit_test/Products/ERP5Type/tests/Sequence.py", line 99, in play
    method(sequence=sequence)
  File "/home/buildbot/buildbot_slave/full.Zelenium/build/unit_test/Products/ERP5/tests/testAccountingRules.py", line 1277, in stepCheckAccountingLinesCreatedForSimpleInvoice
    self.assertEquals(len(invoice_transaction_line_list), 3)
AssertionError: 0 != 3



FAIL: Simple Invoice, 2 cells.
----------------------------------------------------------------------
Traceback (most recent call last):
  File "/usr/lib/erp5/lib/python/Testing/ZopeTestCase/profiler.py", line 98, in __call__
    testMethod()
  File "/home/buildbot/buildbot_slave/full.Zelenium/build/unit_test/Products/ERP5/tests/testAccountingRules.py", line 1557, in test_04d_SimpleInvoiceTwoCells
    self.playSequence("""
  File "/home/buildbot/buildbot_slave/full.Zelenium/build/unit_test/Products/ERP5/tests/testAccountingRules.py", line 102, in playSequence
    sequence_list.play(self, quiet=quiet)
  File "/home/buildbot/buildbot_slave/full.Zelenium/build/unit_test/Products/ERP5Type/tests/Sequence.py", line 166, in play
    sequence.play(context, sequence_number=i, quiet=quiet)
  File "/home/buildbot/buildbot_slave/full.Zelenium/build/unit_test/Products/ERP5Type/tests/Sequence.py", line 113, in play
    step.play(context, sequence=self, quiet=quiet)
    Current Sequence:
      CreateAccounts
      CreateEntities
      CreateCurrencies
      CreateProducts
      CreateSaleInvoiceTransactionRule
      UpdateSaleInvoiceTransactionRuleMatrix
      ValidateSaleInvoiceTransaction
      CreateNotebookFranceCell
      Tic
      ClearSimulation
      ClearAccountingModule
      CreateSimpleSaleInvoiceTwoCells
      ConfirmInvoice
      Tic
    > CheckAccountingLinesCreatedForSimpleInvoice
      RebuildAndCheckNothingIsCreated
  File "/home/buildbot/buildbot_slave/full.Zelenium/build/unit_test/Products/ERP5Type/tests/Sequence.py", line 99, in play
    method(sequence=sequence)
  File "/home/buildbot/buildbot_slave/full.Zelenium/build/unit_test/Products/ERP5/tests/testAccountingRules.py", line 1277, in stepCheckAccountingLinesCreatedForSimpleInvoice
    self.assertEquals(len(invoice_transaction_line_list), 3)
AssertionError: 0 != 3



FAIL: Add a new line then updateAppliedRule.
----------------------------------------------------------------------
Traceback (most recent call last):
  File "/usr/lib/erp5/lib/python/Testing/ZopeTestCase/profiler.py", line 98, in __call__
    testMethod()
  File "/home/buildbot/buildbot_slave/full.Zelenium/build/unit_test/Products/ERP5/tests/testAccountingRules.py", line 1591, in test_05a_SimpleInvoiceReExpandAddLine
    self.playSequence("""
  File "/home/buildbot/buildbot_slave/full.Zelenium/build/unit_test/Products/ERP5/tests/testAccountingRules.py", line 102, in playSequence
    sequence_list.play(self, quiet=quiet)
  File "/home/buildbot/buildbot_slave/full.Zelenium/build/unit_test/Products/ERP5Type/tests/Sequence.py", line 166, in play
    sequence.play(context, sequence_number=i, quiet=quiet)
  File "/home/buildbot/buildbot_slave/full.Zelenium/build/unit_test/Products/ERP5Type/tests/Sequence.py", line 113, in play
    step.play(context, sequence=self, quiet=quiet)
    Current Sequence:
      CreateAccounts
      CreateEntities
      CreateCurrencies
      CreateProducts
      CreateSaleInvoiceTransactionRule
      UpdateSaleInvoiceTransactionRuleMatrix
      ValidateSaleInvoiceTransaction
      CreateNotebookFranceCell
      Tic
      ClearSimulation
      ClearAccountingModule
      CreateEmptyInvoice
      PlanInvoice
      Tic
      AddInvoiceLine
      ConfirmInvoice
      Tic
    > CheckAccountingLinesCreatedForSimpleInvoice
      RebuildAndCheckNothingIsCreated
  File "/home/buildbot/buildbot_slave/full.Zelenium/build/unit_test/Products/ERP5Type/tests/Sequence.py", line 99, in play
    method(sequence=sequence)
  File "/home/buildbot/buildbot_slave/full.Zelenium/build/unit_test/Products/ERP5/tests/testAccountingRules.py", line 1277, in stepCheckAccountingLinesCreatedForSimpleInvoice
    self.assertEquals(len(invoice_transaction_line_list), 3)
AssertionError: 0 != 3



FAIL: Tests that editing a line updates simulation correctly
----------------------------------------------------------------------
Traceback (most recent call last):
  File "/usr/lib/erp5/lib/python/Testing/ZopeTestCase/profiler.py", line 98, in __call__
    testMethod()
  File "/home/buildbot/buildbot_slave/full.Zelenium/build/unit_test/Products/ERP5/tests/testAccountingRules.py", line 1623, in test_05b_SimpleInvoiceReExpandEditLine
    self.playSequence("""
  File "/home/buildbot/buildbot_slave/full.Zelenium/build/unit_test/Products/ERP5/tests/testAccountingRules.py", line 102, in playSequence
    sequence_list.play(self, quiet=quiet)
  File "/home/buildbot/buildbot_slave/full.Zelenium/build/unit_test/Products/ERP5Type/tests/Sequence.py", line 166, in play
    sequence.play(context, sequence_number=i, quiet=quiet)
  File "/home/buildbot/buildbot_slave/full.Zelenium/build/unit_test/Products/ERP5Type/tests/Sequence.py", line 113, in play
    step.play(context, sequence=self, quiet=quiet)
    Current Sequence:
      CreateAccounts
      CreateEntities
      CreateCurrencies
      CreateProducts
      CreateSaleInvoiceTransactionRule
      UpdateSaleInvoiceTransactionRuleMatrix
      ValidateSaleInvoiceTransaction
      CreateNotebookFranceCell
      Tic
      ClearSimulation
      ClearAccountingModule
      CreateOtherSimpleSaleInvoice
      PlanInvoice
      Tic
      EditInvoiceLine
      ConfirmInvoice
      Tic
    > CheckAccountingLinesCreatedForSimpleInvoice
      RebuildAndCheckNothingIsCreated
  File "/home/buildbot/buildbot_slave/full.Zelenium/build/unit_test/Products/ERP5Type/tests/Sequence.py", line 99, in play
    method(sequence=sequence)
  File "/home/buildbot/buildbot_slave/full.Zelenium/build/unit_test/Products/ERP5/tests/testAccountingRules.py", line 1277, in stepCheckAccountingLinesCreatedForSimpleInvoice
    self.assertEquals(len(invoice_transaction_line_list), 3)
AssertionError: 0 != 3



FAIL: Tests that removing a line updates simulation correctly
----------------------------------------------------------------------
Traceback (most recent call last):
  File "/usr/lib/erp5/lib/python/Testing/ZopeTestCase/profiler.py", line 98, in __call__
    testMethod()
  File "/home/buildbot/buildbot_slave/full.Zelenium/build/unit_test/Products/ERP5/tests/testAccountingRules.py", line 1655, in test_05c_SimpleInvoiceReExpandDeleteLine
    self.playSequence("""
  File "/home/buildbot/buildbot_slave/full.Zelenium/build/unit_test/Products/ERP5/tests/testAccountingRules.py", line 102, in playSequence
    sequence_list.play(self, quiet=quiet)
  File "/home/buildbot/buildbot_slave/full.Zelenium/build/unit_test/Products/ERP5Type/tests/Sequence.py", line 166, in play
    sequence.play(context, sequence_number=i, quiet=quiet)
  File "/home/buildbot/buildbot_slave/full.Zelenium/build/unit_test/Products/ERP5Type/tests/Sequence.py", line 113, in play
    step.play(context, sequence=self, quiet=quiet)
    Current Sequence:
      CreateAccounts
      CreateEntities
      CreateCurrencies
      CreateProducts
      CreateSaleInvoiceTransactionRule
      UpdateSaleInvoiceTransactionRuleMatrix
      ValidateSaleInvoiceTransaction
      CreateNotebookFranceCell
      Tic
      ClearSimulation
      ClearAccountingModule
      CreateSimpleSaleInvoice
      AddInvoiceLine
      PlanInvoice
      Tic
      DeleteInvoiceLine
      Tic
      ConfirmInvoice
      Tic
    > CheckAccountingLinesCreatedForSimpleInvoice
      RebuildAndCheckNothingIsCreated
  File "/home/buildbot/buildbot_slave/full.Zelenium/build/unit_test/Products/ERP5Type/tests/Sequence.py", line 99, in play
    method(sequence=sequence)
  File "/home/buildbot/buildbot_slave/full.Zelenium/build/unit_test/Products/ERP5/tests/testAccountingRules.py", line 1277, in stepCheckAccountingLinesCreatedForSimpleInvoice
    self.assertEquals(len(invoice_transaction_line_list), 3)
AssertionError: 0 != 3



FAIL: Tests that replacing a line by cells updates simulation correctly
----------------------------------------------------------------------
Traceback (most recent call last):
  File "/usr/lib/erp5/lib/python/Testing/ZopeTestCase/profiler.py", line 98, in __call__
    testMethod()
  File "/home/buildbot/buildbot_slave/full.Zelenium/build/unit_test/Products/ERP5/tests/testAccountingRules.py", line 1689, in test_05d_SimpleInvoiceReExpandCreateCell
    self.playSequence("""
  File "/home/buildbot/buildbot_slave/full.Zelenium/build/unit_test/Products/ERP5/tests/testAccountingRules.py", line 102, in playSequence
    sequence_list.play(self, quiet=quiet)
  File "/home/buildbot/buildbot_slave/full.Zelenium/build/unit_test/Products/ERP5Type/tests/Sequence.py", line 166, in play
    sequence.play(context, sequence_number=i, quiet=quiet)
  File "/home/buildbot/buildbot_slave/full.Zelenium/build/unit_test/Products/ERP5Type/tests/Sequence.py", line 113, in play
    step.play(context, sequence=self, quiet=quiet)
    Current Sequence:
      CreateAccounts
      CreateEntities
      CreateCurrencies
      CreateProducts
      CreateSaleInvoiceTransactionRule
      UpdateSaleInvoiceTransactionRuleMatrix
      ValidateSaleInvoiceTransaction
      CreateNotebookFranceCell
      Tic
      ClearSimulation
      ClearAccountingModule
      CreateOtherSimpleSaleInvoice
      PlanInvoice
      Tic
      AddCellsInInvoiceLine
      ConfirmInvoice
      Tic
    > CheckAccountingLinesCreatedForSimpleInvoice
      RebuildAndCheckNothingIsCreated
  File "/home/buildbot/buildbot_slave/full.Zelenium/build/unit_test/Products/ERP5Type/tests/Sequence.py", line 99, in play
    method(sequence=sequence)
  File "/home/buildbot/buildbot_slave/full.Zelenium/build/unit_test/Products/ERP5/tests/testAccountingRules.py", line 1277, in stepCheckAccountingLinesCreatedForSimpleInvoice
    self.assertEquals(len(invoice_transaction_line_list), 3)
AssertionError: 0 != 3



FAIL: Tests that updating an applied rule many times doesn't break the
----------------------------------------------------------------------
Traceback (most recent call last):
  File "/usr/lib/erp5/lib/python/Testing/ZopeTestCase/profiler.py", line 98, in __call__
    testMethod()
  File "/home/buildbot/buildbot_slave/full.Zelenium/build/unit_test/Products/ERP5/tests/testAccountingRules.py", line 1746, in test_05e_SimpleInvoiceExpandManyTimes
    """, quiet=quiet )
  File "/home/buildbot/buildbot_slave/full.Zelenium/build/unit_test/Products/ERP5/tests/testAccountingRules.py", line 102, in playSequence
    sequence_list.play(self, quiet=quiet)
  File "/home/buildbot/buildbot_slave/full.Zelenium/build/unit_test/Products/ERP5Type/tests/Sequence.py", line 166, in play
    sequence.play(context, sequence_number=i, quiet=quiet)
  File "/home/buildbot/buildbot_slave/full.Zelenium/build/unit_test/Products/ERP5Type/tests/Sequence.py", line 113, in play
    step.play(context, sequence=self, quiet=quiet)
    Current Sequence:
      CreateAccounts
      CreateEntities
      CreateCurrencies
      CreateProducts
      CreateSaleInvoiceTransactionRule
      UpdateSaleInvoiceTransactionRuleMatrix
      ValidateSaleInvoiceTransaction
      CreateNotebookFranceCell
      Tic
      ClearSimulation
      ClearAccountingModule
      CreateSimpleSaleInvoice
      PlanInvoice
      Tic
      EditInvoiceLine
      UpdateAppliedRule
      Tic
      EditInvoiceLine
      UpdateAppliedRule
      Tic
      EditInvoiceLine
      UpdateAppliedRule
      Tic
      EditInvoiceLine
      UpdateAppliedRule
      Tic
      ConfirmInvoice
      Tic
    > CheckAccountingLinesCreatedForSimpleInvoice
      RebuildAndCheckNothingIsCreated
  File "/home/buildbot/buildbot_slave/full.Zelenium/build/unit_test/Products/ERP5Type/tests/Sequence.py", line 99, in play
    method(sequence=sequence)
  File "/home/buildbot/buildbot_slave/full.Zelenium/build/unit_test/Products/ERP5/tests/testAccountingRules.py", line 1277, in stepCheckAccountingLinesCreatedForSimpleInvoice
    self.assertEquals(len(invoice_transaction_line_list), 3)
AssertionError: 0 != 3



FAIL: Multiple lines invoice.
----------------------------------------------------------------------
Traceback (most recent call last):
  File "/usr/lib/erp5/lib/python/Testing/ZopeTestCase/profiler.py", line 98, in __call__
    testMethod()
  File "/home/buildbot/buildbot_slave/full.Zelenium/build/unit_test/Products/ERP5/tests/testAccountingRules.py", line 1760, in test_06_MultiLineInvoice
    self.playSequence("""
  File "/home/buildbot/buildbot_slave/full.Zelenium/build/unit_test/Products/ERP5/tests/testAccountingRules.py", line 102, in playSequence
    sequence_list.play(self, quiet=quiet)
  File "/home/buildbot/buildbot_slave/full.Zelenium/build/unit_test/Products/ERP5Type/tests/Sequence.py", line 166, in play
    sequence.play(context, sequence_number=i, quiet=quiet)
  File "/home/buildbot/buildbot_slave/full.Zelenium/build/unit_test/Products/ERP5Type/tests/Sequence.py", line 113, in play
    step.play(context, sequence=self, quiet=quiet)
    Current Sequence:
      CreateAccounts
      CreateEntities
      CreateCurrencies
      CreateProducts
      CreateSaleInvoiceTransactionRule
      Tic
      UpdateSaleInvoiceTransactionRuleMatrix
      ValidateSaleInvoiceTransaction
      Tic
      CreateNotebookFranceCell
      CreateBareboneFranceCell
      Tic
      ClearSimulation
      ClearAccountingModule
      CreateMultiLineSaleInvoice
      PlanInvoice
      ConfirmInvoice
      Tic
    > CheckAccountingLinesCreatedForMultiLineInvoice
      RebuildAndCheckNothingIsCreated
  File "/home/buildbot/buildbot_slave/full.Zelenium/build/unit_test/Products/ERP5Type/tests/Sequence.py", line 99, in play
    method(sequence=sequence)
  File "/home/buildbot/buildbot_slave/full.Zelenium/build/unit_test/Products/ERP5/tests/testAccountingRules.py", line 1321, in stepCheckAccountingLinesCreatedForMultiLineInvoice
    self.assertEquals(len(invoice_transaction_line_list), 4)
AssertionError: 0 != 4



FAIL: test_01_SearchPredidateListWithNoTest (testDomainTool.TestDomainTool)
----------------------------------------------------------------------
Traceback (most recent call last):
  File "/usr/lib/erp5/lib/python/Testing/ZopeTestCase/profiler.py", line 98, in __call__
    testMethod()
  File "/home/buildbot/buildbot_slave/full.Zelenium/build/unit_test/Products/ERP5/tests/testDomainTool.py", line 291, in test_01_SearchPredidateListWithNoTest
    self.checkPredicate(test=0)
  File "/home/buildbot/buildbot_slave/full.Zelenium/build/unit_test/Products/ERP5/tests/testDomainTool.py", line 155, in checkPredicate
    self.assertEquals(len(predicate_list),1) # Actually, a predicate where
AssertionError: 0 != 1



FAIL: test_02_SearchPredidateListWithTest (testDomainTool.TestDomainTool)
----------------------------------------------------------------------
Traceback (most recent call last):
  File "/usr/lib/erp5/lib/python/Testing/ZopeTestCase/profiler.py", line 98, in __call__
    testMethod()
  File "/home/buildbot/buildbot_slave/full.Zelenium/build/unit_test/Products/ERP5/tests/testDomainTool.py", line 298, in test_02_SearchPredidateListWithTest
    self.checkPredicate(test=1)
  File "/home/buildbot/buildbot_slave/full.Zelenium/build/unit_test/Products/ERP5/tests/testDomainTool.py", line 155, in checkPredicate
    self.assertEquals(len(predicate_list),1) # Actually, a predicate where
AssertionError: 0 != 1



FAIL: test_01_testProductionSimulationExpand (testProductionOrder.TestProductionOrder)
----------------------------------------------------------------------
Traceback (most recent call last):
  File "/usr/lib/erp5/lib/python/Testing/ZopeTestCase/profiler.py", line 98, in __call__
    testMethod()
  File "/home/buildbot/buildbot_slave/full.Zelenium/build/unit_test/Products/ERP5/tests/testProductionOrder.py", line 866, in test_01_testProductionSimulationExpand
    sequence_list.play(self)
  File "/home/buildbot/buildbot_slave/full.Zelenium/build/unit_test/Products/ERP5Type/tests/Sequence.py", line 166, in play
    sequence.play(context, sequence_number=i, quiet=quiet)
  File "/home/buildbot/buildbot_slave/full.Zelenium/build/unit_test/Products/ERP5Type/tests/Sequence.py", line 113, in play
    step.play(context, sequence=self, quiet=quiet)
    Current Sequence:
      ClearActivities
      CreateProductionOrganisation1
      CreateProductionSC
      CreateVariatedResource
      CreateComponent1
      CreateTransformation
      CreateOrganisation
      CreateOrder
      CreateOrderLine
      Tic
      OrderOrder
      Tic
    > CheckProductionSimulation
  File "/home/buildbot/buildbot_slave/full.Zelenium/build/unit_test/Products/ERP5Type/tests/Sequence.py", line 99, in play
    method(sequence=sequence)
  File "/home/buildbot/buildbot_slave/full.Zelenium/build/unit_test/Products/ERP5/tests/testProductionOrder.py", line 321, in stepCheckProductionSimulation
    self.assertEquals(1, len(applied_rule_list))
AssertionError: 1 != 0



FAIL: test_02_testSourcingSimulationExpand (testProductionOrder.TestProductionOrder)
----------------------------------------------------------------------
Traceback (most recent call last):
  File "/usr/lib/erp5/lib/python/Testing/ZopeTestCase/profiler.py", line 98, in __call__
    testMethod()
  File "/home/buildbot/buildbot_slave/full.Zelenium/build/unit_test/Products/ERP5/tests/testProductionOrder.py", line 893, in test_02_testSourcingSimulationExpand
    sequence_list.play(self)
  File "/home/buildbot/buildbot_slave/full.Zelenium/build/unit_test/Products/ERP5Type/tests/Sequence.py", line 166, in play
    sequence.play(context, sequence_number=i, quiet=quiet)
  File "/home/buildbot/buildbot_slave/full.Zelenium/build/unit_test/Products/ERP5Type/tests/Sequence.py", line 113, in play
    step.play(context, sequence=self, quiet=quiet)
    Current Sequence:
      ClearActivities
      CreateProductionOrganisation1
      CreateSupplyOrganisation1
      CreateSourcingSC
      CreateVariatedResource
      CreateComponent1
      CreateTransformation
      CreateOrganisation
      CreateOrder
      CreateOrderLine
      Tic
      OrderOrder
      Tic
    > CheckSourcingSimulation
  File "/home/buildbot/buildbot_slave/full.Zelenium/build/unit_test/Products/ERP5Type/tests/Sequence.py", line 99, in play
    method(sequence=sequence)
  File "/home/buildbot/buildbot_slave/full.Zelenium/build/unit_test/Products/ERP5/tests/testProductionOrder.py", line 431, in stepCheckSourcingSimulation
    self.assertEquals(1, len(applied_rule_list))
AssertionError: 1 != 0



FAIL: test_03_testIndustrialPhase (testProductionOrder.TestProductionOrder)
----------------------------------------------------------------------
Traceback (most recent call last):
  File "/usr/lib/erp5/lib/python/Testing/ZopeTestCase/profiler.py", line 98, in __call__
    testMethod()
  File "/home/buildbot/buildbot_slave/full.Zelenium/build/unit_test/Products/ERP5/tests/testProductionOrder.py", line 921, in test_03_testIndustrialPhase
    sequence_list.play(self)
  File "/home/buildbot/buildbot_slave/full.Zelenium/build/unit_test/Products/ERP5Type/tests/Sequence.py", line 166, in play
    sequence.play(context, sequence_number=i, quiet=quiet)
  File "/home/buildbot/buildbot_slave/full.Zelenium/build/unit_test/Products/ERP5Type/tests/Sequence.py", line 113, in play
    step.play(context, sequence=self, quiet=quiet)
    Current Sequence:
      ClearActivities
      CreateProductionOrganisation1
      CreateProductionOrganisation2
      CreateSupplyOrganisation1
      CreateSupplyOrganisation2
      CreateTwoPhasesSC
      CreateVariatedResource
      CreateComponent1
      CreateComponent2
      CreateTransformation
      CreateOrganisation
      CreateOrder
      CreateOrderLine
      Tic
      OrderOrder
      Tic
    > CheckTwoPhasesSimulation
  File "/home/buildbot/buildbot_slave/full.Zelenium/build/unit_test/Products/ERP5Type/tests/Sequence.py", line 99, in play
    method(sequence=sequence)
  File "/home/buildbot/buildbot_slave/full.Zelenium/build/unit_test/Products/ERP5/tests/testProductionOrder.py", line 621, in stepCheckTwoPhasesSimulation
    self.assertEquals(1, len(applied_rule_list))
AssertionError: 1 != 0



ERROR: test_invoice_transaction_line_resource (testInvoice.TestInvoice)
----------------------------------------------------------------------
Traceback (most recent call last):
  File "/usr/lib/erp5/lib/python/Testing/ZopeTestCase/profiler.py", line 98, in __call__
    testMethod()
  File "/home/buildbot/buildbot_slave/full.Zelenium/build/unit_test/Products/ERP5/tests/testInvoice.py", line 1954, in test_invoice_transaction_line_resource
    invoice_applied_rule = delivery_movement.contentValues()[0]
IndexError: list index out of range



FAIL: test_01_SimpleInvoice (testInvoice.TestInvoice)
----------------------------------------------------------------------
Traceback (most recent call last):
  File "/usr/lib/erp5/lib/python/Testing/ZopeTestCase/profiler.py", line 98, in __call__
    testMethod()
  File "/home/buildbot/buildbot_slave/full.Zelenium/build/unit_test/Products/ERP5/tests/testInvoice.py", line 1177, in test_01_SimpleInvoice
    sequence_list.play(self, quiet=quiet)
  File "/home/buildbot/buildbot_slave/full.Zelenium/build/unit_test/Products/ERP5Type/tests/Sequence.py", line 166, in play
    sequence.play(context, sequence_number=i, quiet=quiet)
  File "/home/buildbot/buildbot_slave/full.Zelenium/build/unit_test/Products/ERP5Type/tests/Sequence.py", line 113, in play
    step.play(context, sequence=self, quiet=quiet)
    Current Sequence:
      CreateEntities
      CreateCurrency
      CreateSaleInvoiceTransactionRule
      CreateOrder
      SetOrderProfile
      SetOrderPriceCurrency
      CreateNotVariatedResource
      Tic
      CreateOrderLine
      SetOrderLineResource
      SetOrderLineDefaultValues
      OrderOrder
      Tic
      CheckDeliveryBuilding
      ConfirmOrder
      Tic
      CheckOrderRule
      CheckOrderSimulation
      CheckDeliveryBuilding
      AddPackingListContainer
      AddPackingListContainerLine
      SetContainerLineFullQuantity
      Tic
      CheckPackingListIsPacked
      SetReadyPackingList
      Tic
      StartPackingList
    > CheckInvoicingRule
      Tic
      CheckInvoiceBuilding
      RebuildAndCheckNothingIsCreated
      CheckInvoicesConsistency
  File "/home/buildbot/buildbot_slave/full.Zelenium/build/unit_test/Products/ERP5Type/tests/Sequence.py", line 99, in play
    method(sequence=sequence)
  File "/home/buildbot/buildbot_slave/full.Zelenium/build/unit_test/Products/ERP5/tests/testInvoice.py", line 482, in stepCheckInvoicingRule
    self.assertEquals(len(temp_invoicing_rule_list), 1)
AssertionError: 0 != 1



FAIL: test_02_TwoInvoicesFromTwoPackingList (testInvoice.TestInvoice)
----------------------------------------------------------------------
Traceback (most recent call last):
  File "/usr/lib/erp5/lib/python/Testing/ZopeTestCase/profiler.py", line 98, in __call__
    testMethod()
  File "/home/buildbot/buildbot_slave/full.Zelenium/build/unit_test/Products/ERP5/tests/testInvoice.py", line 1211, in test_02_TwoInvoicesFromTwoPackingList
    sequence_list.play(self, quiet=quiet)
  File "/home/buildbot/buildbot_slave/full.Zelenium/build/unit_test/Products/ERP5Type/tests/Sequence.py", line 166, in play
    sequence.play(context, sequence_number=i, quiet=quiet)
  File "/home/buildbot/buildbot_slave/full.Zelenium/build/unit_test/Products/ERP5Type/tests/Sequence.py", line 113, in play
    step.play(context, sequence=self, quiet=quiet)
    Current Sequence:
      CreateEntities
      CreateCurrency
      CreateSaleInvoiceTransactionRule
      CreateOrder
      SetOrderProfile
      SetOrderPriceCurrency
      CreateNotVariatedResource
      Tic
      CreateOrderLine
      SetOrderLineResource
      SetOrderLineDefaultValues
      OrderOrder
      Tic
      CheckDeliveryBuilding
      ConfirmOrder
      Tic
      CheckOrderRule
      CheckOrderSimulation
      CheckDeliveryBuilding
      DecreasePackingListLineQuantity
      CheckPackingListIsCalculating
      SplitAndDeferPackingList
      Tic
      CheckPackingListIsSolved
      CheckPackingListSplitted
      AddPackingListContainer
      AddPackingListContainerLine
      SetContainerLineFullQuantity
      Tic
      CheckPackingListIsPacked
      DefineNewPackingListContainer
      Tic
      CheckNewPackingListIsPacked
      SetReadyPackingList
      SetReadyNewPackingList
      Tic
      StartPackingList
      StartNewPackingList
      Tic
    > CheckTwoInvoices
      RemoveDateMovementGroupForTransactionBuilder
      ConfirmTwoInvoices
      Tic
      CheckTwoInvoicesTransactionLines
      CheckInvoicesConsistency
  File "/home/buildbot/buildbot_slave/full.Zelenium/build/unit_test/Products/ERP5Type/tests/Sequence.py", line 99, in play
    method(sequence=sequence)
  File "/home/buildbot/buildbot_slave/full.Zelenium/build/unit_test/Products/ERP5/tests/testInvoice.py", line 639, in stepCheckTwoInvoices
    self.assertEquals(len(invoice_list),1)
AssertionError: 0 != 1



FAIL: test_03_InvoiceEditAndInvoiceRule (testInvoice.TestInvoice)
----------------------------------------------------------------------
Traceback (most recent call last):
  File "/usr/lib/erp5/lib/python/Testing/ZopeTestCase/profiler.py", line 98, in __call__
    testMethod()
  File "/home/buildbot/buildbot_slave/full.Zelenium/build/unit_test/Products/ERP5/tests/testInvoice.py", line 1243, in test_03_InvoiceEditAndInvoiceRule
    sequence_list.play(self, quiet=quiet)
  File "/home/buildbot/buildbot_slave/full.Zelenium/build/unit_test/Products/ERP5Type/tests/Sequence.py", line 166, in play
    sequence.play(context, sequence_number=i, quiet=quiet)
  File "/home/buildbot/buildbot_slave/full.Zelenium/build/unit_test/Products/ERP5Type/tests/Sequence.py", line 113, in play
    step.play(context, sequence=self, quiet=quiet)
    Current Sequence:
      CreateEntities
      CreateCurrency
      CreateSaleInvoiceTransactionRule
      CreateOrder
      SetOrderProfile
      SetOrderPriceCurrency
      CreateNotVariatedResource
      Tic
      CreateOrderLine
      SetOrderLineResource
      SetOrderLineDefaultValues
      OrderOrder
      Tic
      CheckDeliveryBuilding
      ConfirmOrder
      Tic
      CheckOrderRule
      CheckOrderSimulation
      CheckDeliveryBuilding
      AddPackingListContainer
      AddPackingListContainerLine
      SetContainerLineFullQuantity
      Tic
      CheckPackingListIsPacked
      SetReadyPackingList
      Tic
      StartPackingList
    > CheckInvoicingRule
      Tic
      CheckInvoiceBuilding
      EditInvoice
      CheckInvoiceRuleNotAppliedOnInvoiceEdit
      CheckInvoicesConsistency
  File "/home/buildbot/buildbot_slave/full.Zelenium/build/unit_test/Products/ERP5Type/tests/Sequence.py", line 99, in play
    method(sequence=sequence)
  File "/home/buildbot/buildbot_slave/full.Zelenium/build/unit_test/Products/ERP5/tests/testInvoice.py", line 482, in stepCheckInvoicingRule
    self.assertEquals(len(temp_invoicing_rule_list), 1)
AssertionError: 0 != 1



FAIL: test_05_InvoiceEditPackingListLine (testInvoice.TestInvoice)
----------------------------------------------------------------------
Traceback (most recent call last):
  File "/usr/lib/erp5/lib/python/Testing/ZopeTestCase/profiler.py", line 98, in __call__
    testMethod()
  File "/home/buildbot/buildbot_slave/full.Zelenium/build/unit_test/Products/ERP5/tests/testInvoice.py", line 1288, in test_05_InvoiceEditPackingListLine
    sequence_list.play(self, quiet=quiet)
  File "/home/buildbot/buildbot_slave/full.Zelenium/build/unit_test/Products/ERP5Type/tests/Sequence.py", line 166, in play
    sequence.play(context, sequence_number=i, quiet=quiet)
  File "/home/buildbot/buildbot_slave/full.Zelenium/build/unit_test/Products/ERP5Type/tests/Sequence.py", line 113, in play
    step.play(context, sequence=self, quiet=quiet)
    Current Sequence:
      CreateEntities
      CreateCurrency
      CreateSaleInvoiceTransactionRule
      CreateOrder
      SetOrderProfile
      SetOrderPriceCurrency
      CreateNotVariatedResource
      Tic
      CreateOrderLine
      SetOrderLineResource
      SetOrderLineDefaultValues
      OrderOrder
      Tic
      CheckDeliveryBuilding
      ConfirmOrder
      Tic
      CheckOrderRule
      CheckOrderSimulation
      CheckDeliveryBuilding
      AddPackingListContainer
      AddPackingListContainerLine
      SetContainerLineFullQuantity
      Tic
      CheckPackingListIsPacked
      EditPackingListLine
      SetReadyPackingList
      Tic
      StartPackingList
    > CheckInvoicingRule
      Tic
      CheckInvoiceBuilding
      RebuildAndCheckNothingIsCreated
      CheckInvoicesConsistency
  File "/home/buildbot/buildbot_slave/full.Zelenium/build/unit_test/Products/ERP5Type/tests/Sequence.py", line 99, in play
    method(sequence=sequence)
  File "/home/buildbot/buildbot_slave/full.Zelenium/build/unit_test/Products/ERP5/tests/testInvoice.py", line 482, in stepCheckInvoicingRule
    self.assertEquals(len(temp_invoicing_rule_list), 1)
AssertionError: 0 != 1



FAIL: test_06_InvoiceDeletePackingListLine (testInvoice.TestInvoice)
----------------------------------------------------------------------
Traceback (most recent call last):
  File "/usr/lib/erp5/lib/python/Testing/ZopeTestCase/profiler.py", line 98, in __call__
    testMethod()
  File "/home/buildbot/buildbot_slave/full.Zelenium/build/unit_test/Products/ERP5/tests/testInvoice.py", line 1314, in test_06_InvoiceDeletePackingListLine
    sequence_list.play(self, quiet=quiet)
  File "/home/buildbot/buildbot_slave/full.Zelenium/build/unit_test/Products/ERP5Type/tests/Sequence.py", line 166, in play
    sequence.play(context, sequence_number=i, quiet=quiet)
  File "/home/buildbot/buildbot_slave/full.Zelenium/build/unit_test/Products/ERP5Type/tests/Sequence.py", line 113, in play
    step.play(context, sequence=self, quiet=quiet)
    Current Sequence:
      CreateEntities
      CreateCurrency
      CreateSaleInvoiceTransactionRule
      CreateOrder
      SetOrderProfile
      SetOrderPriceCurrency
      CreateNotVariatedResource
      Tic
      CreateOrderLine
      SetOrderLineResource
      SetOrderLineDefaultValues
      CreateNotVariatedResource
      Tic
      CreateOrderLine
      SetOrderLineResource
      SetOrderLineDefaultValues
      OrderOrder
      Tic
      CheckDeliveryBuilding
      ConfirmOrder
      Tic
      CheckOrderRule
      CheckOrderSimulation
      CheckDeliveryBuilding
      AddPackingListContainer
      AddPackingListContainerLine
      Tic
      SetContainerFullQuantity
      Tic
      CheckPackingListIsPacked
      DeletePackingListLine
      SetReadyPackingList
      Tic
      StartPackingList
    > CheckInvoicingRule
      Tic
      CheckInvoiceBuilding
      RebuildAndCheckNothingIsCreated
      CheckInvoicesConsistency
  File "/home/buildbot/buildbot_slave/full.Zelenium/build/unit_test/Products/ERP5Type/tests/Sequence.py", line 99, in play
    method(sequence=sequence)
  File "/home/buildbot/buildbot_slave/full.Zelenium/build/unit_test/Products/ERP5/tests/testInvoice.py", line 482, in stepCheckInvoicingRule
    self.assertEquals(len(temp_invoicing_rule_list), 1)
AssertionError: 0 != 1



FAIL: test_07_InvoiceAddPackingListLine (testInvoice.TestInvoice)
----------------------------------------------------------------------
Traceback (most recent call last):
  File "/usr/lib/erp5/lib/python/Testing/ZopeTestCase/profiler.py", line 98, in __call__
    testMethod()
  File "/home/buildbot/buildbot_slave/full.Zelenium/build/unit_test/Products/ERP5/tests/testInvoice.py", line 1342, in test_07_InvoiceAddPackingListLine
    sequence_list.play(self, quiet=quiet)
  File "/home/buildbot/buildbot_slave/full.Zelenium/build/unit_test/Products/ERP5Type/tests/Sequence.py", line 166, in play
    sequence.play(context, sequence_number=i, quiet=quiet)
  File "/home/buildbot/buildbot_slave/full.Zelenium/build/unit_test/Products/ERP5Type/tests/Sequence.py", line 113, in play
    step.play(context, sequence=self, quiet=quiet)
    Current Sequence:
      CreateEntities
      CreateCurrency
      CreateSaleInvoiceTransactionRule
      CreateOrder
      SetOrderProfile
      SetOrderPriceCurrency
      CreateNotVariatedResource
      Tic
      CreateOrderLine
      SetOrderLineResource
      SetOrderLineDefaultValues
      OrderOrder
      Tic
      CheckDeliveryBuilding
      ConfirmOrder
      Tic
      CheckOrderRule
      CheckOrderSimulation
      CheckDeliveryBuilding
      AddPackingListContainer
      AddPackingListContainerLine
      SetContainerLineFullQuantity
      Tic
      CheckPackingListIsPacked
      AddPackingListLine
      SetContainerFullQuantity
      Tic
      SetReadyPackingList
      Tic
      StartPackingList
    > CheckInvoicingRule
      Tic
      CheckInvoiceBuilding
      RebuildAndCheckNothingIsCreated
      CheckInvoicesConsistency
  File "/home/buildbot/buildbot_slave/full.Zelenium/build/unit_test/Products/ERP5Type/tests/Sequence.py", line 99, in play
    method(sequence=sequence)
  File "/home/buildbot/buildbot_slave/full.Zelenium/build/unit_test/Products/ERP5/tests/testInvoice.py", line 482, in stepCheckInvoicingRule
    self.assertEquals(len(temp_invoicing_rule_list), 1)
AssertionError: 0 != 1



FAIL: test_08_InvoiceDecreaseQuantity (testInvoice.TestInvoice)
----------------------------------------------------------------------
Traceback (most recent call last):
  File "/usr/lib/erp5/lib/python/Testing/ZopeTestCase/profiler.py", line 98, in __call__
    testMethod()
  File "/home/buildbot/buildbot_slave/full.Zelenium/build/unit_test/Products/ERP5/tests/testInvoice.py", line 1380, in test_08_InvoiceDecreaseQuantity
    self.playSequence(sequence, quiet=quiet)
  File "/home/buildbot/buildbot_slave/full.Zelenium/build/unit_test/Products/ERP5/tests/testAccountingRules.py", line 102, in playSequence
    sequence_list.play(self, quiet=quiet)
  File "/home/buildbot/buildbot_slave/full.Zelenium/build/unit_test/Products/ERP5Type/tests/Sequence.py", line 166, in play
    sequence.play(context, sequence_number=i, quiet=quiet)
  File "/home/buildbot/buildbot_slave/full.Zelenium/build/unit_test/Products/ERP5Type/tests/Sequence.py", line 113, in play
    step.play(context, sequence=self, quiet=quiet)
    Current Sequence:
      CreateEntities
      CreateCurrency
      CreateSaleInvoiceTransactionRule
      CreateOrder
      SetOrderProfile
      SetOrderPriceCurrency
      CreateNotVariatedResource
      Tic
      CreateOrderLine
      SetOrderLineResource
      SetOrderLineDefaultValues
      OrderOrder
      Tic
      CheckDeliveryBuilding
      ConfirmOrder
      Tic
      CheckOrderRule
      CheckOrderSimulation
      CheckDeliveryBuilding
      AddPackingListContainer
      AddPackingListContainerLine
      SetContainerLineFullQuantity
      Tic
      CheckPackingListIsPacked
      SetReadyPackingList
      Tic
      StartPackingList
    > CheckInvoicingRule
      CheckInvoiceTransactionRule
      Tic
      CheckInvoiceBuilding
      DecreaseInvoiceLineQuantity
      CheckInvoiceIsDivergent
      CheckInvoiceIsCalculating
      SplitAndDeferInvoice
      Tic
      CheckInvoiceIsNotDivergent
      CheckInvoiceIsSolved
      CheckInvoiceSplitted
      CheckPackingListIsNotDivergent
      CheckPackingListIsSolved
      CheckInvoiceTransactionRule
      RebuildAndCheckNothingIsCreated
      CheckInvoicesConsistency
  File "/home/buildbot/buildbot_slave/full.Zelenium/build/unit_test/Products/ERP5Type/tests/Sequence.py", line 99, in play
    method(sequence=sequence)
  File "/home/buildbot/buildbot_slave/full.Zelenium/build/unit_test/Products/ERP5/tests/testInvoice.py", line 482, in stepCheckInvoicingRule
    self.assertEquals(len(temp_invoicing_rule_list), 1)
AssertionError: 0 != 1



FAIL: test_09_InvoiceChangeStartDateFail (testInvoice.TestInvoice)
----------------------------------------------------------------------
Traceback (most recent call last):
  File "/usr/lib/erp5/lib/python/Testing/ZopeTestCase/profiler.py", line 98, in __call__
    testMethod()
  File "/home/buildbot/buildbot_slave/full.Zelenium/build/unit_test/Products/ERP5/tests/testInvoice.py", line 1414, in test_09_InvoiceChangeStartDateFail
    self.playSequence(sequence, quiet=quiet)
  File "/home/buildbot/buildbot_slave/full.Zelenium/build/unit_test/Products/ERP5/tests/testAccountingRules.py", line 102, in playSequence
    sequence_list.play(self, quiet=quiet)
  File "/home/buildbot/buildbot_slave/full.Zelenium/build/unit_test/Products/ERP5Type/tests/Sequence.py", line 166, in play
    sequence.play(context, sequence_number=i, quiet=quiet)
  File "/home/buildbot/buildbot_slave/full.Zelenium/build/unit_test/Products/ERP5Type/tests/Sequence.py", line 113, in play
    step.play(context, sequence=self, quiet=quiet)
    Current Sequence:
      CreateEntities
      CreateCurrency
      CreateSaleInvoiceTransactionRule
      CreateOrder
      SetOrderProfile
      SetOrderPriceCurrency
      CreateNotVariatedResource
      Tic
      CreateOrderLine
      SetOrderLineResource
      SetOrderLineDefaultValues
      OrderOrder
      Tic
      CheckDeliveryBuilding
      ConfirmOrder
      Tic
      CheckOrderRule
      CheckOrderSimulation
      CheckDeliveryBuilding
      AddPackingListContainer
      AddPackingListContainerLine
      SetContainerLineFullQuantity
      Tic
      CheckPackingListIsPacked
      SetReadyPackingList
      Tic
      StartPackingList
    > CheckInvoicingRule
      CheckInvoiceTransactionRule
      Tic
      CheckInvoiceBuilding
      ChangeInvoiceStartDate
      CheckInvoiceIsDivergent
      CheckInvoiceIsCalculating
      AcceptDecisionInvoice
      Tic
      CheckInvoiceNotSplitted
      CheckInvoiceIsNotDivergent
      CheckInvoiceIsSolved
      CheckPackingListIsDivergent
  File "/home/buildbot/buildbot_slave/full.Zelenium/build/unit_test/Products/ERP5Type/tests/Sequence.py", line 99, in play
    method(sequence=sequence)
  File "/home/buildbot/buildbot_slave/full.Zelenium/build/unit_test/Products/ERP5/tests/testInvoice.py", line 482, in stepCheckInvoicingRule
    self.assertEquals(len(temp_invoicing_rule_list), 1)
AssertionError: 0 != 1



FAIL: test_09b_InvoiceChangeStartDateSucceed (testInvoice.TestInvoice)
----------------------------------------------------------------------
Traceback (most recent call last):
  File "/usr/lib/erp5/lib/python/Testing/ZopeTestCase/profiler.py", line 98, in __call__
    testMethod()
  File "/home/buildbot/buildbot_slave/full.Zelenium/build/unit_test/Products/ERP5/tests/testInvoice.py", line 1458, in test_09b_InvoiceChangeStartDateSucceed
    self.playSequence(sequence, quiet=quiet)
  File "/home/buildbot/buildbot_slave/full.Zelenium/build/unit_test/Products/ERP5/tests/testAccountingRules.py", line 102, in playSequence
    sequence_list.play(self, quiet=quiet)
  File "/home/buildbot/buildbot_slave/full.Zelenium/build/unit_test/Products/ERP5Type/tests/Sequence.py", line 166, in play
    sequence.play(context, sequence_number=i, quiet=quiet)
  File "/home/buildbot/buildbot_slave/full.Zelenium/build/unit_test/Products/ERP5Type/tests/Sequence.py", line 113, in play
    step.play(context, sequence=self, quiet=quiet)
    Current Sequence:
      CreateEntities
      CreateCurrency
      CreateSaleInvoiceTransactionRule
      CreateOrder
      SetOrderProfile
      SetOrderPriceCurrency
      CreateNotVariatedResource
      Tic
      CreateOrderLine
      SetOrderLineResource
      SetOrderLineDefaultValues
      OrderOrder
      Tic
      CheckDeliveryBuilding
      ConfirmOrder
      Tic
      CheckOrderRule
      CheckOrderSimulation
      CheckDeliveryBuilding
      AddPackingListContainer
      AddPackingListContainerLine
      SetContainerLineFullQuantity
      Tic
      CheckPackingListIsPacked
      SetReadyPackingList
      Tic
      StartPackingList
    > CheckInvoicingRule
      CheckInvoiceTransactionRule
      Tic
      CheckInvoiceBuilding
      StopPackingList
      Tic
      DeliverPackingList
      Tic
      ChangeInvoiceStartDate
      CheckInvoiceIsDivergent
      CheckInvoiceIsCalculating
      AcceptDecisionInvoice
      Tic
      CheckInvoiceNotSplitted
      CheckInvoiceIsNotDivergent
      CheckInvoiceIsSolved
      CheckPackingListIsNotDivergent
      CheckPackingListIsSolved
      CheckInvoiceTransactionRule
      RebuildAndCheckNothingIsCreated
      CheckInvoicesConsistency
  File "/home/buildbot/buildbot_slave/full.Zelenium/build/unit_test/Products/ERP5Type/tests/Sequence.py", line 99, in play
    method(sequence=sequence)
  File "/home/buildbot/buildbot_slave/full.Zelenium/build/unit_test/Products/ERP5/tests/testInvoice.py", line 482, in stepCheckInvoicingRule
    self.assertEquals(len(temp_invoicing_rule_list), 1)
AssertionError: 0 != 1



FAIL: test_10_AcceptDecisionOnPackingList (testInvoice.TestInvoice)
----------------------------------------------------------------------
Traceback (most recent call last):
  File "/usr/lib/erp5/lib/python/Testing/ZopeTestCase/profiler.py", line 98, in __call__
    testMethod()
  File "/home/buildbot/buildbot_slave/full.Zelenium/build/unit_test/Products/ERP5/tests/testInvoice.py", line 1522, in test_10_AcceptDecisionOnPackingList
    sequence_list.play(self, quiet=quiet)
  File "/home/buildbot/buildbot_slave/full.Zelenium/build/unit_test/Products/ERP5Type/tests/Sequence.py", line 166, in play
    sequence.play(context, sequence_number=i, quiet=quiet)
  File "/home/buildbot/buildbot_slave/full.Zelenium/build/unit_test/Products/ERP5Type/tests/Sequence.py", line 113, in play
    step.play(context, sequence=self, quiet=quiet)
    Current Sequence:
      CreateEntities
      CreateCurrency
      CreateSaleInvoiceTransactionRule
      CreateOrder
      SetOrderProfile
      SetOrderPriceCurrency
      CreateNotVariatedResource
      Tic
      CreateOrderLine
      SetOrderLineResource
      SetOrderLineDefaultValues
      OrderOrder
      Tic
      CheckDeliveryBuilding
      ConfirmOrder
      Tic
      CheckOrderRule
      CheckOrderSimulation
      CheckDeliveryBuilding
      AddPackingListContainer
      AddPackingListContainerLine
      SetContainerLineFullQuantity
      Tic
      CheckPackingListIsPacked
    > CheckInvoicingRule
      DecreasePackingListLineQuantity
      SetContainerFullQuantity
      CheckPackingListIsCalculating
      AcceptDecisionPackingList
      Tic
      CheckPackingListIsSolved
      CheckPackingListNotSplitted
      SetReadyPackingList
      Tic
      StartPackingList
      CheckInvoicingRule
      CheckInvoiceTransactionRule
      Tic
      CheckInvoiceBuilding
      StopPackingList
      Tic
      DeliverPackingList
      Tic
      CheckPackingListIsNotDivergent
      CheckPackingListIsSolved
      CheckInvoiceTransactionRule
      ConfirmInvoice
      Tic
      StopInvoice
      Tic
      DeliverInvoice
      Tic
      CheckInvoiceNotSplitted
      CheckInvoiceIsNotDivergent
      CheckInvoiceIsSolved
      RebuildAndCheckNothingIsCreated
      CheckInvoicesConsistency
  File "/home/buildbot/buildbot_slave/full.Zelenium/build/unit_test/Products/ERP5Type/tests/Sequence.py", line 99, in play
    method(sequence=sequence)
  File "/home/buildbot/buildbot_slave/full.Zelenium/build/unit_test/Products/ERP5/tests/testInvoice.py", line 482, in stepCheckInvoicingRule
    self.assertEquals(len(temp_invoicing_rule_list), 1)
AssertionError: 0 != 1



FAIL: test_11_AcceptDecisionOnPackingListAndInvoice (testInvoice.TestInvoice)
----------------------------------------------------------------------
Traceback (most recent call last):
  File "/usr/lib/erp5/lib/python/Testing/ZopeTestCase/profiler.py", line 98, in __call__
    testMethod()
  File "/home/buildbot/buildbot_slave/full.Zelenium/build/unit_test/Products/ERP5/tests/testInvoice.py", line 1604, in test_11_AcceptDecisionOnPackingListAndInvoice
    sequence_list.play(self, quiet=quiet)
  File "/home/buildbot/buildbot_slave/full.Zelenium/build/unit_test/Products/ERP5Type/tests/Sequence.py", line 166, in play
    sequence.play(context, sequence_number=i, quiet=quiet)
  File "/home/buildbot/buildbot_slave/full.Zelenium/build/unit_test/Products/ERP5Type/tests/Sequence.py", line 113, in play
    step.play(context, sequence=self, quiet=quiet)
    Current Sequence:
      CreateEntities
      CreateCurrency
      CreateSaleInvoiceTransactionRule
      CreateOrder
      SetOrderProfile
      SetOrderPriceCurrency
      CreateNotVariatedResource
      Tic
      CreateOrderLine
      SetOrderLineResource
      SetOrderLineDefaultValues
      OrderOrder
      Tic
      CheckDeliveryBuilding
      ConfirmOrder
      Tic
      CheckOrderRule
      CheckOrderSimulation
      CheckDeliveryBuilding
      AddPackingListContainer
      AddPackingListContainerLine
      SetContainerLineFullQuantity
      Tic
      CheckPackingListIsPacked
    > CheckInvoicingRule
      DecreasePackingListLineQuantity
      SetContainerFullQuantity
      CheckPackingListIsCalculating
      AcceptDecisionPackingList
      Tic
      CheckPackingListIsSolved
      CheckPackingListNotSplitted
      SetReadyPackingList
      Tic
      StartPackingList
      CheckInvoicingRule
      CheckInvoiceTransactionRule
      Tic
      CheckInvoiceBuilding
      StopPackingList
      Tic
      DeliverPackingList
      Tic
      CheckPackingListIsNotDivergent
      CheckPackingListIsSolved
      CheckInvoiceTransactionRule
      IncreaseInvoiceLineQuantity
      Tic
      CheckInvoiceIsDiverged
      AcceptDecisionInvoice
      Tic
      ConfirmInvoice
      Tic
      StopInvoice
      Tic
      DeliverInvoice
      Tic
      CheckPackingListIsNotDivergent
      CheckPackingListIsSolved
      CheckInvoiceTransactionRule
      CheckInvoiceNotSplitted
      CheckInvoiceIsNotDivergent
      CheckInvoiceIsSolved
      RebuildAndCheckNothingIsCreated
      CheckInvoicesConsistency
  File "/home/buildbot/buildbot_slave/full.Zelenium/build/unit_test/Products/ERP5Type/tests/Sequence.py", line 99, in play
    method(sequence=sequence)
  File "/home/buildbot/buildbot_slave/full.Zelenium/build/unit_test/Products/ERP5/tests/testInvoice.py", line 482, in stepCheckInvoicingRule
    self.assertEquals(len(temp_invoicing_rule_list), 1)
AssertionError: 0 != 1



FAIL: test_12_SplitPackingListAndAcceptInvoice (testInvoice.TestInvoice)
----------------------------------------------------------------------
Traceback (most recent call last):
  File "/usr/lib/erp5/lib/python/Testing/ZopeTestCase/profiler.py", line 98, in __call__
    testMethod()
  File "/home/buildbot/buildbot_slave/full.Zelenium/build/unit_test/Products/ERP5/tests/testInvoice.py", line 1712, in test_12_SplitPackingListAndAcceptInvoice
    self.playSequence(sequence, quiet=quiet)
  File "/home/buildbot/buildbot_slave/full.Zelenium/build/unit_test/Products/ERP5/tests/testAccountingRules.py", line 102, in playSequence
    sequence_list.play(self, quiet=quiet)
  File "/home/buildbot/buildbot_slave/full.Zelenium/build/unit_test/Products/ERP5Type/tests/Sequence.py", line 166, in play
    sequence.play(context, sequence_number=i, quiet=quiet)
  File "/home/buildbot/buildbot_slave/full.Zelenium/build/unit_test/Products/ERP5Type/tests/Sequence.py", line 113, in play
    step.play(context, sequence=self, quiet=quiet)
    Current Sequence:
      CreateEntities
      CreateCurrency
      CreateSaleInvoiceTransactionRule
      CreateOrder
      SetOrderProfile
      SetOrderPriceCurrency
      CreateNotVariatedResource
      Tic
      CreateOrderLine
      SetOrderLineResource
      SetOrderLineDefaultValues
      OrderOrder
      Tic
      CheckDeliveryBuilding
      ConfirmOrder
      Tic
      CheckOrderRule
      CheckOrderSimulation
      CheckDeliveryBuilding
      AddPackingListContainer
      AddPackingListContainerLine
      SetContainerLineFullQuantity
      Tic
      CheckPackingListIsPacked
    > CheckInvoicingRule
      DecreasePackingListLineQuantity
      SetContainerFullQuantity
      CheckPackingListIsCalculating
      SplitAndDeferPackingList
      Tic
      CheckPackingListIsSolved
      CheckPackingListSplitted
      SetReadyPackingList
      Tic
      StartPackingList
      CheckInvoicingRule
      CheckInvoiceTransactionRule
      Tic
      CheckInvoiceBuilding
      StopPackingList
      Tic
      DeliverPackingList
      Tic
      CheckPackingListIsSolved
      CheckPackingListSplitted
      IncreaseInvoiceLineQuantity
      CheckInvoiceIsCalculating
      AcceptDecisionInvoice
      Tic
      ConfirmInvoice
      Tic
      StopInvoice
      Tic
      DeliverInvoice
      Tic
      CheckInvoiceIsSolved
      CheckInvoiceNotSplitted
      CheckPackingListIsNotDivergent
      CheckPackingListIsSolved
      CheckInvoiceTransactionRule
      RebuildAndCheckNothingIsCreated
      CheckInvoicesConsistency
      SwitchPackingLists
      AddPackingListContainer
      SetContainerFullQuantity
      Tic
      CheckPackingListIsSolved
      SetReadyPackingList
      Tic
      StartPackingList
      CheckInvoicingRule
      CheckInvoiceTransactionRule
      Tic
      CheckInvoiceBuilding
      StopPackingList
      Tic
      DeliverPackingList
      Tic
      CheckPackingListIsSolved
      SetInvoiceLineQuantityToZero
      CheckInvoiceIsCalculating
      AcceptDecisionInvoice
      Tic
      ConfirmInvoice
      Tic
      StopInvoice
      Tic
      DeliverInvoice
      Tic
      CheckInvoiceIsSolved
      CheckInvoiceNotSplitted
      CheckPackingListIsNotDivergent
      CheckPackingListIsSolved
      CheckInvoiceTransactionRule
      RebuildAndCheckNothingIsCreated
      CheckInvoicesConsistency
  File "/home/buildbot/buildbot_slave/full.Zelenium/build/unit_test/Products/ERP5Type/tests/Sequence.py", line 99, in play
    method(sequence=sequence)
  File "/home/buildbot/buildbot_slave/full.Zelenium/build/unit_test/Products/ERP5/tests/testInvoice.py", line 482, in stepCheckInvoicingRule
    self.assertEquals(len(temp_invoicing_rule_list), 1)
AssertionError: 0 != 1



FAIL: test_13_SplitAndDeferInvoice (testInvoice.TestInvoice)
----------------------------------------------------------------------
Traceback (most recent call last):
  File "/usr/lib/erp5/lib/python/Testing/ZopeTestCase/profiler.py", line 98, in __call__
    testMethod()
  File "/home/buildbot/buildbot_slave/full.Zelenium/build/unit_test/Products/ERP5/tests/testInvoice.py", line 1781, in test_13_SplitAndDeferInvoice
    self.playSequence(sequence, quiet=quiet)
  File "/home/buildbot/buildbot_slave/full.Zelenium/build/unit_test/Products/ERP5/tests/testAccountingRules.py", line 102, in playSequence
    sequence_list.play(self, quiet=quiet)
  File "/home/buildbot/buildbot_slave/full.Zelenium/build/unit_test/Products/ERP5Type/tests/Sequence.py", line 166, in play
    sequence.play(context, sequence_number=i, quiet=quiet)
  File "/home/buildbot/buildbot_slave/full.Zelenium/build/unit_test/Products/ERP5Type/tests/Sequence.py", line 113, in play
    step.play(context, sequence=self, quiet=quiet)
    Current Sequence:
      CreateEntities
      CreateCurrency
      CreateSaleInvoiceTransactionRule
      CreateOrder
      SetOrderProfile
      SetOrderPriceCurrency
      CreateNotVariatedResource
      Tic
      CreateOrderLine
      SetOrderLineResource
      SetOrderLineDefaultValues
      OrderOrder
      Tic
      CheckDeliveryBuilding
      ConfirmOrder
      Tic
      CheckOrderRule
      CheckOrderSimulation
      CheckDeliveryBuilding
      AddPackingListContainer
      AddPackingListContainerLine
      SetContainerLineFullQuantity
      Tic
      CheckPackingListIsPacked
      SetReadyPackingList
      Tic
      StartPackingList
    > CheckInvoicingRule
      CheckInvoiceTransactionRule
      Tic
      CheckInvoiceBuilding
      StopPackingList
      Tic
      DeliverPackingList
      Tic
      CheckPackingListIsSolved
      CheckPackingListNotSplitted
      DecreaseInvoiceLineQuantity
      CheckInvoiceIsDivergent
      CheckInvoiceIsCalculating
      SplitAndDeferInvoice
      Tic
      ConfirmInvoice
      Tic
      StopInvoice
      Tic
      DeliverInvoice
      Tic
      CheckInvoiceIsNotDivergent
      CheckInvoiceIsSolved
      CheckInvoiceSplitted
      RebuildAndCheckNothingIsCreated
      CheckInvoicesConsistency
      CheckPackingListIsNotDivergent
      CheckPackingListIsSolved
      CheckInvoiceTransactionRule
      SwitchInvoices
      ConfirmInvoice
      Tic
      StopInvoice
      Tic
      DeliverInvoice
      Tic
      CheckInvoiceIsNotDivergent
      CheckInvoiceIsSolved
      RebuildAndCheckNothingIsCreated
      CheckInvoicesConsistency
  File "/home/buildbot/buildbot_slave/full.Zelenium/build/unit_test/Products/ERP5Type/tests/Sequence.py", line 99, in play
    method(sequence=sequence)
  File "/home/buildbot/buildbot_slave/full.Zelenium/build/unit_test/Products/ERP5/tests/testInvoice.py", line 482, in stepCheckInvoicingRule
    self.assertEquals(len(temp_invoicing_rule_list), 1)
AssertionError: 0 != 1



FAIL: test_14_AcceptDecisionOnInvoice (testInvoice.TestInvoice)
----------------------------------------------------------------------
Traceback (most recent call last):
  File "/usr/lib/erp5/lib/python/Testing/ZopeTestCase/profiler.py", line 98, in __call__
    testMethod()
  File "/home/buildbot/buildbot_slave/full.Zelenium/build/unit_test/Products/ERP5/tests/testInvoice.py", line 1847, in test_14_AcceptDecisionOnInvoice
    sequence_list.play(self, quiet=quiet)
  File "/home/buildbot/buildbot_slave/full.Zelenium/build/unit_test/Products/ERP5Type/tests/Sequence.py", line 166, in play
    sequence.play(context, sequence_number=i, quiet=quiet)
  File "/home/buildbot/buildbot_slave/full.Zelenium/build/unit_test/Products/ERP5Type/tests/Sequence.py", line 113, in play
    step.play(context, sequence=self, quiet=quiet)
    Current Sequence:
      CreateEntities
      CreateCurrency
      CreateSaleInvoiceTransactionRule
      CreateOrder
      SetOrderProfile
      SetOrderPriceCurrency
      CreateNotVariatedResource
      Tic
      CreateOrderLine
      SetOrderLineResource
      SetOrderLineDefaultValues
      OrderOrder
      Tic
      CheckDeliveryBuilding
      ConfirmOrder
      Tic
      CheckOrderRule
      CheckOrderSimulation
      CheckDeliveryBuilding
      AddPackingListContainer
      AddPackingListContainerLine
      SetContainerLineFullQuantity
      Tic
      CheckPackingListIsPacked
      SetReadyPackingList
      Tic
      StartPackingList
    > CheckInvoicingRule
      CheckInvoiceTransactionRule
      Tic
      CheckInvoiceBuilding
      StopPackingList
      Tic
      DeliverPackingList
      Tic
      CheckPackingListIsSolved
      CheckPackingListNotSplitted
      DecreaseInvoiceLineQuantity
      CheckInvoiceIsDivergent
      CheckInvoiceIsCalculating
      AcceptDecisionInvoice
      Tic
      ConfirmInvoice
      Tic
      StopInvoice
      Tic
      DeliverInvoice
      Tic
      CheckPackingListIsNotDivergent
      CheckPackingListIsSolved
      CheckInvoiceTransactionRule
      CheckInvoiceNotSplitted
      CheckInvoiceIsNotDivergent
      CheckInvoiceIsSolved
      RebuildAndCheckNothingIsCreated
      CheckInvoicesConsistency
  File "/home/buildbot/buildbot_slave/full.Zelenium/build/unit_test/Products/ERP5Type/tests/Sequence.py", line 99, in play
    method(sequence=sequence)
  File "/home/buildbot/buildbot_slave/full.Zelenium/build/unit_test/Products/ERP5/tests/testInvoice.py", line 482, in stepCheckInvoicingRule
    self.assertEquals(len(temp_invoicing_rule_list), 1)
AssertionError: 0 != 1



FAIL: test_16_ManuallyAddedMovements (testInvoice.TestInvoice)
----------------------------------------------------------------------
Traceback (most recent call last):
  File "/usr/lib/erp5/lib/python/Testing/ZopeTestCase/profiler.py", line 98, in __call__
    testMethod()
  File "/home/buildbot/buildbot_slave/full.Zelenium/build/unit_test/Products/ERP5/tests/testInvoice.py", line 1898, in test_16_ManuallyAddedMovements
    sequence_list.play(self, quiet=quiet)
  File "/home/buildbot/buildbot_slave/full.Zelenium/build/unit_test/Products/ERP5Type/tests/Sequence.py", line 166, in play
    sequence.play(context, sequence_number=i, quiet=quiet)
  File "/home/buildbot/buildbot_slave/full.Zelenium/build/unit_test/Products/ERP5Type/tests/Sequence.py", line 113, in play
    step.play(context, sequence=self, quiet=quiet)
    Current Sequence:
      CreateEntities
      CreateCurrency
      CreateSaleInvoiceTransactionRule
      CreateOrder
      SetOrderProfile
      SetOrderPriceCurrency
      CreateNotVariatedResource
      Tic
      CreateOrderLine
      SetOrderLineResource
      SetOrderLineDefaultValues
      OrderOrder
      Tic
      CheckDeliveryBuilding
      ConfirmOrder
      Tic
      CheckOrderRule
      CheckOrderSimulation
      CheckDeliveryBuilding
      AddPackingListContainer
      AddPackingListContainerLine
      SetContainerLineFullQuantity
      Tic
      CheckPackingListIsPacked
      SetReadyPackingList
      Tic
      StartPackingList
    > CheckInvoicingRule
      Tic
      CheckInvoiceBuilding
      RebuildAndCheckNothingIsCreated
      CheckInvoicesConsistency
      AddInvoiceLines
      Tic
      ConfirmInvoice
      Tic
      CheckSimulationTrees
  File "/home/buildbot/buildbot_slave/full.Zelenium/build/unit_test/Products/ERP5Type/tests/Sequence.py", line 99, in play
    method(sequence=sequence)
  File "/home/buildbot/buildbot_slave/full.Zelenium/build/unit_test/Products/ERP5/tests/testInvoice.py", line 482, in stepCheckInvoicingRule
    self.assertEquals(len(temp_invoicing_rule_list), 1)
AssertionError: 0 != 1



FAIL: test_17_ManuallyAddedWrongMovements (testInvoice.TestInvoice)
----------------------------------------------------------------------
Traceback (most recent call last):
  File "/usr/lib/erp5/lib/python/Testing/ZopeTestCase/profiler.py", line 98, in __call__
    testMethod()
  File "/home/buildbot/buildbot_slave/full.Zelenium/build/unit_test/Products/ERP5/tests/testInvoice.py", line 1925, in test_17_ManuallyAddedWrongMovements
    sequence_list.play(self, quiet=quiet)
  File "/home/buildbot/buildbot_slave/full.Zelenium/build/unit_test/Products/ERP5Type/tests/Sequence.py", line 166, in play
    sequence.play(context, sequence_number=i, quiet=quiet)
  File "/home/buildbot/buildbot_slave/full.Zelenium/build/unit_test/Products/ERP5Type/tests/Sequence.py", line 113, in play
    step.play(context, sequence=self, quiet=quiet)
    Current Sequence:
      CreateEntities
      CreateCurrency
      CreateSaleInvoiceTransactionRule
      CreateOrder
      SetOrderProfile
      SetOrderPriceCurrency
      CreateNotVariatedResource
      Tic
      CreateOrderLine
      SetOrderLineResource
      SetOrderLineDefaultValues
      OrderOrder
      Tic
      CheckDeliveryBuilding
      ConfirmOrder
      Tic
      CheckOrderRule
      CheckOrderSimulation
      CheckDeliveryBuilding
      AddPackingListContainer
      AddPackingListContainerLine
      SetContainerLineFullQuantity
      Tic
      CheckPackingListIsPacked
      SetReadyPackingList
      Tic
      StartPackingList
    > CheckInvoicingRule
      Tic
      CheckInvoiceBuilding
      AddWrongInvoiceLines
      Tic
      ConfirmInvoice
      CheckConfirmInvoiceFails
      CheckSimulationTrees
  File "/home/buildbot/buildbot_slave/full.Zelenium/build/unit_test/Products/ERP5Type/tests/Sequence.py", line 99, in play
    method(sequence=sequence)
  File "/home/buildbot/buildbot_slave/full.Zelenium/build/unit_test/Products/ERP5/tests/testInvoice.py", line 482, in stepCheckInvoicingRule
    self.assertEquals(len(temp_invoicing_rule_list), 1)
AssertionError: 0 != 1



FAIL: Test VAT for an invoice that cames from a packing list with two
----------------------------------------------------------------------
Traceback (most recent call last):
  File "/usr/lib/erp5/lib/python/Testing/ZopeTestCase/profiler.py", line 98, in __call__
    testMethod()
  File "/home/buildbot/buildbot_slave/full.Zelenium/build/unit_test/Products/ERP5/tests/testInvoiceVAT.py", line 466, in test_InvoiceTwoLinesWithSameResource
    self.assertNotEquals(invoice, None)
AssertionError: None == None



FAIL: Test VAT for an invoice that cames from a packing list with two
----------------------------------------------------------------------
Traceback (most recent call last):
  File "/usr/lib/erp5/lib/python/Testing/ZopeTestCase/profiler.py", line 98, in __call__
    testMethod()
  File "/home/buildbot/buildbot_slave/full.Zelenium/build/unit_test/Products/ERP5/tests/testInvoiceVAT.py", line 498, in test_InvoiceTwoLinesWithSameResourceDifferentDate
    self.assertNotEquals(invoice, None)
AssertionError: None == None



FAIL: Test VAT for a simple invoice created directly.
----------------------------------------------------------------------
Traceback (most recent call last):
  File "/usr/lib/erp5/lib/python/Testing/ZopeTestCase/profiler.py", line 98, in __call__
    testMethod()
  File "/home/buildbot/buildbot_slave/full.Zelenium/build/unit_test/Products/ERP5/tests/testInvoiceVAT.py", line 382, in test_SimpleInvoice
    total_vat_amount)
  File "/home/buildbot/buildbot_slave/full.Zelenium/build/unit_test/Products/ERP5/tests/testInvoiceVAT.py", line 340, in _checkInvoiceVAT
    self.assertEquals(vat_info['total'], total_vat_amount)
AssertionError: 0 != 200.0



FAIL: Test VAT for a simple invoice created directly; empty lines should not
----------------------------------------------------------------------
Traceback (most recent call last):
  File "/usr/lib/erp5/lib/python/Testing/ZopeTestCase/profiler.py", line 98, in __call__
    testMethod()
  File "/home/buildbot/buildbot_slave/full.Zelenium/build/unit_test/Products/ERP5/tests/testInvoiceVAT.py", line 407, in test_SimpleInvoiceEmptyLines
    total_vat_amount)
  File "/home/buildbot/buildbot_slave/full.Zelenium/build/unit_test/Products/ERP5/tests/testInvoiceVAT.py", line 340, in _checkInvoiceVAT
    self.assertEquals(vat_info['total'], total_vat_amount)
AssertionError: 0 != 200.0



FAIL: test_translated_accessors (testERP5Type.TestERP5Type)
----------------------------------------------------------------------
Traceback (most recent call last):
  File "/usr/lib/erp5/lib/python/Testing/ZopeTestCase/profiler.py", line 98, in __call__
    testMethod()
  File "/home/buildbot/buildbot_slave/full.Zelenium/build/Products/ERP5Type/tests/testERP5Type.py", line 1811, in test_translated_accessors
    self.assertEquals(['foo'], self.portal.Localizer.erp5_ui._translated)
AssertionError: ['foo'] != ['Purchase Order Cell', 'Delivery Cell', 'Purchase Order Line', 'Purchase Order Cell', 'Sale Order Cell', 'Purchase Order Line', 'Sale Order Line', 'Sale Order Cell', 'Container Line', 'Container Cell', 'Delivery Cell', 'Container Line', 'Internal Packing List Cell', 'Delivery Cell', 'Internal Packing List Line', 'Internal Packing List Cell', 'Inventory Cell', 'Internal Packing List Line', 'Inventory Line', 'Inventory Cell', 'Purchase Packing List Cell', 'Inventory Line', 'Purchase Packing List Line', 'Purchase Packing List Cell', 'Returned Sale Packing List Cell', 'Purchase Packing List Line', 'Returned Sale Packing List Line', 'Returned Sale Packing List Cell', 'Sale Packing List Cell', 'Returned Sale Packing List Line', 'Sale Packing List Line', 'Sale Packing List Cell', 'Accounting Transaction Line', 'Sale Packing List Line', 'Accounting Transaction Line', 'Inventory Line', 'Accounting Transaction Line', 'Internal Packing List Cell', 'Accounting Transaction Line', 'Container Line', 'Accounting Transaction Line', 'Container Cell', 'Balance Transaction Line', 'Inventory Line', 'Balance Transaction Line', 'Delivery Cell', 'Balance Transaction Line', 'Container Cell', 'Balance Transaction Line', 'Accounting Transaction Line', 'Purchase Invoice Transaction Line', 'Inventory Cell', 'Purchase Invoice Transaction Line', 'Returned Sale Packing List Cell', 'Purchase Invoice Transaction Line', 'Purchase Packing List Cell', 'Purchase Invoice Transaction Line', 'Inventory Line', 'Sale Invoice Transaction Line', 'Inventory Line', 'Sale Invoice Transaction Line', 'Returned Sale Packing List Cell', 'Sale Invoice Transaction Line', 'Sale Packing List Cell', 'Sale Invoice Transaction Line', 'Returned Sale Packing List Line', 'Inventory Line', 'Inventory Cell', 'Inventory', 'Internal Packing List', 'Purchase Packing List', 'Inventory', 'Returned Sale Packing List', 'Purchase Packing List', 'Sale Packing List', 'Returned Sale Packing List', 'Accounting Transaction', 'Sale Packing List', 'Accounting Transaction', 'Purchase Packing List', 'Accounting Transaction', 'Inventory', 'Accounting Transaction', 'Internal Packing List', 'Balance Transaction', 'Purchase Packing List', 'Balance Transaction', 'Internal Packing List', 'Balance Transaction', 'Accounting Transaction', 'Payment Transaction', 'Inventory', 'Payment Transaction', 'Returned Sale Packing List', 'Payment Transaction', 'Purchase Packing List', 'Purchase Invoice Transaction', 'Payment Transaction', 'Purchase Invoice Transaction', 'Returned Sale Packing List', 'Purchase Invoice Transaction', 'Purchase Packing List', 'Sale Invoice Transaction', 'Payment Transaction', 'Sale Invoice Transaction', 'Returned Sale Packing List', 'Sale Invoice Transaction', 'Sale Packing List', 'Sale Order', 'Purchase Order', 'Sale Invoice Transaction', 'Purchase Invoice Transaction', 'Sale Supply', 'Purchase Supply', u'foo']



FAIL: test_08_EmbeddedDocumentState (testDms.TestDocument)
----------------------------------------------------------------------
Traceback (most recent call last):
  File "/usr/lib/erp5/lib/python/Testing/ZopeTestCase/profiler.py", line 98, in __call__
    testMethod()
  File "/home/buildbot/buildbot_slave/full.Zelenium/build/unit_test/Products/ERP5OOo/tests/testDms.py", line 650, in test_08_EmbeddedDocumentState
    self.assertEquals(1, len(image_list))
AssertionError: 1 != 0



FAIL: test_complex_query (testERP5Catalog.TestERP5Catalog)
----------------------------------------------------------------------
Traceback (most recent call last):
  File "/usr/lib/erp5/lib/python/Testing/ZopeTestCase/profiler.py", line 98, in __call__
    testMethod()
  File "/home/buildbot/buildbot_slave/full.Zelenium/build/unit_test/Products/ERP5Catalog/tests/testERP5Catalog.py", line 2175, in test_complex_query
    self.assertEqual(len(catalog(query=query)), 3)
AssertionError: 2 != 3



FAIL: test_02_disconnectionRobustness (testDeferredConnection.TestDeferredConnection)
----------------------------------------------------------------------
Traceback (most recent call last):
  File "/usr/lib/erp5/lib/python/Testing/ZopeTestCase/profiler.py", line 98, in __call__
    testMethod()
  File "/home/buildbot/buildbot_slave/full.Zelenium/build/unit_test/Products/ZMySQLDDA/tests/testDeferredConnection.py", line 177, in test_02_disconnectionRobustness
    self.fail()
AssertionError



ERROR: test_05_basicVCardSynchronization (testERP5SyncMLVCard.TestERP5SyncMLVCard)
----------------------------------------------------------------------
Traceback (most recent call last):
  File "/usr/lib/erp5/lib/python/Testing/ZopeTestCase/profiler.py", line 98, in __call__
    testMethod()
  File "/home/buildbot/buildbot_slave/full.Zelenium/build/unit_test/Products/ERP5SyncML/tests/testERP5SyncMLVCard.py", line 196, in test_05_basicVCardSynchronization
    person1_s = person_server._getOb('1') #The new person is added on the
  File "/home/buildbot/buildbot_slave/full.Zelenium/build/unit_test/Products/ERP5Type/Core/Folder.py", line 596, in _getOb
    return CMFBTreeFolder._getOb(self, id, *args, **kw)
  File "/usr/lib/erp5/lib/python/Products/BTreeFolder2/BTreeFolder2.py", line 210, in _getOb
    ob = tree[id]
KeyError: '1'



More information about the Erp5-report mailing list