[Erp5-report] ERP5 r18660: 6 Tests, 0 Errors, 3 Failures

nobody at nexedi.com nobody at nexedi.com
Fri Jan 11 12:21:23 CET 2008


Date : 2008-01-11

Revision: 18660
Ran Unit test of Performance
Ran 2 tests in 397.053s
FAILED (failures=1)

Ran Unit test of Performance
Ran 2 tests in 393.942s
FAILED (failures=1)

Ran Unit test of Performance
Ran 2 tests in 396.659s
FAILED (failures=1)

-------------- next part --------------
SOFTWARE_HOME: /initrd/loopfs/usr/lib/zope/lib/python
INSTANCE_HOME: /mnt/erp5_cd/zope/unit_test
Loading Zope, please stand by ./usr/lib/python2.4/whrandom.py:38: DeprecationWarning: the whrandom module is deprecated; please use the random module
  DeprecationWarning)
../usr/lib/zope/lib/python/Products/CMFMailIn/__init__.py:16: DeprecationWarning: The module, 'Products.CMFCore.CMFCorePermissions' is a deprecated compatiblity alias for 'Products.CMFCore.permissions';  please use the new module instead.
  from Products.CMFCore import utils, CMFCorePermissions
 done (2.206s)

Adding ERP5TypeTestCase user ... 
Adding erp5_portal_46b1242f30d521c53e744f4886ef0be0 ERP5 Site ... done (24.441s)
Adding erp5_base business template ... done (8.991s)
Adding erp5_ui_test business template ... done (5.574s)
Logout ... 
done (53.174s)
Ran Unit test of Performance
objective time to view object form 0.1120 < 0.1234 < 0.1220

Fnb objects = 000100
	add = 0.0070 < 0.0081 < 0.0090
	tic = 0.0260 < 0.0273 < 0.0355
	view = 0.1250 < 0.1529 < 0.1750

nb objects = 000200
	add = 0.0070 < 0.0080 < 0.0090
	tic = 0.0260 < 0.0279 < 0.0355
	view = 0.1497 < 0.1720 < 0.1997

nb objects = 000300
	add = 0.0070 < 0.0080 < 0.0090
	tic = 0.0260 < 0.0276 < 0.0355
	view = 0.1744 < 0.1944 < 0.2244

nb objects = 000400
	add = 0.0070 < 0.0081 < 0.0090
	tic = 0.0260 < 0.0276 < 0.0355
	view = 0.1992 < 0.2177 < 0.2492

nb objects = 000500
	add = 0.0070 < 0.0081 < 0.0090
	tic = 0.0260 < 0.0276 < 0.0355
	view = 0.2239 < 0.2413 < 0.2739

nb objects = 000600
	add = 0.0070 < 0.0081 < 0.0090
	tic = 0.0260 < 0.0277 < 0.0355
	view = 0.2486 < 0.2651 < 0.2986

nb objects = 000700
	add = 0.0070 < 0.0080 < 0.0090
	tic = 0.0260 < 0.0274 < 0.0355
	view = 0.2733 < 0.2888 < 0.3233

nb objects = 000800
	add = 0.0070 < 0.0081 < 0.0090
	tic = 0.0260 < 0.0275 < 0.0355
	view = 0.2980 < 0.3119 < 0.3480

nb objects = 000900
	add = 0.0070 < 0.0080 < 0.0090
	tic = 0.0260 < 0.0276 < 0.0355
	view = 0.3228 < 0.3353 < 0.3728

nb objects = 001000
	add = 0.0070 < 0.0080 < 0.0090
	tic = 0.0260 < 0.0275 < 0.0355
	view = 0.3475 < 0.3596 < 0.3975

.
======================================================================
FAIL: test_00_viewBarObject (testPerformance.TestPerformance)
----------------------------------------------------------------------
Traceback (most recent call last):
  File "/usr/lib/zope/lib/python/Testing/ZopeTestCase/profiler.py", line 80, in __call__
    testMethod()
  File "/mnt/erp5_cd/zope/Products/ERP5Type/tests/testPerformance.py", line 129, in test_00_viewBarObject
    prefix='objective')
  File "/mnt/erp5_cd/zope/Products/ERP5Type/tests/testPerformance.py", line 117, in checkViewBarObject
    '%.4f < %.4f < %.4f' % (min, req_time, max))
AssertionError: 0.1120 < 0.1234 < 0.1220

----------------------------------------------------------------------
Ran 2 tests in 397.053s

FAILED (failures=1)
SOFTWARE_HOME: /initrd/loopfs/usr/lib/zope/lib/python
INSTANCE_HOME: /mnt/erp5_cd/zope/unit_test
Loading Zope, please stand by ./usr/lib/python2.4/whrandom.py:38: DeprecationWarning: the whrandom module is deprecated; please use the random module
  DeprecationWarning)
../usr/lib/zope/lib/python/Products/CMFMailIn/__init__.py:16: DeprecationWarning: The module, 'Products.CMFCore.CMFCorePermissions' is a deprecated compatiblity alias for 'Products.CMFCore.permissions';  please use the new module instead.
  from Products.CMFCore import utils, CMFCorePermissions
 done (2.067s)

Adding ERP5TypeTestCase user ... 
Adding erp5_portal_46b1242f30d521c53e744f4886ef0be0 ERP5 Site ... done (23.585s)
Adding erp5_base business template ... done (9.085s)
Adding erp5_ui_test business template ... done (5.550s)
Logout ... 
done (52.057s)
Ran Unit test of Performance
objective time to view object form 0.1120 < 0.1234 < 0.1220

Fnb objects = 000100
	add = 0.0070 < 0.0081 < 0.0090
	tic = 0.0260 < 0.0272 < 0.0355
	view = 0.1250 < 0.1525 < 0.1750

nb objects = 000200
	add = 0.0070 < 0.0080 < 0.0090
	tic = 0.0260 < 0.0277 < 0.0355
	view = 0.1497 < 0.1713 < 0.1997

nb objects = 000300
	add = 0.0070 < 0.0081 < 0.0090
	tic = 0.0260 < 0.0273 < 0.0355
	view = 0.1744 < 0.1926 < 0.2244

nb objects = 000400
	add = 0.0070 < 0.0081 < 0.0090
	tic = 0.0260 < 0.0274 < 0.0355
	view = 0.1992 < 0.2167 < 0.2492

nb objects = 000500
	add = 0.0070 < 0.0081 < 0.0090
	tic = 0.0260 < 0.0277 < 0.0355
	view = 0.2239 < 0.2400 < 0.2739

nb objects = 000600
	add = 0.0070 < 0.0081 < 0.0090
	tic = 0.0260 < 0.0277 < 0.0355
	view = 0.2486 < 0.2627 < 0.2986

nb objects = 000700
	add = 0.0070 < 0.0081 < 0.0090
	tic = 0.0260 < 0.0275 < 0.0355
	view = 0.2733 < 0.2863 < 0.3233

nb objects = 000800
	add = 0.0070 < 0.0081 < 0.0090
	tic = 0.0260 < 0.0276 < 0.0355
	view = 0.2980 < 0.3092 < 0.3480

nb objects = 000900
	add = 0.0070 < 0.0081 < 0.0090
	tic = 0.0260 < 0.0274 < 0.0355
	view = 0.3228 < 0.3326 < 0.3728

nb objects = 001000
	add = 0.0070 < 0.0081 < 0.0090
	tic = 0.0260 < 0.0274 < 0.0355
	view = 0.3475 < 0.3571 < 0.3975

.
======================================================================
FAIL: test_00_viewBarObject (testPerformance.TestPerformance)
----------------------------------------------------------------------
Traceback (most recent call last):
  File "/usr/lib/zope/lib/python/Testing/ZopeTestCase/profiler.py", line 80, in __call__
    testMethod()
  File "/mnt/erp5_cd/zope/Products/ERP5Type/tests/testPerformance.py", line 129, in test_00_viewBarObject
    prefix='objective')
  File "/mnt/erp5_cd/zope/Products/ERP5Type/tests/testPerformance.py", line 117, in checkViewBarObject
    '%.4f < %.4f < %.4f' % (min, req_time, max))
AssertionError: 0.1120 < 0.1234 < 0.1220

----------------------------------------------------------------------
Ran 2 tests in 393.942s

FAILED (failures=1)
SOFTWARE_HOME: /initrd/loopfs/usr/lib/zope/lib/python
INSTANCE_HOME: /mnt/erp5_cd/zope/unit_test
Loading Zope, please stand by ./usr/lib/python2.4/whrandom.py:38: DeprecationWarning: the whrandom module is deprecated; please use the random module
  DeprecationWarning)
../usr/lib/zope/lib/python/Products/CMFMailIn/__init__.py:16: DeprecationWarning: The module, 'Products.CMFCore.CMFCorePermissions' is a deprecated compatiblity alias for 'Products.CMFCore.permissions';  please use the new module instead.
  from Products.CMFCore import utils, CMFCorePermissions
 done (1.655s)

Adding ERP5TypeTestCase user ... 
Adding erp5_portal_46b1242f30d521c53e744f4886ef0be0 ERP5 Site ... done (27.574s)
Adding erp5_base business template ... done (9.033s)
Adding erp5_ui_test business template ... done (5.526s)
Logout ... 
done (55.835s)
Ran Unit test of Performance
objective time to view object form 0.1120 < 0.1231 < 0.1220

Fnb objects = 000100
	add = 0.0070 < 0.0080 < 0.0090
	tic = 0.0260 < 0.0270 < 0.0355
	view = 0.1250 < 0.1519 < 0.1750

nb objects = 000200
	add = 0.0070 < 0.0079 < 0.0090
	tic = 0.0260 < 0.0275 < 0.0355
	view = 0.1497 < 0.1709 < 0.1997

nb objects = 000300
	add = 0.0070 < 0.0079 < 0.0090
	tic = 0.0260 < 0.0271 < 0.0355
	view = 0.1744 < 0.1918 < 0.2244

nb objects = 000400
	add = 0.0070 < 0.0080 < 0.0090
	tic = 0.0260 < 0.0272 < 0.0355
	view = 0.1992 < 0.2163 < 0.2492

nb objects = 000500
	add = 0.0070 < 0.0080 < 0.0090
	tic = 0.0260 < 0.0272 < 0.0355
	view = 0.2239 < 0.2393 < 0.2739

nb objects = 000600
	add = 0.0070 < 0.0080 < 0.0090
	tic = 0.0260 < 0.0272 < 0.0355
	view = 0.2486 < 0.2625 < 0.2986

nb objects = 000700
	add = 0.0070 < 0.0080 < 0.0090
	tic = 0.0260 < 0.0272 < 0.0355
	view = 0.2733 < 0.2860 < 0.3233

nb objects = 000800
	add = 0.0070 < 0.0080 < 0.0090
	tic = 0.0260 < 0.0272 < 0.0355
	view = 0.2980 < 0.3097 < 0.3480

nb objects = 000900
	add = 0.0070 < 0.0080 < 0.0090
	tic = 0.0260 < 0.0271 < 0.0355
	view = 0.3228 < 0.3325 < 0.3728

nb objects = 001000
	add = 0.0070 < 0.0079 < 0.0090
	tic = 0.0260 < 0.0272 < 0.0355
	view = 0.3475 < 0.3561 < 0.3975

.
======================================================================
FAIL: test_00_viewBarObject (testPerformance.TestPerformance)
----------------------------------------------------------------------
Traceback (most recent call last):
  File "/usr/lib/zope/lib/python/Testing/ZopeTestCase/profiler.py", line 80, in __call__
    testMethod()
  File "/mnt/erp5_cd/zope/Products/ERP5Type/tests/testPerformance.py", line 129, in test_00_viewBarObject
    prefix='objective')
  File "/mnt/erp5_cd/zope/Products/ERP5Type/tests/testPerformance.py", line 117, in checkViewBarObject
    '%.4f < %.4f < %.4f' % (min, req_time, max))
AssertionError: 0.1120 < 0.1231 < 0.1220

----------------------------------------------------------------------
Ran 2 tests in 396.659s

FAILED (failures=1)


More information about the Erp5-report mailing list