[Erp5-report] ERP5 r18558: 6 Tests, 0 Errors, 1 Failures

nobody at nexedi.com nobody at nexedi.com
Sun Dec 30 10:27:20 CET 2007


Date : 2007-12-30

Revision: 18558
Ran Unit test of Performance
Ran 2 tests in 389.100s
FAILED (failures=1)

Ran Unit test of Performance
Ran 2 tests in 388.151s
OK

Ran Unit test of Performance
Ran 2 tests in 388.557s
OK

-------------- next part --------------
SOFTWARE_HOME: /initrd/loopfs/usr/lib/zope/lib/python
INSTANCE_HOME: /mnt/erp5_cd/zope/unit_test
Loading Zope, please stand by ./usr/lib/python2.4/whrandom.py:38: DeprecationWarning: the whrandom module is deprecated; please use the random module
  DeprecationWarning)
../usr/lib/zope/lib/python/Products/CMFMailIn/__init__.py:16: DeprecationWarning: The module, 'Products.CMFCore.CMFCorePermissions' is a deprecated compatiblity alias for 'Products.CMFCore.permissions';  please use the new module instead.
  from Products.CMFCore import utils, CMFCorePermissions
 done (2.156s)

Adding ERP5TypeTestCase user ... 
Adding erp5_portal_46b1242f30d521c53e744f4886ef0be0 ERP5 Site ... done (23.109s)
Adding erp5_base business template ... done (8.978s)
Adding erp5_ui_test business template ... done (5.474s)
Logout ... 
done (50.948s)
Ran Unit test of Performance
objective time to view object form 0.1120 < 0.1224 < 0.1220

Fnb objects = 000100
	add = 0.0070 < 0.0081 < 0.0090
	tic = 0.0260 < 0.0274 < 0.0355
	view = 0.1250 < 0.1507 < 0.1750

nb objects = 000200
	add = 0.0070 < 0.0080 < 0.0090
	tic = 0.0260 < 0.0277 < 0.0355
	view = 0.1497 < 0.1692 < 0.1997

nb objects = 000300
	add = 0.0070 < 0.0080 < 0.0090
	tic = 0.0260 < 0.0274 < 0.0355
	view = 0.1744 < 0.1901 < 0.2244

nb objects = 000400
	add = 0.0070 < 0.0080 < 0.0090
	tic = 0.0260 < 0.0276 < 0.0355
	view = 0.1992 < 0.2144 < 0.2492

nb objects = 000500
	add = 0.0070 < 0.0080 < 0.0090
	tic = 0.0260 < 0.0274 < 0.0355
	view = 0.2239 < 0.2370 < 0.2739

nb objects = 000600
	add = 0.0070 < 0.0080 < 0.0090
	tic = 0.0260 < 0.0271 < 0.0355
	view = 0.2486 < 0.2603 < 0.2986

nb objects = 000700
	add = 0.0070 < 0.0080 < 0.0090
	tic = 0.0260 < 0.0276 < 0.0355
	view = 0.2733 < 0.2839 < 0.3233

nb objects = 000800
	add = 0.0070 < 0.0080 < 0.0090
	tic = 0.0260 < 0.0273 < 0.0355
	view = 0.2980 < 0.3065 < 0.3480

nb objects = 000900
	add = 0.0070 < 0.0080 < 0.0090
	tic = 0.0260 < 0.0274 < 0.0355
	view = 0.3228 < 0.3287 < 0.3728

nb objects = 001000
	add = 0.0070 < 0.0080 < 0.0090
	tic = 0.0260 < 0.0278 < 0.0355
	view = 0.3475 < 0.3528 < 0.3975

.
======================================================================
FAIL: test_00_viewBarObject (testPerformance.TestPerformance)
----------------------------------------------------------------------
Traceback (most recent call last):
  File "/usr/lib/zope/lib/python/Testing/ZopeTestCase/profiler.py", line 80, in __call__
    testMethod()
  File "/mnt/erp5_cd/zope/Products/ERP5Type/tests/testPerformance.py", line 129, in test_00_viewBarObject
    prefix='objective')
  File "/mnt/erp5_cd/zope/Products/ERP5Type/tests/testPerformance.py", line 117, in checkViewBarObject
    '%.4f < %.4f < %.4f' % (min, req_time, max))
AssertionError: 0.1120 < 0.1224 < 0.1220

----------------------------------------------------------------------
Ran 2 tests in 389.100s

FAILED (failures=1)
SOFTWARE_HOME: /initrd/loopfs/usr/lib/zope/lib/python
INSTANCE_HOME: /mnt/erp5_cd/zope/unit_test
Loading Zope, please stand by ./usr/lib/python2.4/whrandom.py:38: DeprecationWarning: the whrandom module is deprecated; please use the random module
  DeprecationWarning)
../usr/lib/zope/lib/python/Products/CMFMailIn/__init__.py:16: DeprecationWarning: The module, 'Products.CMFCore.CMFCorePermissions' is a deprecated compatiblity alias for 'Products.CMFCore.permissions';  please use the new module instead.
  from Products.CMFCore import utils, CMFCorePermissions
 done (1.649s)

Adding ERP5TypeTestCase user ... 
Adding erp5_portal_46b1242f30d521c53e744f4886ef0be0 ERP5 Site ... done (23.179s)
Adding erp5_base business template ... done (8.939s)
Adding erp5_ui_test business template ... done (5.490s)
Logout ... 
done (51.021s)
Ran Unit test of Performance
objective time to view object form 0.1120 < 0.1217 < 0.1220

.nb objects = 000100
	add = 0.0070 < 0.0081 < 0.0090
	tic = 0.0260 < 0.0273 < 0.0355
	view = 0.1250 < 0.1503 < 0.1750

nb objects = 000200
	add = 0.0070 < 0.0080 < 0.0090
	tic = 0.0260 < 0.0277 < 0.0355
	view = 0.1497 < 0.1687 < 0.1997

nb objects = 000300
	add = 0.0070 < 0.0080 < 0.0090
	tic = 0.0260 < 0.0274 < 0.0355
	view = 0.1744 < 0.1893 < 0.2244

nb objects = 000400
	add = 0.0070 < 0.0080 < 0.0090
	tic = 0.0260 < 0.0274 < 0.0355
	view = 0.1992 < 0.2131 < 0.2492

nb objects = 000500
	add = 0.0070 < 0.0080 < 0.0090
	tic = 0.0260 < 0.0276 < 0.0355
	view = 0.2239 < 0.2358 < 0.2739

nb objects = 000600
	add = 0.0070 < 0.0080 < 0.0090
	tic = 0.0260 < 0.0277 < 0.0355
	view = 0.2486 < 0.2584 < 0.2986

nb objects = 000700
	add = 0.0070 < 0.0080 < 0.0090
	tic = 0.0260 < 0.0274 < 0.0355
	view = 0.2733 < 0.2826 < 0.3233

nb objects = 000800
	add = 0.0070 < 0.0080 < 0.0090
	tic = 0.0260 < 0.0274 < 0.0355
	view = 0.2980 < 0.3050 < 0.3480

nb objects = 000900
	add = 0.0070 < 0.0080 < 0.0090
	tic = 0.0260 < 0.0274 < 0.0355
	view = 0.3228 < 0.3275 < 0.3728

nb objects = 001000
	add = 0.0070 < 0.0080 < 0.0090
	tic = 0.0260 < 0.0277 < 0.0355
	view = 0.3475 < 0.3516 < 0.3975

.
----------------------------------------------------------------------
Ran 2 tests in 388.151s

OK
SOFTWARE_HOME: /initrd/loopfs/usr/lib/zope/lib/python
INSTANCE_HOME: /mnt/erp5_cd/zope/unit_test
Loading Zope, please stand by ./usr/lib/python2.4/whrandom.py:38: DeprecationWarning: the whrandom module is deprecated; please use the random module
  DeprecationWarning)
../usr/lib/zope/lib/python/Products/CMFMailIn/__init__.py:16: DeprecationWarning: The module, 'Products.CMFCore.CMFCorePermissions' is a deprecated compatiblity alias for 'Products.CMFCore.permissions';  please use the new module instead.
  from Products.CMFCore import utils, CMFCorePermissions
 done (1.650s)

Adding ERP5TypeTestCase user ... 
Adding erp5_portal_46b1242f30d521c53e744f4886ef0be0 ERP5 Site ... done (23.122s)
Adding erp5_base business template ... done (8.936s)
Adding erp5_ui_test business template ... done (5.481s)
Logout ... 
done (50.945s)
Ran Unit test of Performance
objective time to view object form 0.1120 < 0.1216 < 0.1220

.nb objects = 000100
	add = 0.0070 < 0.0080 < 0.0090
	tic = 0.0260 < 0.0274 < 0.0355
	view = 0.1250 < 0.1520 < 0.1750

nb objects = 000200
	add = 0.0070 < 0.0080 < 0.0090
	tic = 0.0260 < 0.0277 < 0.0355
	view = 0.1497 < 0.1687 < 0.1997

nb objects = 000300
	add = 0.0070 < 0.0080 < 0.0090
	tic = 0.0260 < 0.0273 < 0.0355
	view = 0.1744 < 0.1893 < 0.2244

nb objects = 000400
	add = 0.0070 < 0.0080 < 0.0090
	tic = 0.0260 < 0.0273 < 0.0355
	view = 0.1992 < 0.2137 < 0.2492

nb objects = 000500
	add = 0.0070 < 0.0080 < 0.0090
	tic = 0.0260 < 0.0275 < 0.0355
	view = 0.2239 < 0.2365 < 0.2739

nb objects = 000600
	add = 0.0070 < 0.0079 < 0.0090
	tic = 0.0260 < 0.0273 < 0.0355
	view = 0.2486 < 0.2599 < 0.2986

nb objects = 000700
	add = 0.0070 < 0.0079 < 0.0090
	tic = 0.0260 < 0.0279 < 0.0355
	view = 0.2733 < 0.2833 < 0.3233

nb objects = 000800
	add = 0.0070 < 0.0080 < 0.0090
	tic = 0.0260 < 0.0274 < 0.0355
	view = 0.2980 < 0.3053 < 0.3480

nb objects = 000900
	add = 0.0070 < 0.0080 < 0.0090
	tic = 0.0260 < 0.0275 < 0.0355
	view = 0.3228 < 0.3284 < 0.3728

nb objects = 001000
	add = 0.0070 < 0.0079 < 0.0090
	tic = 0.0260 < 0.0275 < 0.0355
	view = 0.3475 < 0.3524 < 0.3975

.
----------------------------------------------------------------------
Ran 2 tests in 388.557s

OK


More information about the Erp5-report mailing list