[Erp5-report] ERP5 r18522: 6 Tests, 0 Errors, 1 Failures

nobody at nexedi.com nobody at nexedi.com
Wed Dec 26 16:40:21 CET 2007


Date : 2007-12-26

Revision: 18522
Ran Unit test of Performance
Ran 2 tests in 388.312s
FAILED (failures=1)

Ran Unit test of Performance
Ran 2 tests in 386.855s
OK

Ran Unit test of Performance
Ran 2 tests in 385.949s
OK

-------------- next part --------------
SOFTWARE_HOME: /initrd/loopfs/usr/lib/zope/lib/python
INSTANCE_HOME: /mnt/erp5_cd/zope/unit_test
Loading Zope, please stand by ./usr/lib/python2.4/whrandom.py:38: DeprecationWarning: the whrandom module is deprecated; please use the random module
  DeprecationWarning)
../usr/lib/zope/lib/python/Products/CMFMailIn/__init__.py:16: DeprecationWarning: The module, 'Products.CMFCore.CMFCorePermissions' is a deprecated compatiblity alias for 'Products.CMFCore.permissions';  please use the new module instead.
  from Products.CMFCore import utils, CMFCorePermissions
 done (2.174s)

Adding ERP5TypeTestCase user ... 
Adding erp5_portal_46b1242f30d521c53e744f4886ef0be0 ERP5 Site ... done (23.628s)
Adding erp5_base business template ... done (9.896s)
Adding erp5_ui_test business template ... done (5.479s)
Logout ... 
done (52.465s)
Ran Unit test of Performance
objective time to view object form 0.1120 < 0.1222 < 0.1220

Fnb objects = 000100
	add = 0.0070 < 0.0082 < 0.0090
	tic = 0.0260 < 0.0270 < 0.0355
	view = 0.1250 < 0.1507 < 0.1750

nb objects = 000200
	add = 0.0070 < 0.0080 < 0.0090
	tic = 0.0260 < 0.0270 < 0.0355
	view = 0.1497 < 0.1664 < 0.1997

nb objects = 000300
	add = 0.0070 < 0.0080 < 0.0090
	tic = 0.0260 < 0.0271 < 0.0355
	view = 0.1744 < 0.1883 < 0.2244

nb objects = 000400
	add = 0.0070 < 0.0081 < 0.0090
	tic = 0.0260 < 0.0271 < 0.0355
	view = 0.1992 < 0.2118 < 0.2492

nb objects = 000500
	add = 0.0070 < 0.0080 < 0.0090
	tic = 0.0260 < 0.0273 < 0.0355
	view = 0.2239 < 0.2345 < 0.2739

nb objects = 000600
	add = 0.0070 < 0.0080 < 0.0090
	tic = 0.0260 < 0.0272 < 0.0355
	view = 0.2486 < 0.2582 < 0.2986

nb objects = 000700
	add = 0.0070 < 0.0080 < 0.0090
	tic = 0.0260 < 0.0275 < 0.0355
	view = 0.2733 < 0.2810 < 0.3233

nb objects = 000800
	add = 0.0070 < 0.0081 < 0.0090
	tic = 0.0260 < 0.0272 < 0.0355
	view = 0.2980 < 0.3033 < 0.3480

nb objects = 000900
	add = 0.0070 < 0.0080 < 0.0090
	tic = 0.0260 < 0.0272 < 0.0355
	view = 0.3228 < 0.3268 < 0.3728

nb objects = 001000
	add = 0.0070 < 0.0080 < 0.0090
	tic = 0.0260 < 0.0274 < 0.0355
	view = 0.3475 < 0.3512 < 0.3975

.
======================================================================
FAIL: test_00_viewBarObject (testPerformance.TestPerformance)
----------------------------------------------------------------------
Traceback (most recent call last):
  File "/usr/lib/zope/lib/python/Testing/ZopeTestCase/profiler.py", line 80, in __call__
    testMethod()
  File "/mnt/erp5_cd/zope/Products/ERP5Type/tests/testPerformance.py", line 129, in test_00_viewBarObject
    prefix='objective')
  File "/mnt/erp5_cd/zope/Products/ERP5Type/tests/testPerformance.py", line 117, in checkViewBarObject
    '%.4f < %.4f < %.4f' % (min, req_time, max))
AssertionError: 0.1120 < 0.1222 < 0.1220

----------------------------------------------------------------------
Ran 2 tests in 388.312s

FAILED (failures=1)
SOFTWARE_HOME: /initrd/loopfs/usr/lib/zope/lib/python
INSTANCE_HOME: /mnt/erp5_cd/zope/unit_test
Loading Zope, please stand by ./usr/lib/python2.4/whrandom.py:38: DeprecationWarning: the whrandom module is deprecated; please use the random module
  DeprecationWarning)
../usr/lib/zope/lib/python/Products/CMFMailIn/__init__.py:16: DeprecationWarning: The module, 'Products.CMFCore.CMFCorePermissions' is a deprecated compatiblity alias for 'Products.CMFCore.permissions';  please use the new module instead.
  from Products.CMFCore import utils, CMFCorePermissions
 done (1.648s)

Adding ERP5TypeTestCase user ... 
Adding erp5_portal_46b1242f30d521c53e744f4886ef0be0 ERP5 Site ... done (23.172s)
Adding erp5_base business template ... done (8.923s)
Adding erp5_ui_test business template ... done (5.484s)
Logout ... 
done (50.945s)
Ran Unit test of Performance
objective time to view object form 0.1120 < 0.1218 < 0.1220

.nb objects = 000100
	add = 0.0070 < 0.0081 < 0.0090
	tic = 0.0260 < 0.0271 < 0.0355
	view = 0.1250 < 0.1504 < 0.1750

nb objects = 000200
	add = 0.0070 < 0.0081 < 0.0090
	tic = 0.0260 < 0.0273 < 0.0355
	view = 0.1497 < 0.1665 < 0.1997

nb objects = 000300
	add = 0.0070 < 0.0080 < 0.0090
	tic = 0.0260 < 0.0271 < 0.0355
	view = 0.1744 < 0.1878 < 0.2244

nb objects = 000400
	add = 0.0070 < 0.0080 < 0.0090
	tic = 0.0260 < 0.0274 < 0.0355
	view = 0.1992 < 0.2119 < 0.2492

nb objects = 000500
	add = 0.0070 < 0.0082 < 0.0090
	tic = 0.0260 < 0.0272 < 0.0355
	view = 0.2239 < 0.2343 < 0.2739

nb objects = 000600
	add = 0.0070 < 0.0081 < 0.0090
	tic = 0.0260 < 0.0275 < 0.0355
	view = 0.2486 < 0.2575 < 0.2986

nb objects = 000700
	add = 0.0070 < 0.0080 < 0.0090
	tic = 0.0260 < 0.0274 < 0.0355
	view = 0.2733 < 0.2812 < 0.3233

nb objects = 000800
	add = 0.0070 < 0.0081 < 0.0090
	tic = 0.0260 < 0.0272 < 0.0355
	view = 0.2980 < 0.3034 < 0.3480

nb objects = 000900
	add = 0.0070 < 0.0081 < 0.0090
	tic = 0.0260 < 0.0273 < 0.0355
	view = 0.3228 < 0.3266 < 0.3728

nb objects = 001000
	add = 0.0070 < 0.0080 < 0.0090
	tic = 0.0260 < 0.0276 < 0.0355
	view = 0.3475 < 0.3508 < 0.3975

.
----------------------------------------------------------------------
Ran 2 tests in 386.855s

OK
SOFTWARE_HOME: /initrd/loopfs/usr/lib/zope/lib/python
INSTANCE_HOME: /mnt/erp5_cd/zope/unit_test
Loading Zope, please stand by ./usr/lib/python2.4/whrandom.py:38: DeprecationWarning: the whrandom module is deprecated; please use the random module
  DeprecationWarning)
../usr/lib/zope/lib/python/Products/CMFMailIn/__init__.py:16: DeprecationWarning: The module, 'Products.CMFCore.CMFCorePermissions' is a deprecated compatiblity alias for 'Products.CMFCore.permissions';  please use the new module instead.
  from Products.CMFCore import utils, CMFCorePermissions
 done (1.639s)

Adding ERP5TypeTestCase user ... 
Adding erp5_portal_46b1242f30d521c53e744f4886ef0be0 ERP5 Site ... done (23.038s)
Adding erp5_base business template ... done (8.914s)
Adding erp5_ui_test business template ... done (5.468s)
Logout ... 
done (50.767s)
Ran Unit test of Performance
objective time to view object form 0.1120 < 0.1220 < 0.1220

.nb objects = 000100
	add = 0.0070 < 0.0080 < 0.0090
	tic = 0.0260 < 0.0271 < 0.0355
	view = 0.1250 < 0.1504 < 0.1750

nb objects = 000200
	add = 0.0070 < 0.0079 < 0.0090
	tic = 0.0260 < 0.0273 < 0.0355
	view = 0.1497 < 0.1662 < 0.1997

nb objects = 000300
	add = 0.0070 < 0.0079 < 0.0090
	tic = 0.0260 < 0.0272 < 0.0355
	view = 0.1744 < 0.1873 < 0.2244

nb objects = 000400
	add = 0.0070 < 0.0080 < 0.0090
	tic = 0.0260 < 0.0271 < 0.0355
	view = 0.1992 < 0.2115 < 0.2492

nb objects = 000500
	add = 0.0070 < 0.0081 < 0.0090
	tic = 0.0260 < 0.0274 < 0.0355
	view = 0.2239 < 0.2339 < 0.2739

nb objects = 000600
	add = 0.0070 < 0.0080 < 0.0090
	tic = 0.0260 < 0.0273 < 0.0355
	view = 0.2486 < 0.2567 < 0.2986

nb objects = 000700
	add = 0.0070 < 0.0080 < 0.0090
	tic = 0.0260 < 0.0275 < 0.0355
	view = 0.2733 < 0.2802 < 0.3233

nb objects = 000800
	add = 0.0070 < 0.0081 < 0.0090
	tic = 0.0260 < 0.0275 < 0.0355
	view = 0.2980 < 0.3027 < 0.3480

nb objects = 000900
	add = 0.0070 < 0.0080 < 0.0090
	tic = 0.0260 < 0.0271 < 0.0355
	view = 0.3228 < 0.3254 < 0.3728

nb objects = 001000
	add = 0.0070 < 0.0080 < 0.0090
	tic = 0.0260 < 0.0275 < 0.0355
	view = 0.3475 < 0.3497 < 0.3975

.
----------------------------------------------------------------------
Ran 2 tests in 385.949s

OK


More information about the Erp5-report mailing list